[activemq-dev] [continuum] BUILD FAILURE: ServiceMix

classic Classic list List threaded Threaded
1 message Options
Reply | Threaded
Open this post in threaded view
|

[activemq-dev] [continuum] BUILD FAILURE: ServiceMix

Continuum@yami
Build statistics:
  State: Failed
  Previous State: Failed
  Started at: Wed, 24 Aug 2005 07:52:52 -0700
  Finished at: Wed, 24 Aug 2005 07:59:46 -0700
  Total time: 6m 53s
  Forced: true
  Exit code: 70
  Building machine hostname: localhost

Changes
 No files changed

****************************************************************************
Standard Output:
****************************************************************************
 __  __
|  \/  |__ _Apache__ ___
| |\/| / _` \ V / -_) ' \  ~ intelligent projects ~
|_|  |_\__,_|\_/\___|_||_|  v. 1.0.2

build:start:

init:
    [echo] init basedir=/home/existusr/continuum-1.0-alpha-3/apps/continuum/temp/2

default:
multiproject:projects-init:
    [echo] Gathering project list
Starting the reactor...
Our processing order:
ServiceMix
Agila
+----------------------------------------
| Gathering project list ServiceMix
| Memory: 9M/11M
+----------------------------------------
+----------------------------------------
| Gathering project list Agila
| Memory: 9M/11M
+----------------------------------------
Starting the reactor...
Our processing order:
ServiceMix
Agila
+----------------------------------------
| Executing default ServiceMix
| Memory: 10M/11M
+----------------------------------------
Attempting to download drools-all-2.1-SNAPSHOT20050731.jar.
Attempting to download activecluster-1.1-SNAPSHOT.jar.
Attempting to download activesoap-1.0-SNAPSHOT.jar.
Attempting to download xfire-core-1.0-SNAPSHOT.jar.
Attempting to download xfire-aegis-1.0-SNAPSHOT.jar.
Attempting to download xfire-spring-1.0-SNAPSHOT.jar.
Attempting to download yom-1.0-SNAPSHOT.jar.

multiproject:goal:
build:start:

clean:clean:
    [delete] Deleting directory /home/existusr/continuum-1.0-alpha-3/apps/continuum/temp/2/base/target
    [delete] Deleting directory /home/existusr/continuum-1.0-alpha-3/apps/continuum/temp/2/base/ActiveMQ

clean:

java:prepare-filesystem:
    [mkdir] Created dir: /home/existusr/continuum-1.0-alpha-3/apps/continuum/temp/2/base/target/classes

java:compile:
    [echo] Compiling to /home/existusr/continuum-1.0-alpha-3/apps/continuum/temp/2/base/target/classes
    [javac] Compiling 320 source files to /home/existusr/continuum-1.0-alpha-3/apps/continuum/temp/2/base/target/classes

java:jar-resources:
Copying 14 files to /home/existusr/continuum-1.0-alpha-3/apps/continuum/temp/2/base/target/classes
Copied 1 empty directory to /home/existusr/continuum-1.0-alpha-3/apps/continuum/temp/2/base/target/classes

test:prepare-filesystem:
    [mkdir] Created dir: /home/existusr/continuum-1.0-alpha-3/apps/continuum/temp/2/base/target/test-classes
    [mkdir] Created dir: /home/existusr/continuum-1.0-alpha-3/apps/continuum/temp/2/base/target/test-reports

test:test-resources:
Copying 77 files to /home/existusr/continuum-1.0-alpha-3/apps/continuum/temp/2/base/target/test-classes
Copying 7 files to /home/existusr/continuum-1.0-alpha-3/apps/continuum/temp/2/base/target/test-classes
Copying 2 files to /home/existusr/continuum-1.0-alpha-3/apps/continuum/temp/2/base/target/test-classes

test:compile:
    [javac] Compiling 90 source files to /home/existusr/continuum-1.0-alpha-3/apps/continuum/temp/2/base/target/test-classes

test:test:
    [junit] Running org.servicemix.remoting.RemoteServiceMixClientTest
    [junit] Tests run: 1, Failures: 0, Errors: 0, Time elapsed: 10.17 sec
    [junit] Running org.servicemix.expression.XPathExpressionTest
    [junit] Tests run: 2, Failures: 0, Errors: 0, Time elapsed: 1.338 sec
    [junit] Running org.servicemix.components.jms.JmsBindingTest
    [junit] Tests run: 1, Failures: 0, Errors: 0, Time elapsed: 13.534 sec
    [junit] Running org.servicemix.components.xsql.XSQLTest
    [junit] Tests run: 1, Failures: 0, Errors: 0, Time elapsed: 4.043 sec
    [junit] Running org.servicemix.components.script.GroovyTransformTest
    [junit] Tests run: 1, Failures: 0, Errors: 0, Time elapsed: 6.299 sec
    [junit] Running org.servicemix.components.cache.CacheTest
    [junit] Tests run: 1, Failures: 0, Errors: 0, Time elapsed: 6.524 sec
    [junit] Running org.servicemix.components.file.FileTest
    [junit] Tests run: 1, Failures: 0, Errors: 0, Time elapsed: 3.769 sec
    [junit] Running org.servicemix.components.servicemix.ServiceMixComponent2Test
    [junit] Tests run: 1, Failures: 0, Errors: 0, Time elapsed: 12.222 sec
    [junit] Running org.servicemix.components.servicemix.ServiceMixComponentTest
    [junit] Tests run: 1, Failures: 1, Errors: 0, Time elapsed: 1.626 sec
    [junit] [ERROR] TEST org.servicemix.components.servicemix.ServiceMixComponentTest FAILED
    [junit] Running org.servicemix.components.quartz.QuartzComponentTest
    [junit] Tests run: 1, Failures: 0, Errors: 0, Time elapsed: 6.665 sec
    [junit] Running org.servicemix.components.saaj.SaajTest
    [junit] Tests run: 1, Failures: 0, Errors: 1, Time elapsed: 2.954 sec
    [junit] [ERROR] TEST org.servicemix.components.saaj.SaajTest FAILED
    [junit] Running org.servicemix.components.drools.DroolsWithJbiRulesTest
    [junit] Tests run: 1, Failures: 0, Errors: 0, Time elapsed: 3.258 sec
    [junit] Running org.servicemix.components.drools.DroolsTest
    [junit] Tests run: 1, Failures: 0, Errors: 0, Time elapsed: 3.639 sec
    [junit] Running org.servicemix.components.xfire.XFireOutBindingTest
    [junit] Tests run: 1, Failures: 1, Errors: 0, Time elapsed: 6.84 sec
    [junit] [ERROR] TEST org.servicemix.components.xfire.XFireOutBindingTest FAILED
    [junit] Running org.servicemix.components.xfire.XFireBindingTest
    [junit] Tests run: 1, Failures: 0, Errors: 1, Time elapsed: 3.056 sec
    [junit] [ERROR] TEST org.servicemix.components.xfire.XFireBindingTest FAILED
    [junit] Running org.servicemix.components.wsif.WsifTest
    [junit] Tests run: 3, Failures: 0, Errors: 1, Time elapsed: 13.727 sec
    [junit] [ERROR] TEST org.servicemix.components.wsif.WsifTest FAILED
    [junit] Running org.servicemix.components.http.HttpTest
    [junit] Tests run: 1, Failures: 0, Errors: 1, Time elapsed: 3.996 sec
    [junit] [ERROR] TEST org.servicemix.components.http.HttpTest FAILED
    [junit] Running org.servicemix.components.email.SimpleMailTest
    [junit] Tests run: 2, Failures: 0, Errors: 0, Time elapsed: 2.988 sec
    [junit] Running org.servicemix.components.email.MimeMailTest
    [junit] Tests run: 2, Failures: 0, Errors: 0, Time elapsed: 3.235 sec
    [junit] Running org.servicemix.components.groovy.GroovyTest
    [junit] Tests run: 1, Failures: 0, Errors: 0, Time elapsed: 5.186 sec
    [junit] Running org.servicemix.components.vfs.FileTest
    [junit] Tests run: 1, Failures: 0, Errors: 0, Time elapsed: 3.982 sec
    [junit] Running org.servicemix.components.xslt.XsltRouterTest
    [junit] Tests run: 1, Failures: 0, Errors: 0, Time elapsed: 6.638 sec
    [junit] Running org.servicemix.components.xslt.TransformComponentTest
    [junit] Tests run: 1, Failures: 0, Errors: 0, Time elapsed: 10.987 sec
    [junit] Running org.servicemix.components.jca.JmsOverJcaWithXATest
    [junit] Tests run: 1, Failures: 0, Errors: 0, Time elapsed: 9.274 sec
    [junit] Running org.servicemix.components.jca.JmsOverJcaTest
    [junit] Tests run: 1, Failures: 0, Errors: 0, Time elapsed: 9.239 sec
    [junit] Running org.servicemix.components.pojo.MorePojoTest
    [junit] Tests run: 1, Failures: 0, Errors: 0, Time elapsed: 2.573 sec
    [junit] Running org.servicemix.components.pojo.PojoTest
    [junit] Tests run: 1, Failures: 0, Errors: 0, Time elapsed: 2.501 sec
    [junit] Running org.servicemix.jbi.jndi.JNDITest
    [junit] Tests run: 2, Failures: 0, Errors: 0, Time elapsed: 1.139 sec
    [junit] Running org.servicemix.jbi.jndi.DefaultContextTest
    [junit] Tests run: 3, Failures: 0, Errors: 0, Time elapsed: 0.238 sec
    [junit] Running org.servicemix.jbi.config.SpringConfigTest
    [junit] Tests run: 1, Failures: 0, Errors: 0, Time elapsed: 5.112 sec
    [junit] Running org.servicemix.jbi.config.ContainerRouteWithVanillaSpringTest
    [junit] Tests run: 1, Failures: 0, Errors: 0, Time elapsed: 5.737 sec
    [junit] Running org.servicemix.jbi.config.ContainerRouteTest
    [junit] Tests run: 1, Failures: 0, Errors: 0, Time elapsed: 6.118 sec
    [junit] Running org.servicemix.jbi.config.ComponentRouteWithVanillaSpringTest
    [junit] Tests run: 1, Failures: 0, Errors: 0, Time elapsed: 6.288 sec
    [junit] Running org.servicemix.jbi.config.ComponentRouteTest
    [junit] Tests run: 1, Failures: 0, Errors: 0, Time elapsed: 6.176 sec
    [junit] Running org.servicemix.jbi.installation.ComponentAssemblyInstallationTest
    [junit] Tests run: 2, Failures: 1, Errors: 0, Time elapsed: 11.948 sec
    [junit] [ERROR] TEST org.servicemix.jbi.installation.ComponentAssemblyInstallationTest FAILED
    [junit] Running org.servicemix.jbi.installation.ComponentInstallationTest
    [junit] Tests run: 1, Failures: 1, Errors: 0, Time elapsed: 2.355 sec
    [junit] [ERROR] TEST org.servicemix.jbi.installation.ComponentInstallationTest FAILED
    [junit] Running org.servicemix.jbi.installation.ExplodedComponentInstallationTest
    [junit] Tests run: 1, Failures: 0, Errors: 1, Time elapsed: 2.348 sec
    [junit] [ERROR] TEST org.servicemix.jbi.installation.ExplodedComponentInstallationTest FAILED
    [junit] Running org.servicemix.jbi.installation.InstallationTest
    [junit] Tests run: 1, Failures: 0, Errors: 0, Time elapsed: 11.792 sec
    [junit] Running org.servicemix.jbi.deployment.DeploymentTest
    [junit] Tests run: 1, Failures: 0, Errors: 1, Time elapsed: 0.92 sec
    [junit] [ERROR] TEST org.servicemix.jbi.deployment.DeploymentTest FAILED
    [junit] Running org.servicemix.jbi.deployment.ServiceAssemblyTest
    [junit] Tests run: 1, Failures: 0, Errors: 0, Time elapsed: 0.913 sec
    [junit] Running org.servicemix.jbi.deployment.SharedLibraryTest
    [junit] Tests run: 1, Failures: 0, Errors: 0, Time elapsed: 0.815 sec
    [junit] Running org.servicemix.jbi.management.ManagementContextTest
    [junit] Tests run: 1, Failures: 0, Errors: 0, Time elapsed: 2.017 sec
    [junit] Running org.servicemix.jbi.management.ManagementAttributesTest
    [junit] Tests run: 1, Failures: 0, Errors: 0, Time elapsed: 2.842 sec
    [junit] Running org.servicemix.jbi.management.task.JbiTaskTest
    [junit] Tests run: 3, Failures: 0, Errors: 0, Time elapsed: 2.449 sec
    [junit] Running org.servicemix.jbi.management.task.InstallComponentTaskTest
    [junit] Tests run: 1, Failures: 0, Errors: 0, Time elapsed: 2.018 sec
    [junit] Running org.servicemix.jbi.nmr.flow.jms.JMSFlowTest
    [junit] Tests run: 1, Failures: 0, Errors: 0, Time elapsed: 18.355 sec
    [junit] Running org.servicemix.jbi.nmr.flow.seda.SedaFlowTest
    [junit] Tests run: 1, Failures: 0, Errors: 0, Time elapsed: 2.121 sec
    [junit] Running org.servicemix.jbi.nmr.flow.st.STFlowTest
    [junit] Tests run: 1, Failures: 0, Errors: 0, Time elapsed: 2.123 sec
    [junit] Running org.servicemix.client.ServiceMixClientTest
    [junit] Tests run: 11, Failures: 0, Errors: 0, Time elapsed: 33.078 sec
    [junit] Running org.servicemix.client.SimpleClientTest
    [junit] Tests run: 1, Failures: 0, Errors: 0, Time elapsed: 1.513 sec
    [junit] Running org.servicemix.examples.SpringComponentTest
    [junit] Tests run: 1, Failures: 0, Errors: 0, Time elapsed: 3.334 sec
    [junit] Running org.servicemix.examples.SpringAsyncPojoTest
    [junit] Tests run: 1, Failures: 0, Errors: 0, Time elapsed: 2.267 sec
    [junit] Running org.servicemix.examples.ExamplePojoTest
    [junit] Tests run: 1, Failures: 0, Errors: 0, Time elapsed: 2.125 sec
    [junit] Running org.servicemix.examples.SpringPojoTest
    [junit] Tests run: 1, Failures: 0, Errors: 0, Time elapsed: 2.237 sec
Total time: 6 minutes 52 seconds
Finished at: Wed Aug 24 07:59:46 PDT 2005


****************************************************************************

****************************************************************************
Standard Error:
****************************************************************************
/home/existusr/continuum-1.0-alpha-3/apps/continuum/temp/2/base/src/main/java/org/servicemix/expression/MessageVariableResolver.java:71: warning: getenv(java.lang.String) in java.lang.System has been deprecated
            answer = System.getProperty(System.getenv(localPart));
                                              ^
/home/existusr/continuum-1.0-alpha-3/apps/continuum/temp/2/base/src/main/java/org/servicemix/expression/JaxenVariableContext.java:94: warning: getenv(java.lang.String) in java.lang.System has been deprecated
            answer = System.getProperty(System.getenv(localPart));
                                              ^
2 warnings

BUILD FAILED
File...... /home/existusr/.maven/cache/maven-multiproject-plugin-1.3.1/plugin.jelly
Element... maven:reactor
Line...... 217
Column.... 9
Unable to obtain goal [test:test] -- /home/existusr/.maven/cache/maven-test-plugin-1.6.2/plugin.jelly:181:54: <fail> There were test failures.

****************************************************************************