[activemq-dev] [continuum] BUILD FAILURE: ActiveMQ

classic Classic list List threaded Threaded
1 message Options
Reply | Threaded
Open this post in threaded view
|

[activemq-dev] [continuum] BUILD FAILURE: ActiveMQ

Continuum@yami
Build statistics:
  State: Failed
  Previous State: Failed
  Started at: Sun, 7 Aug 2005 18:36:33 -0700
  Finished at: Sun, 7 Aug 2005 18:58:00 -0700
  Total time: 21m 26s
  Forced: false
  Exit code: 70
  Building machine hostname: localhost

Changes
  * modules/core/src/test/org/activemq/transport/ttmp/TTMPWireFormatTest.java
  * modules/core/src/test/org/activemq/transport/jabber/JabberTransportTest.java
  * modules/core/src/java/org/activemq/transport/ttmp/CommandLineParser.java
  * modules/core/src/java/org/activemq/transport/ttmp/TTMP.java
  * modules/core/src/java/org/activemq/transport/ttmp/TTMPWireFormat.java
  * modules/core/src/java/org/activemq/transport/ttmp/Command.java
 
****************************************************************************
Standard Output:
****************************************************************************
 __  __
|  \/  |__ _Apache__ ___
| |\/| / _` \ V / -_) ' \  ~ intelligent projects ~
|_|  |_\__,_|\_/\___|_||_|  v. 1.0.2

Tag library requested that is not present: 'local:modules' in plugin: 'null'
build:start:

nightly-build:
    [echo] Cleaning the directory
Tag library requested that is not present: 'local:modules' in plugin: 'null'
init:

clean:
    [echo] +----------------------------------------
    [echo] | Cleaning: /home/existusr/continuum-1.0-alpha-3/apps/continuum/temp/1/modules/web
    [echo] +----------------------------------------
    [delete] Deleting directory /home/existusr/continuum-1.0-alpha-3/apps/continuum/temp/1/modules/web/target
    [echo]
    [echo] +----------------------------------------
    [echo] | Cleaning: /home/existusr/continuum-1.0-alpha-3/apps/continuum/temp/1/modules/container
    [echo] +----------------------------------------
    [echo]
    [echo] +----------------------------------------
    [echo] | Cleaning: /home/existusr/continuum-1.0-alpha-3/apps/continuum/temp/1/modules/gbean
    [echo] +----------------------------------------
    [echo]
    [echo] +----------------------------------------
    [echo] | Cleaning: /home/existusr/continuum-1.0-alpha-3/apps/continuum/temp/1/modules/optional
    [echo] +----------------------------------------
    [delete] Deleting directory /home/existusr/continuum-1.0-alpha-3/apps/continuum/temp/1/modules/optional/target
    [echo]
    [echo] +----------------------------------------
    [echo] | Cleaning: /home/existusr/continuum-1.0-alpha-3/apps/continuum/temp/1/modules/ra
    [echo] +----------------------------------------
    [echo]
    [echo] +----------------------------------------
    [echo] | Cleaning: /home/existusr/continuum-1.0-alpha-3/apps/continuum/temp/1/modules/assembly
    [echo] +----------------------------------------
    [echo]
    [echo] +----------------------------------------
    [echo] | Cleaning: /home/existusr/continuum-1.0-alpha-3/apps/continuum/temp/1/modules/core
    [echo] +----------------------------------------
    [delete] Deleting directory /home/existusr/continuum-1.0-alpha-3/apps/continuum/temp/1/modules/core/target
    [echo]

    [echo] Compiling the codes
Tag library requested that is not present: 'local:modules' in plugin: 'null'
init:

default:
multiproject:projects-init:
    [echo] Gathering project list
Starting the reactor...
Our processing order:
ActiveMQ :: Core
ActiveMQ :: Web
ActiveMQ :: Optional
ActiveMQ :: Resource Adapter
ActiveMQ :: Container
ActiveMQ :: GBeans
ActiveMQ :: Assembly
+----------------------------------------
| Gathering project list ActiveMQ :: Core
| Memory: 11M/13M
+----------------------------------------
+----------------------------------------
| Gathering project list ActiveMQ :: Web
| Memory: 11M/13M
+----------------------------------------
+----------------------------------------
| Gathering project list ActiveMQ :: Optional
| Memory: 11M/13M
+----------------------------------------
+----------------------------------------
| Gathering project list ActiveMQ :: Resource Adapter
| Memory: 11M/13M
+----------------------------------------
+----------------------------------------
| Gathering project list ActiveMQ :: Container
| Memory: 11M/13M
+----------------------------------------
+----------------------------------------
| Gathering project list ActiveMQ :: GBeans
| Memory: 11M/13M
+----------------------------------------
+----------------------------------------
| Gathering project list ActiveMQ :: Assembly
| Memory: 11M/13M
+----------------------------------------
Starting the reactor...
Our processing order:
ActiveMQ :: Core
ActiveMQ :: Web
ActiveMQ :: Optional
ActiveMQ :: Resource Adapter
ActiveMQ :: Container
ActiveMQ :: GBeans
ActiveMQ :: Assembly
+----------------------------------------
| Executing default ActiveMQ :: Core
| Memory: 11M/13M
+----------------------------------------
Attempting to download activecluster-1.1-SNAPSHOT.jar.

multiproject:goal:
build:start:

java:prepare-filesystem:
    [mkdir] Created dir: /home/existusr/continuum-1.0-alpha-3/apps/continuum/temp/1/modules/core/target/classes

java:compile:
    [depend] Deleted 0 out of date files in 0 seconds
    [echo] Compiling to /home/existusr/continuum-1.0-alpha-3/apps/continuum/temp/1/modules/core/target/classes
    [javac] Compiling 479 source files to /home/existusr/continuum-1.0-alpha-3/apps/continuum/temp/1/modules/core/target/classes

java:jar-resources:
Copying 34 files to /home/existusr/continuum-1.0-alpha-3/apps/continuum/temp/1/modules/core/target/classes

test:prepare-filesystem:
    [mkdir] Created dir: /home/existusr/continuum-1.0-alpha-3/apps/continuum/temp/1/modules/core/target/test-classes
    [mkdir] Created dir: /home/existusr/continuum-1.0-alpha-3/apps/continuum/temp/1/modules/core/target/test-reports

test:test-resources:
Copying 11 files to /home/existusr/continuum-1.0-alpha-3/apps/continuum/temp/1/modules/core/target/test-classes

test:compile:
    [javac] Compiling 201 source files to /home/existusr/continuum-1.0-alpha-3/apps/continuum/temp/1/modules/core/target/test-classes
    [jar] Building jar: /home/existusr/continuum-1.0-alpha-3/apps/continuum/temp/1/modules/core/target/activemq-core-test-3.1-SNAPSHOT.jar
    [copy] Copying 1 file to /home/existusr/.maven/repository/activemq/jars

test:test:
    [junit] Running org.activemq.JmsQueueTransactionTest
    [junit] Tests run: 11, Failures: 0, Errors: 0, Time elapsed: 49.442 sec
    [junit] Running org.activemq.security.jassjacc.PropertiesConfigLoaderTest
    [junit] Tests run: 1, Failures: 0, Errors: 0, Time elapsed: 0.249 sec
    [junit] Running org.activemq.EmbeddedBrokerTest
    [junit] Tests run: 2, Failures: 0, Errors: 0, Time elapsed: 5.955 sec
    [junit] Running org.activemq.ConnectionCleanupTest
    [junit] Tests run: 1, Failures: 0, Errors: 0, Time elapsed: 6.006 sec
    [junit] Running org.activemq.jndi.InitialContextTest
    [junit] Tests run: 2, Failures: 0, Errors: 0, Time elapsed: 0.903 sec
    [junit] Running org.activemq.jndi.AdminObjectTest
    [junit] Tests run: 1, Failures: 0, Errors: 0, Time elapsed: 0.223 sec
    [junit] Running org.activemq.jndi.DestinationNameWithSlashTest
    [junit] Tests run: 1, Failures: 0, Errors: 0, Time elapsed: 4.326 sec
    [junit] Running org.activemq.jndi.CustomConnectionFactoryNameTest
    [junit] Tests run: 4, Failures: 0, Errors: 0, Time elapsed: 5.965 sec
    [junit] Running org.activemq.jndi.ActiveMQInitialContextFactoryTest
    [junit] Tests run: 3, Failures: 0, Errors: 0, Time elapsed: 5.537 sec
    [junit] Running org.activemq.CompressionMessageTest
    [junit] Tests run: 1, Failures: 0, Errors: 0, Time elapsed: 11.836 sec
    [junit] Running org.activemq.JmsTopicTransactionTest
    [junit] Tests run: 8, Failures: 0, Errors: 0, Time elapsed: 33.213 sec
    [junit] Running org.activemq.filter.DestinationPathTest
    [junit] Tests run: 1, Failures: 0, Errors: 0, Time elapsed: 0.181 sec
    [junit] Running org.activemq.filter.MultiExpressionEvaluatorTest
    [junit] Tests run: 3, Failures: 0, Errors: 0, Time elapsed: 1.639 sec
    [junit] Running org.activemq.filter.DestinationMapTest
    [junit] Tests run: 8, Failures: 0, Errors: 0, Time elapsed: 0.245 sec
    [junit] Running org.activemq.filter.DestinationFilterTest
    [junit] Tests run: 9, Failures: 0, Errors: 0, Time elapsed: 0.187 sec
    [junit] Running org.activemq.JmsDurableTopicWildcardSendReceiveTest
    [junit] Tests run: 1, Failures: 0, Errors: 0, Time elapsed: 7.883 sec
    [junit] Running org.activemq.advisories.TempDestinationAdvisorTest
    [junit] Tests run: 1, Failures: 0, Errors: 0, Time elapsed: 19.223 sec
    [junit] Running org.activemq.advisories.ProducerAdvisorTest
    [junit] Tests run: 1, Failures: 0, Errors: 0, Time elapsed: 6.224 sec
    [junit] Running org.activemq.advisories.ProducerDemandAdvisorTest
    [junit] Tests run: 2, Failures: 0, Errors: 0, Time elapsed: 8.374 sec
    [junit] Running org.activemq.advisories.ConnectionAdvisorTest
    [junit] Tests run: 1, Failures: 0, Errors: 0, Time elapsed: 6.159 sec
    [junit] Running org.activemq.advisories.ConsumerAdvisorTest
    [junit] Tests run: 1, Failures: 0, Errors: 0, Time elapsed: 6.238 sec
    [junit] Running org.activemq.JmsQueueWildcardSendReceiveTest
    [junit] Tests run: 1, Failures: 0, Errors: 0, Time elapsed: 6.391 sec
    [junit] Running org.activemq.JmsDurableQueueWildcardSendReceiveTest
    [junit] Tests run: 1, Failures: 0, Errors: 0, Time elapsed: 8.083 sec
    [junit] Running org.activemq.JmsSessionRecoverTest
    [junit] Tests run: 6, Failures: 0, Errors: 0, Time elapsed: 17.976 sec
    [junit] Running org.activemq.JmsQueueXATransactionTest
    [junit] Tests run: 4, Failures: 0, Errors: 0, Time elapsed: 17.189 sec
    [junit] Running org.activemq.ActiveMQMessageAuditTest
    [junit] Tests run: 1, Failures: 0, Errors: 0, Time elapsed: 0.894 sec
    [junit] Running org.activemq.JmsQueueSendReceiveTwoConnectionsTest
    [junit] Tests run: 1, Failures: 0, Errors: 0, Time elapsed: 7.238 sec
    [junit] Running org.activemq.FragmentPersistentQueueTest
    [junit] Tests run: 1, Failures: 0, Errors: 0, Time elapsed: 15.742 sec
    [junit] Running org.activemq.test.JmsTopicSendReceiveWithTwoConnectionsTest
    [junit] Tests run: 1, Failures: 0, Errors: 0, Time elapsed: 8.331 sec
    [junit] Running org.activemq.test.QueueSendReceiveTest
    [junit] Tests run: 2, Failures: 0, Errors: 0, Time elapsed: 9.312 sec
    [junit] Running org.activemq.test.SendReceiveTest
    [junit] Tests run: 2, Failures: 0, Errors: 0, Time elapsed: 8.653 sec
    [junit] Running org.activemq.test.RollbackTest
    [junit] Tests run: 1, Failures: 0, Errors: 0, Time elapsed: 7.068 sec
    [junit] Running org.activemq.test.JmsTopicSendReceiveTest
    [junit] Tests run: 1, Failures: 0, Errors: 0, Time elapsed: 6.837 sec
    [junit] Running org.activemq.streams.JMSInputStreamTest
    [junit] Tests run: 2, Failures: 0, Errors: 0, Time elapsed: 12.857 sec
    [junit] Running org.activemq.util.IdGeneratorTest
    [junit] Tests run: 4, Failures: 0, Errors: 0, Time elapsed: 1.579 sec
    [junit] Running org.activemq.util.ReflectionSupportTest
    [junit] Tests run: 1, Failures: 0, Errors: 0, Time elapsed: 0.557 sec
    [junit] Running org.activemq.util.BitArrayBinTest
    [junit] Tests run: 2, Failures: 0, Errors: 0, Time elapsed: 0.183 sec
    [junit] Running org.activemq.util.JmsLogAppenderTest
    [junit] Tests run: 1, Failures: 0, Errors: 0, Time elapsed: 0.178 sec
    [junit] Running org.activemq.util.BitArrayTest
    [junit] Tests run: 4, Failures: 0, Errors: 0, Time elapsed: 0.522 sec
    [junit] Running org.activemq.util.AsyncProxyTest
    [junit] Tests run: 1, Failures: 0, Errors: 0, Time elapsed: 6.596 sec
    [junit] Running org.activemq.util.URIHelperTest
    [junit] Tests run: 3, Failures: 0, Errors: 0, Time elapsed: 0.188 sec
    [junit] Running org.activemq.broker.impl.AdvisorySupportTest
    [junit] Tests run: 3, Failures: 0, Errors: 0, Time elapsed: 0.753 sec
    [junit] Running org.activemq.broker.BrokerAdminTest
    [junit] Tests run: 3, Failures: 0, Errors: 0, Time elapsed: 7.211 sec
    [junit] Running org.activemq.JmsDurableTopicSendReceiveTest
    [junit] Tests run: 1, Failures: 0, Errors: 0, Time elapsed: 11.294 sec
    [junit] Running org.activemq.JmsTopicSendReceiveWithTwoConnectionsTest
    [junit] Tests run: 1, Failures: 0, Errors: 0, Time elapsed: 8.283 sec
    [junit] Running org.activemq.JmsQueueRequestReplyTest
    [junit] Tests run: 2, Failures: 0, Errors: 0, Time elapsed: 14.95 sec
    [junit] Running org.activemq.service.TransientQueueGarbageCollectionTest
    [junit] Tests run: 2, Failures: 0, Errors: 0, Time elapsed: 4.675 sec
    [junit] Running org.activemq.service.impl.LocalTransactionCommandTest
    [junit] Tests run: 1, Failures: 0, Errors: 0, Time elapsed: 0.177 sec
    [junit] Running org.activemq.service.impl.DefaultQueueListTest
    [junit] Tests run: 5, Failures: 0, Errors: 0, Time elapsed: 0.192 sec
    [junit] Running org.activemq.service.impl.XATransactionCommandTest
    [junit] Tests run: 1, Failures: 0, Errors: 0, Time elapsed: 0.18 sec
    [junit] Running org.activemq.service.impl.XATransactionTest
    [junit] Tests run: 1, Failures: 0, Errors: 0, Time elapsed: 0.185 sec
    [junit] Running org.activemq.service.SimpleQueueBrokerTest
    [junit] Tests run: 1, Failures: 0, Errors: 0, Time elapsed: 5.782 sec
    [junit] Running org.activemq.service.TopicBrokerTest
    [junit] Tests run: 1, Failures: 0, Errors: 0, Time elapsed: 5.269 sec
    [junit] Running org.activemq.service.SimpleTopicBrokerTest
    [junit] Tests run: 1, Failures: 0, Errors: 0, Time elapsed: 5.544 sec
    [junit] Running org.activemq.service.AsyncSimpleBrokerTest
    [junit] Tests run: 1, Failures: 0, Errors: 0, Time elapsed: 4.68 sec
    [junit] Running org.activemq.service.QueueBrokerTest
    [junit] Tests run: 1, Failures: 0, Errors: 0, Time elapsed: 5.063 sec
    [junit] Running org.activemq.JmsDurableSubscriptionTest
    [junit] Tests run: 1, Failures: 0, Errors: 0, Time elapsed: 4.452 sec
    [junit] Running org.activemq.JmsDurableTopicTransactionTest
    [junit] Tests run: 8, Failures: 0, Errors: 0, Time elapsed: 34.309 sec
    [junit] Running org.activemq.JmsTopicWildcardSendReceiveTest
    [junit] Tests run: 1, Failures: 0, Errors: 0, Time elapsed: 7.755 sec
    [junit] Running org.activemq.JmsTopicSendSameMessageTest
    [junit] Tests run: 1, Failures: 0, Errors: 0, Time elapsed: 8.098 sec
    [junit] Running org.activemq.message.ActiveMQMapMessageTest
    [junit] Tests run: 29, Failures: 0, Errors: 0, Time elapsed: 0.214 sec
    [junit] Running org.activemq.message.ActiveMQBytesMessageTest
    [junit] Tests run: 18, Failures: 0, Errors: 0, Time elapsed: 0.232 sec
    [junit] Running org.activemq.message.ActiveMQStreamMessageTest
    [junit] Tests run: 15, Failures: 0, Errors: 0, Time elapsed: 0.221 sec
    [junit] Running org.activemq.message.SessionInfoTest
    [junit] Tests run: 4, Failures: 0, Errors: 0, Time elapsed: 0.154 sec
    [junit] Running org.activemq.message.ActiveMQDestinationTest
    [junit] Tests run: 10, Failures: 0, Errors: 0, Time elapsed: 0.192 sec
    [junit] Running org.activemq.message.ActiveMQTextMessageTest
    [junit] Tests run: 3, Failures: 0, Errors: 0, Time elapsed: 0.179 sec
    [junit] Running org.activemq.message.ActiveMQObjectMessageTest
    [junit] Tests run: 2, Failures: 0, Errors: 0, Time elapsed: 0.228 sec
    [junit] Running org.activemq.message.ActiveMQMessageTest
    [junit] Tests run: 51, Failures: 0, Errors: 0, Time elapsed: 0.264 sec
    [junit] Running org.activemq.message.PackageFacadeTest
    [junit] Tests run: 2, Failures: 0, Errors: 0, Time elapsed: 0.669 sec
    [junit] Running org.activemq.message.ActiveMQXidTest
    [junit] Tests run: 1, Failures: 0, Errors: 0, Time elapsed: 0.584 sec
    [junit] Running org.activemq.spring.SpringTest
    [junit] Tests run: 5, Failures: 0, Errors: 0, Time elapsed: 21.501 sec
    [junit] Running org.activemq.JmsQueueSendReceiveUsingTwoSessionsTest
    [junit] Tests run: 1, Failures: 0, Errors: 0, Time elapsed: 7.549 sec
    [junit] Running org.activemq.JmsCreateConsumerInOnMessageTest
    [junit] Tests run: 1, Failures: 0, Errors: 0, Time elapsed: 6.652 sec
    [junit] Running org.activemq.JmsTempDestinationTest
    [junit] Tests run: 6, Failures: 0, Errors: 0, Time elapsed: 22.073 sec
    [junit] Running org.activemq.store.jdbc.JDBCTopicMessageContainerTest
    [junit] Tests run: 1, Failures: 0, Errors: 0, Time elapsed: 6.071 sec
    [junit] Running org.activemq.store.jdbc.JDBCQueueMessageContainerTest
    [junit] Tests run: 1, Failures: 0, Errors: 0, Time elapsed: 5.645 sec
    [junit] Running org.activemq.store.jdbc.JDBCQueueMessageStoreTest
    [junit] Tests run: 2, Failures: 0, Errors: 0, Time elapsed: 7.796 sec
    [junit] Running org.activemq.store.jdbc.PersistenceAdapterTest
    [junit] Tests run: 1, Failures: 0, Errors: 0, Time elapsed: 5.323 sec
    [junit] Running org.activemq.store.journal.JournalQueueMessageContainerTest
    [junit] Tests run: 1, Failures: 0, Errors: 0, Time elapsed: 0.546 sec
    [junit] Running org.activemq.store.journal.JournalTopicMessageContainerTest
    [junit] Tests run: 1, Failures: 0, Errors: 0, Time elapsed: 0.53 sec
    [junit] Running org.activemq.store.journal.JournalQueueMessageStoreTest
    [junit] Tests run: 2, Failures: 0, Errors: 0, Time elapsed: 0.667 sec
    [junit] Running org.activemq.store.vm.VMTopicMessageContainerTest
    [junit] Tests run: 1, Failures: 0, Errors: 0, Time elapsed: 0.195 sec
    [junit] Running org.activemq.store.vm.VMQueueMessageContainerTest
    [junit] Tests run: 1, Failures: 0, Errors: 0, Time elapsed: 0.204 sec
    [junit] Running org.activemq.JmsClientAckTest
    [junit] Tests run: 2, Failures: 0, Errors: 0, Time elapsed: 11.903 sec
    [junit] Running org.activemq.JmsTopicRequestReplyTest
    [junit] Tests run: 2, Failures: 0, Errors: 0, Time elapsed: 10.403 sec
    [junit] Running org.activemq.BrokerAdminCommandsTest
    [junit] Tests run: 1, Failures: 0, Errors: 0, Time elapsed: 8.4 sec
    [junit] Running org.activemq.JmsTopicSendReceiveSubscriberTest
    [junit] Tests run: 1, Failures: 0, Errors: 0, Time elapsed: 7.613 sec
    [junit] Running org.activemq.selector.SelectorTest
    [junit] Tests run: 17, Failures: 0, Errors: 0, Time elapsed: 1.181 sec
    [junit] Running org.activemq.selector.SelectorParserTest
    [junit] Tests run: 2, Failures: 0, Errors: 0, Time elapsed: 0.605 sec
    [junit] Running org.activemq.JmsConnectionStartStopTest
    [junit] Tests run: 2, Failures: 0, Errors: 0, Time elapsed: 15.023 sec
    [junit] Running org.activemq.management.RangeStatisticTest
    [junit] Tests run: 1, Failures: 0, Errors: 0, Time elapsed: 0.694 sec
    [junit] Running org.activemq.management.TimeStatisticTest
    [junit] Tests run: 1, Failures: 0, Errors: 0, Time elapsed: 0.69 sec
    [junit] Running org.activemq.management.CountStatisticTest
    [junit] Tests run: 1, Failures: 0, Errors: 0, Time elapsed: 0.694 sec
    [junit] Running org.activemq.management.BoundaryStatisticTest
    [junit] Tests run: 1, Failures: 0, Errors: 0, Time elapsed: 0.179 sec
    [junit] Running org.activemq.management.BoundedRangeStatisticTest
    [junit] Tests run: 1, Failures: 0, Errors: 0, Time elapsed: 0.683 sec
    [junit] Running org.activemq.FragmentTransientQueueTest
    [junit] Tests run: 1, Failures: 0, Errors: 0, Time elapsed: 13.609 sec
    [junit] Running org.activemq.transport.composite.CompositeTransportChannelWithLeadingSlashesTest
    [junit] Tests run: 4, Failures: 0, Errors: 0, Time elapsed: 0.675 sec
    [junit] Running org.activemq.transport.composite.CompositeTransportChannelTest
    [junit] Tests run: 4, Failures: 0, Errors: 0, Time elapsed: 0.609 sec
    [junit] Running org.activemq.transport.jabber.JabberWireFormatTest
    [junit] Tests run: 1, Failures: 0, Errors: 0, Time elapsed: 0.169 sec
    [junit] Running org.activemq.transport.tcp.TcpQueueSendReceiveTwoConnectionsTest
    [junit] Tests run: 1, Failures: 0, Errors: 0, Time elapsed: 6.35 sec
    [junit] Running org.activemq.transport.tcp.TcpTopicSendReceiveTest
    [junit] Tests run: 1, Failures: 0, Errors: 0, Time elapsed: 6.393 sec
    [junit] Running org.activemq.transport.tcp.TcpQueueSendReceiveTest
    [junit] Tests run: 1, Failures: 0, Errors: 0, Time elapsed: 6.592 sec
    [junit] Running org.activemq.transport.tcp.TcpTopicSendReceiveTwoConnectionsTest
    [junit] Tests run: 1, Failures: 0, Errors: 0, Time elapsed: 6.616 sec
    [junit] Running org.activemq.transport.tcp.ExceptionListenerTest
    [junit] Tests run: 1, Failures: 0, Errors: 0, Time elapsed: 5.823 sec
    [junit] Running org.activemq.transport.tcp.TcpTransportChannelTest
    [junit] Tests run: 4, Failures: 0, Errors: 0, Time elapsed: 0.579 sec
    [junit] Running org.activemq.transport.UriParseTest
    [junit] Tests run: 4, Failures: 0, Errors: 0, Time elapsed: 0.268 sec
    [junit] Running org.activemq.transport.reliable.ReliableTransportChannelTest
    [junit] Tests run: 4, Failures: 0, Errors: 0, Time elapsed: 0.601 sec
    [junit] Running org.activemq.transport.reliable.ReliableTransportChannelFactoryTest
    [junit] Tests run: 1, Failures: 0, Errors: 0, Time elapsed: 0.205 sec
    [junit] Running org.activemq.transport.activeio.ActiveIOQueueSendReceiveTest
    [junit] Tests run: 3, Failures: 0, Errors: 0, Time elapsed: 17.263 sec
    [junit] Running org.activemq.transport.activeio.ActiveIOTopicSendReceiveTest
    [junit] Tests run: 2, Failures: 0, Errors: 0, Time elapsed: 23.671 sec
    [junit] Running org.activemq.transport.activeio.URIConverterTest
    [junit] Tests run: 1, Failures: 0, Errors: 0, Time elapsed: 0.188 sec
    [junit] Running org.activemq.transport.activeio.ActiveIOQueueSendReceiveTwoConnectionsTest
    [junit] Tests run: 2, Failures: 0, Errors: 0, Time elapsed: 22.632 sec
    [junit] Running org.activemq.transport.activeio.ActiveIOTopicSendReceiveTwoConnectionsTest
    [junit] Tests run: 3, Failures: 1, Errors: 0, Time elapsed: 51.843 sec
    [junit] [ERROR] TEST org.activemq.transport.activeio.ActiveIOTopicSendReceiveTwoConnectionsTest FAILED
    [junit] Running org.activemq.transport.activeio.ActiveIOTransportChannelTest
    [junit] Tests run: 12, Failures: 0, Errors: 0, Time elapsed: 1.187 sec
    [junit] Running org.activemq.transport.ttmp.TTMPWireFormatTest
    [junit] Tests run: 2, Failures: 0, Errors: 0, Time elapsed: 0.735 sec
    [junit] Running org.activemq.capacity.BasicCapacityMonitorTest
    [junit] Tests run: 1, Failures: 0, Errors: 0, Time elapsed: 0.198 sec
    [junit] Running org.activemq.JmsTopicSendReceiveTest
    [junit] Tests run: 1, Failures: 0, Errors: 0, Time elapsed: 7.734 sec
    [junit] Running org.activemq.JmsRedeliveredTest
    [junit] Tests run: 16, Failures: 0, Errors: 0, Time elapsed: 42.206 sec
    [junit] Running org.activemq.io.impl.ActiveMQMessageReaderTest
    [junit] Tests run: 3, Failures: 0, Errors: 0, Time elapsed: 17.148 sec
    [junit] Running org.activemq.io.impl.TransactionInfoReaderTest
    [junit] Tests run: 7, Failures: 0, Errors: 0, Time elapsed: 0.576 sec
    [junit] Running org.activemq.io.impl.MessageAckReaderTest
    [junit] Tests run: 3, Failures: 0, Errors: 0, Time elapsed: 1.588 sec
    [junit] Running org.activemq.io.impl.ActiveMQTextMessageReaderTest
    [junit] Tests run: 4, Failures: 0, Errors: 0, Time elapsed: 18.193 sec
    [junit] Running org.activemq.io.impl.ProducerInfoReaderTest
    [junit] Tests run: 3, Failures: 0, Errors: 0, Time elapsed: 1.162 sec
    [junit] Running org.activemq.io.impl.ActiveMQMapMessageReaderTest
    [junit] Tests run: 4, Failures: 0, Errors: 0, Time elapsed: 16.807 sec
    [junit] Running org.activemq.io.impl.ActiveMQObjectMessageReaderTest
    [junit] Tests run: 4, Failures: 0, Errors: 0, Time elapsed: 18.325 sec
    [junit] Running org.activemq.io.impl.ActiveMQStreamMessageReaderTest
    [junit] Tests run: 4, Failures: 0, Errors: 0, Time elapsed: 19.153 sec
    [junit] Running org.activemq.io.impl.ReceiptReaderTest
    [junit] Tests run: 7, Failures: 0, Errors: 0, Time elapsed: 0.751 sec
    [junit] Running org.activemq.io.impl.XATransactionInfoReaderTest
    [junit] Tests run: 8, Failures: 0, Errors: 0, Time elapsed: 0.838 sec
    [junit] Running org.activemq.io.impl.DefaultWireFormatTest
    [junit] Tests run: 4, Failures: 0, Errors: 0, Time elapsed: 0.754 sec
    [junit] Running org.activemq.io.impl.ConsumerInfoReaderTest
    [junit] Tests run: 3, Failures: 0, Errors: 0, Time elapsed: 1.713 sec
    [junit] Running org.activemq.io.impl.ActiveMQBytesMessageReaderTest
    [junit] Tests run: 4, Failures: 0, Errors: 0, Time elapsed: 18.07 sec
    [junit] Running org.activemq.io.util.MemoryBoundedMessageCacheTest
    [junit] Tests run: 2, Failures: 0, Errors: 0, Time elapsed: 0.242 sec
    [junit] Running org.activemq.io.util.ByteArrayFragmentationTest
    [junit] Tests run: 1, Failures: 0, Errors: 0, Time elapsed: 2.633 sec
    [junit] Running org.activemq.io.util.ByteArrayCompressionTest
    [junit] Tests run: 1, Failures: 0, Errors: 0, Time elapsed: 0.201 sec
    [junit] Running org.activemq.io.util.MemoryBoundedQueueTest
    [junit] Tests run: 12, Failures: 0, Errors: 0, Time elapsed: 2.037 sec
    [junit] Running org.activemq.io.util.MemoryBoundedPrioritizedQueueTest
    [junit] Tests run: 13, Failures: 0, Errors: 0, Time elapsed: 2.568 sec
    [junit] Running org.activemq.io.WireFormatLoaderTest
    [junit] Tests run: 1, Failures: 0, Errors: 0, Time elapsed: 0.649 sec
    [junit] Running org.activemq.FragmentTopicTest
    [junit] Tests run: 1, Failures: 0, Errors: 0, Time elapsed: 104.123 sec
    [junit] Running org.activemq.JmsQueueSendReceiveTest
    [junit] Tests run: 1, Failures: 0, Errors: 0, Time elapsed: 22.489 sec
Total time: 21 minutes 25 seconds
Finished at: Sun Aug 07 18:58:00 PDT 2005


****************************************************************************

****************************************************************************
Standard Error:
****************************************************************************

BUILD FAILED
File...... /home/existusr/.maven/cache/maven-multiproject-plugin-1.3.1/plugin.jelly
Element... maven:reactor
Line...... 217
Column.... 9
Unable to obtain goal [test:test] -- /home/existusr/.maven/cache/maven-test-plugin-1.6.2/plugin.jelly:181:54: <fail> There were test failures.

****************************************************************************