[activemq-dev] [continuum] BUILD FAILURE: ActiveMQ

classic Classic list List threaded Threaded
1 message Options
Reply | Threaded
Open this post in threaded view
|

[activemq-dev] [continuum] BUILD FAILURE: ActiveMQ

Continuum@yami
Build statistics:
  State: Failed
  Previous State: Failed
  Started at: Tue, 2 Aug 2005 19:05:27 -0700
  Finished at: Tue, 2 Aug 2005 19:27:12 -0700
  Total time: 21m 44s
  Forced: false
  Exit code: 70
  Building machine hostname: localhost

Changes
  * jmeter/src/java/org/apache/jmeter/visualizers/ConsumerSysTableVisualizer.java
  * jmeter/src/java/org/activemq/sampler/ConsumerSysTest.java
 
****************************************************************************
Standard Output:
****************************************************************************
 __  __
|  \/  |__ _Apache__ ___
| |\/| / _` \ V / -_) ' \  ~ intelligent projects ~
|_|  |_\__,_|\_/\___|_||_|  v. 1.0.2

Tag library requested that is not present: 'local:modules' in plugin: 'null'
build:start:

nightly-build:
    [echo] Cleaning the directory
Tag library requested that is not present: 'local:modules' in plugin: 'null'
init:

clean:
    [echo] +----------------------------------------
    [echo] | Cleaning: /home/existusr/continuum-1.0-alpha-3/apps/continuum/temp/1/modules/web
    [echo] +----------------------------------------
    [delete] Deleting directory /home/existusr/continuum-1.0-alpha-3/apps/continuum/temp/1/modules/web/target
    [echo]
    [echo] +----------------------------------------
    [echo] | Cleaning: /home/existusr/continuum-1.0-alpha-3/apps/continuum/temp/1/modules/container
    [echo] +----------------------------------------
    [echo]
    [echo] +----------------------------------------
    [echo] | Cleaning: /home/existusr/continuum-1.0-alpha-3/apps/continuum/temp/1/modules/gbean
    [echo] +----------------------------------------
    [echo]
    [echo] +----------------------------------------
    [echo] | Cleaning: /home/existusr/continuum-1.0-alpha-3/apps/continuum/temp/1/modules/optional
    [echo] +----------------------------------------
    [delete] Deleting directory /home/existusr/continuum-1.0-alpha-3/apps/continuum/temp/1/modules/optional/target
    [echo]
    [echo] +----------------------------------------
    [echo] | Cleaning: /home/existusr/continuum-1.0-alpha-3/apps/continuum/temp/1/modules/ra
    [echo] +----------------------------------------
    [echo]
    [echo] +----------------------------------------
    [echo] | Cleaning: /home/existusr/continuum-1.0-alpha-3/apps/continuum/temp/1/modules/assembly
    [echo] +----------------------------------------
    [echo]
    [echo] +----------------------------------------
    [echo] | Cleaning: /home/existusr/continuum-1.0-alpha-3/apps/continuum/temp/1/modules/core
    [echo] +----------------------------------------
    [delete] Deleting directory /home/existusr/continuum-1.0-alpha-3/apps/continuum/temp/1/modules/core/target
    [echo]

    [echo] Compiling the codes
Tag library requested that is not present: 'local:modules' in plugin: 'null'
init:

default:
multiproject:projects-init:
    [echo] Gathering project list
Starting the reactor...
Our processing order:
ActiveMQ :: Core
ActiveMQ :: Web
ActiveMQ :: Optional
ActiveMQ :: Resource Adapter
ActiveMQ :: Container
ActiveMQ :: GBeans
ActiveMQ :: Assembly
+----------------------------------------
| Gathering project list ActiveMQ :: Core
| Memory: 9M/16M
+----------------------------------------
+----------------------------------------
| Gathering project list ActiveMQ :: Web
| Memory: 9M/16M
+----------------------------------------
+----------------------------------------
| Gathering project list ActiveMQ :: Optional
| Memory: 9M/16M
+----------------------------------------
+----------------------------------------
| Gathering project list ActiveMQ :: Resource Adapter
| Memory: 9M/16M
+----------------------------------------
+----------------------------------------
| Gathering project list ActiveMQ :: Container
| Memory: 9M/16M
+----------------------------------------
+----------------------------------------
| Gathering project list ActiveMQ :: GBeans
| Memory: 9M/16M
+----------------------------------------
+----------------------------------------
| Gathering project list ActiveMQ :: Assembly
| Memory: 9M/16M
+----------------------------------------
Starting the reactor...
Our processing order:
ActiveMQ :: Core
ActiveMQ :: Web
ActiveMQ :: Optional
ActiveMQ :: Resource Adapter
ActiveMQ :: Container
ActiveMQ :: GBeans
ActiveMQ :: Assembly
+----------------------------------------
| Executing default ActiveMQ :: Core
| Memory: 9M/16M
+----------------------------------------
Attempting to download activecluster-1.1-SNAPSHOT.jar.

multiproject:goal:
build:start:

java:prepare-filesystem:
    [mkdir] Created dir: /home/existusr/continuum-1.0-alpha-3/apps/continuum/temp/1/modules/core/target/classes

java:compile:
    [depend] Deleted 0 out of date files in 0 seconds
    [echo] Compiling to /home/existusr/continuum-1.0-alpha-3/apps/continuum/temp/1/modules/core/target/classes
    [javac] Compiling 474 source files to /home/existusr/continuum-1.0-alpha-3/apps/continuum/temp/1/modules/core/target/classes

java:jar-resources:
Copying 34 files to /home/existusr/continuum-1.0-alpha-3/apps/continuum/temp/1/modules/core/target/classes

test:prepare-filesystem:
    [mkdir] Created dir: /home/existusr/continuum-1.0-alpha-3/apps/continuum/temp/1/modules/core/target/test-classes
    [mkdir] Created dir: /home/existusr/continuum-1.0-alpha-3/apps/continuum/temp/1/modules/core/target/test-reports

test:test-resources:
Copying 11 files to /home/existusr/continuum-1.0-alpha-3/apps/continuum/temp/1/modules/core/target/test-classes

test:compile:
    [javac] Compiling 200 source files to /home/existusr/continuum-1.0-alpha-3/apps/continuum/temp/1/modules/core/target/test-classes
    [jar] Building jar: /home/existusr/continuum-1.0-alpha-3/apps/continuum/temp/1/modules/core/target/activemq-core-test-3.1-SNAPSHOT.jar
    [copy] Copying 1 file to /home/existusr/.maven/repository/activemq/jars

test:test:
    [junit] Running org.activemq.JmsQueueTransactionTest
    [junit] Tests run: 11, Failures: 0, Errors: 0, Time elapsed: 50.47 sec
    [junit] Running org.activemq.security.jassjacc.PropertiesConfigLoaderTest
    [junit] Tests run: 1, Failures: 0, Errors: 0, Time elapsed: 0.257 sec
    [junit] Running org.activemq.EmbeddedBrokerTest
    [junit] Tests run: 2, Failures: 0, Errors: 0, Time elapsed: 6.282 sec
    [junit] Running org.activemq.ConnectionCleanupTest
    [junit] Tests run: 1, Failures: 0, Errors: 0, Time elapsed: 6.275 sec
    [junit] Running org.activemq.jndi.InitialContextTest
    [junit] Tests run: 2, Failures: 0, Errors: 0, Time elapsed: 0.943 sec
    [junit] Running org.activemq.jndi.AdminObjectTest
    [junit] Tests run: 1, Failures: 0, Errors: 0, Time elapsed: 0.23 sec
    [junit] Running org.activemq.jndi.DestinationNameWithSlashTest
    [junit] Tests run: 1, Failures: 0, Errors: 0, Time elapsed: 4.582 sec
    [junit] Running org.activemq.jndi.CustomConnectionFactoryNameTest
    [junit] Tests run: 4, Failures: 0, Errors: 0, Time elapsed: 6.89 sec
    [junit] Running org.activemq.jndi.ActiveMQInitialContextFactoryTest
    [junit] Tests run: 3, Failures: 0, Errors: 0, Time elapsed: 6.113 sec
    [junit] Running org.activemq.CompressionMessageTest
    [junit] Tests run: 1, Failures: 0, Errors: 0, Time elapsed: 13.502 sec
    [junit] Running org.activemq.JmsTopicTransactionTest
    [junit] Tests run: 8, Failures: 0, Errors: 0, Time elapsed: 34.145 sec
    [junit] Running org.activemq.filter.DestinationPathTest
    [junit] Tests run: 1, Failures: 0, Errors: 0, Time elapsed: 0.187 sec
    [junit] Running org.activemq.filter.MultiExpressionEvaluatorTest
    [junit] Tests run: 3, Failures: 0, Errors: 0, Time elapsed: 1.795 sec
    [junit] Running org.activemq.filter.DestinationMapTest
    [junit] Tests run: 8, Failures: 0, Errors: 0, Time elapsed: 0.253 sec
    [junit] Running org.activemq.filter.DestinationFilterTest
    [junit] Tests run: 9, Failures: 0, Errors: 0, Time elapsed: 0.193 sec
    [junit] Running org.activemq.JmsDurableTopicWildcardSendReceiveTest
    [junit] Tests run: 1, Failures: 0, Errors: 0, Time elapsed: 8.152 sec
    [junit] Running org.activemq.advisories.TempDestinationAdvisorTest
    [junit] Tests run: 1, Failures: 0, Errors: 0, Time elapsed: 19.367 sec
    [junit] Running org.activemq.advisories.ProducerAdvisorTest
    [junit] Tests run: 1, Failures: 0, Errors: 0, Time elapsed: 6.517 sec
    [junit] Running org.activemq.advisories.ProducerDemandAdvisorTest
    [junit] Tests run: 2, Failures: 0, Errors: 0, Time elapsed: 8.574 sec
    [junit] Running org.activemq.advisories.ConnectionAdvisorTest
    [junit] Tests run: 1, Failures: 0, Errors: 0, Time elapsed: 6.655 sec
    [junit] Running org.activemq.advisories.ConsumerAdvisorTest
    [junit] Tests run: 1, Failures: 0, Errors: 0, Time elapsed: 6.505 sec
    [junit] Running org.activemq.JmsQueueWildcardSendReceiveTest
    [junit] Tests run: 1, Failures: 0, Errors: 0, Time elapsed: 6.587 sec
    [junit] Running org.activemq.JmsDurableQueueWildcardSendReceiveTest
    [junit] Tests run: 1, Failures: 0, Errors: 0, Time elapsed: 8.309 sec
    [junit] Running org.activemq.JmsSessionRecoverTest
    [junit] Tests run: 6, Failures: 0, Errors: 0, Time elapsed: 34.034 sec
    [junit] Running org.activemq.JmsQueueXATransactionTest
    [junit] Tests run: 4, Failures: 0, Errors: 0, Time elapsed: 18.433 sec
    [junit] Running org.activemq.ActiveMQMessageAuditTest
    [junit] Tests run: 1, Failures: 0, Errors: 0, Time elapsed: 0.955 sec
    [junit] Running org.activemq.JmsQueueSendReceiveTwoConnectionsTest
    [junit] Tests run: 1, Failures: 0, Errors: 0, Time elapsed: 8.432 sec
    [junit] Running org.activemq.FragmentPersistentQueueTest
    [junit] Tests run: 1, Failures: 0, Errors: 0, Time elapsed: 25.357 sec
    [junit] Running org.activemq.test.JmsTopicSendReceiveWithTwoConnectionsTest
    [junit] Tests run: 1, Failures: 0, Errors: 0, Time elapsed: 10.056 sec
    [junit] Running org.activemq.test.QueueSendReceiveTest
    [junit] Tests run: 2, Failures: 0, Errors: 0, Time elapsed: 9.837 sec
    [junit] Running org.activemq.test.SendReceiveTest
    [junit] Tests run: 2, Failures: 0, Errors: 0, Time elapsed: 8.953 sec
    [junit] Running org.activemq.test.RollbackTest
    [junit] Tests run: 1, Failures: 0, Errors: 0, Time elapsed: 7.253 sec
    [junit] Running org.activemq.test.JmsTopicSendReceiveTest
    [junit] Tests run: 1, Failures: 0, Errors: 0, Time elapsed: 6.861 sec
    [junit] Running org.activemq.streams.JMSInputStreamTest
    [junit] Tests run: 2, Failures: 0, Errors: 0, Time elapsed: 13.06 sec
    [junit] Running org.activemq.util.IdGeneratorTest
    [junit] Tests run: 4, Failures: 0, Errors: 0, Time elapsed: 1.581 sec
    [junit] Running org.activemq.util.ReflectionSupportTest
    [junit] Tests run: 1, Failures: 0, Errors: 0, Time elapsed: 0.564 sec
    [junit] Running org.activemq.util.BitArrayBinTest
    [junit] Tests run: 2, Failures: 0, Errors: 0, Time elapsed: 0.184 sec
    [junit] Running org.activemq.util.JmsLogAppenderTest
    [junit] Tests run: 1, Failures: 0, Errors: 0, Time elapsed: 0.178 sec
    [junit] Running org.activemq.util.BitArrayTest
    [junit] Tests run: 4, Failures: 0, Errors: 0, Time elapsed: 0.525 sec
    [junit] Running org.activemq.util.AsyncProxyTest
    [junit] Tests run: 1, Failures: 0, Errors: 0, Time elapsed: 6.59 sec
    [junit] Running org.activemq.util.URIHelperTest
    [junit] Tests run: 3, Failures: 0, Errors: 0, Time elapsed: 0.189 sec
    [junit] Running org.activemq.broker.impl.AdvisorySupportTest
    [junit] Tests run: 3, Failures: 0, Errors: 0, Time elapsed: 0.788 sec
    [junit] Running org.activemq.broker.BrokerAdminTest
    [junit] Tests run: 3, Failures: 0, Errors: 0, Time elapsed: 7.327 sec
    [junit] Running org.activemq.JmsDurableTopicSendReceiveTest
    [junit] Tests run: 1, Failures: 0, Errors: 0, Time elapsed: 8.095 sec
    [junit] Running org.activemq.JmsTopicSendReceiveWithTwoConnectionsTest
    [junit] Tests run: 1, Failures: 0, Errors: 0, Time elapsed: 8.282 sec
    [junit] Running org.activemq.JmsQueueRequestReplyTest
    [junit] Tests run: 2, Failures: 0, Errors: 0, Time elapsed: 10.99 sec
    [junit] Running org.activemq.service.TransientQueueGarbageCollectionTest
    [junit] Tests run: 2, Failures: 0, Errors: 0, Time elapsed: 4.655 sec
    [junit] Running org.activemq.service.impl.LocalTransactionCommandTest
    [junit] Tests run: 1, Failures: 0, Errors: 0, Time elapsed: 0.175 sec
    [junit] Running org.activemq.service.impl.DefaultQueueListTest
    [junit] Tests run: 5, Failures: 0, Errors: 0, Time elapsed: 0.189 sec
    [junit] Running org.activemq.service.impl.XATransactionCommandTest
    [junit] Tests run: 1, Failures: 0, Errors: 0, Time elapsed: 0.175 sec
    [junit] Running org.activemq.service.impl.XATransactionTest
    [junit] Tests run: 1, Failures: 0, Errors: 0, Time elapsed: 0.18 sec
    [junit] Running org.activemq.service.SimpleQueueBrokerTest
    [junit] Tests run: 1, Failures: 0, Errors: 0, Time elapsed: 5.205 sec
    [junit] Running org.activemq.service.TopicBrokerTest
    [junit] Tests run: 1, Failures: 0, Errors: 0, Time elapsed: 4.866 sec
    [junit] Running org.activemq.service.SimpleTopicBrokerTest
    [junit] Tests run: 1, Failures: 0, Errors: 0, Time elapsed: 4.955 sec
    [junit] Running org.activemq.service.AsyncSimpleBrokerTest
    [junit] Tests run: 1, Failures: 0, Errors: 0, Time elapsed: 4.626 sec
    [junit] Running org.activemq.service.QueueBrokerTest
    [junit] Tests run: 1, Failures: 0, Errors: 0, Time elapsed: 5.11 sec
    [junit] Running org.activemq.JmsDurableSubscriptionTest
    [junit] Tests run: 1, Failures: 0, Errors: 0, Time elapsed: 4.424 sec
    [junit] Running org.activemq.JmsDurableTopicTransactionTest
    [junit] Tests run: 8, Failures: 0, Errors: 0, Time elapsed: 34.071 sec
    [junit] Running org.activemq.JmsTopicWildcardSendReceiveTest
    [junit] Tests run: 1, Failures: 0, Errors: 0, Time elapsed: 7.557 sec
    [junit] Running org.activemq.JmsTopicSendSameMessageTest
    [junit] Tests run: 1, Failures: 0, Errors: 0, Time elapsed: 7.853 sec
    [junit] Running org.activemq.message.ActiveMQMapMessageTest
    [junit] Tests run: 29, Failures: 0, Errors: 0, Time elapsed: 0.207 sec
    [junit] Running org.activemq.message.ActiveMQBytesMessageTest
    [junit] Tests run: 18, Failures: 0, Errors: 0, Time elapsed: 0.228 sec
    [junit] Running org.activemq.message.ActiveMQStreamMessageTest
    [junit] Tests run: 15, Failures: 0, Errors: 0, Time elapsed: 0.219 sec
    [junit] Running org.activemq.message.SessionInfoTest
    [junit] Tests run: 4, Failures: 0, Errors: 0, Time elapsed: 0.154 sec
    [junit] Running org.activemq.message.ActiveMQDestinationTest
    [junit] Tests run: 10, Failures: 0, Errors: 0, Time elapsed: 0.187 sec
    [junit] Running org.activemq.message.ActiveMQTextMessageTest
    [junit] Tests run: 3, Failures: 0, Errors: 0, Time elapsed: 0.174 sec
    [junit] Running org.activemq.message.ActiveMQObjectMessageTest
    [junit] Tests run: 2, Failures: 0, Errors: 0, Time elapsed: 0.221 sec
    [junit] Running org.activemq.message.ActiveMQMessageTest
    [junit] Tests run: 51, Failures: 0, Errors: 0, Time elapsed: 0.261 sec
    [junit] Running org.activemq.message.PackageFacadeTest
    [junit] Tests run: 2, Failures: 0, Errors: 0, Time elapsed: 0.651 sec
    [junit] Running org.activemq.message.ActiveMQXidTest
    [junit] Tests run: 1, Failures: 0, Errors: 0, Time elapsed: 0.571 sec
    [junit] Running org.activemq.spring.SpringTest
    [junit] Tests run: 5, Failures: 0, Errors: 0, Time elapsed: 21.227 sec
    [junit] Running org.activemq.JmsQueueSendReceiveUsingTwoSessionsTest
    [junit] Tests run: 1, Failures: 0, Errors: 0, Time elapsed: 7.595 sec
    [junit] Running org.activemq.JmsCreateConsumerInOnMessageTest
    [junit] Tests run: 1, Failures: 0, Errors: 0, Time elapsed: 6.803 sec
    [junit] Running org.activemq.JmsTempDestinationTest
    [junit] Tests run: 6, Failures: 0, Errors: 0, Time elapsed: 21.909 sec
    [junit] Running org.activemq.store.jdbc.JDBCTopicMessageContainerTest
    [junit] Tests run: 1, Failures: 0, Errors: 0, Time elapsed: 5.929 sec
    [junit] Running org.activemq.store.jdbc.JDBCQueueMessageContainerTest
    [junit] Tests run: 1, Failures: 0, Errors: 0, Time elapsed: 5.951 sec
    [junit] Running org.activemq.store.jdbc.JDBCQueueMessageStoreTest
    [junit] Tests run: 2, Failures: 0, Errors: 0, Time elapsed: 7.87 sec
    [junit] Running org.activemq.store.jdbc.PersistenceAdapterTest
    [junit] Tests run: 1, Failures: 0, Errors: 0, Time elapsed: 5.197 sec
    [junit] Running org.activemq.store.journal.JournalQueueMessageContainerTest
    [junit] Tests run: 1, Failures: 0, Errors: 0, Time elapsed: 0.566 sec
    [junit] Running org.activemq.store.journal.JournalTopicMessageContainerTest
    [junit] Tests run: 1, Failures: 0, Errors: 0, Time elapsed: 0.568 sec
    [junit] Running org.activemq.store.journal.JournalQueueMessageStoreTest
    [junit] Tests run: 2, Failures: 0, Errors: 0, Time elapsed: 0.785 sec
    [junit] Running org.activemq.store.vm.VMTopicMessageContainerTest
    [junit] Tests run: 1, Failures: 0, Errors: 0, Time elapsed: 0.194 sec
    [junit] Running org.activemq.store.vm.VMQueueMessageContainerTest
    [junit] Tests run: 1, Failures: 0, Errors: 0, Time elapsed: 0.604 sec
    [junit] Running org.activemq.JmsClientAckTest
    [junit] Tests run: 2, Failures: 0, Errors: 0, Time elapsed: 16.232 sec
    [junit] Running org.activemq.JmsTopicRequestReplyTest
    [junit] Tests run: 2, Failures: 0, Errors: 0, Time elapsed: 10.778 sec
    [junit] Running org.activemq.BrokerAdminCommandsTest
    [junit] Tests run: 1, Failures: 0, Errors: 0, Time elapsed: 8.826 sec
    [junit] Running org.activemq.JmsTopicSendReceiveSubscriberTest
    [junit] Tests run: 1, Failures: 0, Errors: 0, Time elapsed: 8.037 sec
    [junit] Running org.activemq.selector.SelectorTest
    [junit] Tests run: 17, Failures: 0, Errors: 0, Time elapsed: 1.217 sec
    [junit] Running org.activemq.selector.SelectorParserTest
    [junit] Tests run: 2, Failures: 0, Errors: 0, Time elapsed: 0.606 sec
    [junit] Running org.activemq.JmsConnectionStartStopTest
    [junit] Tests run: 2, Failures: 0, Errors: 0, Time elapsed: 15.341 sec
    [junit] Running org.activemq.management.RangeStatisticTest
    [junit] Tests run: 1, Failures: 0, Errors: 0, Time elapsed: 0.683 sec
    [junit] Running org.activemq.management.TimeStatisticTest
    [junit] Tests run: 1, Failures: 0, Errors: 0, Time elapsed: 0.688 sec
    [junit] Running org.activemq.management.CountStatisticTest
    [junit] Tests run: 1, Failures: 0, Errors: 0, Time elapsed: 0.696 sec
    [junit] Running org.activemq.management.BoundaryStatisticTest
    [junit] Tests run: 1, Failures: 0, Errors: 0, Time elapsed: 0.185 sec
    [junit] Running org.activemq.management.BoundedRangeStatisticTest
    [junit] Tests run: 1, Failures: 0, Errors: 0, Time elapsed: 0.685 sec
    [junit] Running org.activemq.FragmentTransientQueueTest
    [junit] Tests run: 1, Failures: 0, Errors: 0, Time elapsed: 15.328 sec
    [junit] Running org.activemq.transport.composite.CompositeTransportChannelWithLeadingSlashesTest
    [junit] Tests run: 4, Failures: 0, Errors: 0, Time elapsed: 0.626 sec
    [junit] Running org.activemq.transport.composite.CompositeTransportChannelTest
    [junit] Tests run: 4, Failures: 0, Errors: 0, Time elapsed: 0.848 sec
    [junit] Running org.activemq.transport.jabber.JabberWireFormatTest
    [junit] Tests run: 1, Failures: 0, Errors: 0, Time elapsed: 0.167 sec
    [junit] Running org.activemq.transport.tcp.TcpQueueSendReceiveTwoConnectionsTest
    [junit] Tests run: 1, Failures: 0, Errors: 1, Time elapsed: 4.364 sec
    [junit] [ERROR] TEST org.activemq.transport.tcp.TcpQueueSendReceiveTwoConnectionsTest FAILED
    [junit] Running org.activemq.transport.tcp.TcpTopicSendReceiveTest
    [junit] Tests run: 1, Failures: 0, Errors: 0, Time elapsed: 6.6 sec
    [junit] Running org.activemq.transport.tcp.TcpQueueSendReceiveTest
    [junit] Tests run: 1, Failures: 0, Errors: 0, Time elapsed: 6.623 sec
    [junit] Running org.activemq.transport.tcp.TcpTopicSendReceiveTwoConnectionsTest
    [junit] Tests run: 1, Failures: 0, Errors: 0, Time elapsed: 6.636 sec
    [junit] Running org.activemq.transport.tcp.ExceptionListenerTest
    [junit] Tests run: 1, Failures: 0, Errors: 0, Time elapsed: 5.786 sec
    [junit] Running org.activemq.transport.tcp.TcpTransportChannelTest
    [junit] Tests run: 4, Failures: 0, Errors: 0, Time elapsed: 0.614 sec
    [junit] Running org.activemq.transport.UriParseTest
    [junit] Tests run: 4, Failures: 0, Errors: 0, Time elapsed: 0.27 sec
    [junit] Running org.activemq.transport.reliable.ReliableTransportChannelTest
    [junit] Tests run: 4, Failures: 0, Errors: 0, Time elapsed: 0.637 sec
    [junit] Running org.activemq.transport.reliable.ReliableTransportChannelFactoryTest
    [junit] Tests run: 1, Failures: 0, Errors: 0, Time elapsed: 0.204 sec
    [junit] Running org.activemq.transport.activeio.ActiveIOQueueSendReceiveTest
    [junit] Tests run: 3, Failures: 0, Errors: 0, Time elapsed: 13.205 sec
    [junit] Running org.activemq.transport.activeio.ActiveIOTopicSendReceiveTest
    [junit] Tests run: 2, Failures: 0, Errors: 0, Time elapsed: 10.457 sec
    [junit] Running org.activemq.transport.activeio.URIConverterTest
    [junit] Tests run: 1, Failures: 0, Errors: 0, Time elapsed: 0.19 sec
    [junit] Running org.activemq.transport.activeio.ActiveIOQueueSendReceiveTwoConnectionsTest
    [junit] Tests run: 2, Failures: 0, Errors: 0, Time elapsed: 20.881 sec
    [junit] Running org.activemq.transport.activeio.ActiveIOTopicSendReceiveTwoConnectionsTest
    [junit] Tests run: 3, Failures: 1, Errors: 0, Time elapsed: 52.247 sec
    [junit] [ERROR] TEST org.activemq.transport.activeio.ActiveIOTopicSendReceiveTwoConnectionsTest FAILED
    [junit] Running org.activemq.transport.activeio.ActiveIOTransportChannelTest
    [junit] Tests run: 12, Failures: 0, Errors: 0, Time elapsed: 1.277 sec
    [junit] Running org.activemq.capacity.BasicCapacityMonitorTest
    [junit] Tests run: 1, Failures: 0, Errors: 0, Time elapsed: 0.203 sec
    [junit] Running org.activemq.JmsTopicSendReceiveTest
    [junit] Tests run: 1, Failures: 0, Errors: 0, Time elapsed: 16.158 sec
    [junit] Running org.activemq.JmsRedeliveredTest
    [junit] Tests run: 16, Failures: 0, Errors: 0, Time elapsed: 43.91 sec
    [junit] Running org.activemq.io.impl.ActiveMQMessageReaderTest
    [junit] Tests run: 3, Failures: 0, Errors: 0, Time elapsed: 16.555 sec
    [junit] Running org.activemq.io.impl.TransactionInfoReaderTest
    [junit] Tests run: 7, Failures: 0, Errors: 0, Time elapsed: 0.58 sec
    [junit] Running org.activemq.io.impl.MessageAckReaderTest
    [junit] Tests run: 3, Failures: 0, Errors: 0, Time elapsed: 1.53 sec
    [junit] Running org.activemq.io.impl.ActiveMQTextMessageReaderTest
    [junit] Tests run: 4, Failures: 0, Errors: 0, Time elapsed: 16.046 sec
    [junit] Running org.activemq.io.impl.ProducerInfoReaderTest
    [junit] Tests run: 3, Failures: 0, Errors: 0, Time elapsed: 1.041 sec
    [junit] Running org.activemq.io.impl.ActiveMQMapMessageReaderTest
    [junit] Tests run: 4, Failures: 0, Errors: 0, Time elapsed: 17.182 sec
    [junit] Running org.activemq.io.impl.ActiveMQObjectMessageReaderTest
    [junit] Tests run: 4, Failures: 0, Errors: 0, Time elapsed: 16.151 sec
    [junit] Running org.activemq.io.impl.ActiveMQStreamMessageReaderTest
    [junit] Tests run: 4, Failures: 0, Errors: 0, Time elapsed: 16.735 sec
    [junit] Running org.activemq.io.impl.ReceiptReaderTest
    [junit] Tests run: 7, Failures: 0, Errors: 0, Time elapsed: 0.681 sec
    [junit] Running org.activemq.io.impl.XATransactionInfoReaderTest
    [junit] Tests run: 8, Failures: 0, Errors: 0, Time elapsed: 0.76 sec
    [junit] Running org.activemq.io.impl.DefaultWireFormatTest
    [junit] Tests run: 4, Failures: 0, Errors: 0, Time elapsed: 0.72 sec
    [junit] Running org.activemq.io.impl.ConsumerInfoReaderTest
    [junit] Tests run: 3, Failures: 0, Errors: 0, Time elapsed: 1.525 sec
    [junit] Running org.activemq.io.impl.ActiveMQBytesMessageReaderTest
    [junit] Tests run: 4, Failures: 0, Errors: 0, Time elapsed: 16.735 sec
    [junit] Running org.activemq.io.util.MemoryBoundedMessageCacheTest
    [junit] Tests run: 2, Failures: 0, Errors: 0, Time elapsed: 0.244 sec
    [junit] Running org.activemq.io.util.ByteArrayFragmentationTest
    [junit] Tests run: 1, Failures: 0, Errors: 0, Time elapsed: 1.669 sec
    [junit] Running org.activemq.io.util.ByteArrayCompressionTest
    [junit] Tests run: 1, Failures: 0, Errors: 0, Time elapsed: 0.196 sec
    [junit] Running org.activemq.io.util.MemoryBoundedQueueTest
    [junit] Tests run: 12, Failures: 0, Errors: 0, Time elapsed: 1.769 sec
    [junit] Running org.activemq.io.util.MemoryBoundedPrioritizedQueueTest
    [junit] Tests run: 13, Failures: 0, Errors: 0, Time elapsed: 1.849 sec
    [junit] Running org.activemq.io.WireFormatLoaderTest
    [junit] Tests run: 1, Failures: 0, Errors: 0, Time elapsed: 0.626 sec
    [junit] Running org.activemq.FragmentTopicTest
    [junit] Tests run: 1, Failures: 0, Errors: 0, Time elapsed: 100.893 sec
    [junit] Running org.activemq.JmsQueueSendReceiveTest
    [junit] Tests run: 1, Failures: 0, Errors: 0, Time elapsed: 21.255 sec
Total time: 21 minutes 43 seconds
Finished at: Tue Aug 02 19:27:12 PDT 2005


****************************************************************************

****************************************************************************
Standard Error:
****************************************************************************

BUILD FAILED
File...... /home/existusr/.maven/cache/maven-multiproject-plugin-1.3.1/plugin.jelly
Element... maven:reactor
Line...... 217
Column.... 9
Unable to obtain goal [test:test] -- /home/existusr/.maven/cache/maven-test-plugin-1.6.2/plugin.jelly:181:54: <fail> There were test failures.

****************************************************************************