[activemq-dev] [continuum] BUILD FAILURE: ActiveMQ

classic Classic list List threaded Threaded
1 message Options
Reply | Threaded
Open this post in threaded view
|

[activemq-dev] [continuum] BUILD FAILURE: ActiveMQ

Continuum@yami
Build statistics:
  State: Failed
  Previous State: Ok
  Started at: Fri, 29 Jul 2005 18:44:10 -0700
  Finished at: Fri, 29 Jul 2005 19:06:21 -0700
  Total time: 22m 11s
  Forced: true
  Exit code: 70
  Building machine hostname: localhost

Changes
 No files changed

****************************************************************************
Standard Output:
****************************************************************************
 __  __
|  \/  |__ _Apache__ ___
| |\/| / _` \ V / -_) ' \  ~ intelligent projects ~
|_|  |_\__,_|\_/\___|_||_|  v. 1.0.2

Tag library requested that is not present: 'local:modules' in plugin: 'null'
build:start:

nightly-build:
    [echo] Cleaning the directory
Tag library requested that is not present: 'local:modules' in plugin: 'null'
init:

clean:
    [echo] +----------------------------------------
    [echo] | Cleaning: /home/existusr/continuum-1.0-alpha-3/apps/continuum/temp/1/modules/web
    [echo] +----------------------------------------
    [delete] Deleting directory /home/existusr/continuum-1.0-alpha-3/apps/continuum/temp/1/modules/web/target
    [echo]
    [echo] +----------------------------------------
    [echo] | Cleaning: /home/existusr/continuum-1.0-alpha-3/apps/continuum/temp/1/modules/container
    [echo] +----------------------------------------
    [delete] Deleting directory /home/existusr/continuum-1.0-alpha-3/apps/continuum/temp/1/modules/container/target
    [echo]
    [echo] +----------------------------------------
    [echo] | Cleaning: /home/existusr/continuum-1.0-alpha-3/apps/continuum/temp/1/modules/gbean
    [echo] +----------------------------------------
    [delete] Deleting directory /home/existusr/continuum-1.0-alpha-3/apps/continuum/temp/1/modules/gbean/target
    [echo]
    [echo] +----------------------------------------
    [echo] | Cleaning: /home/existusr/continuum-1.0-alpha-3/apps/continuum/temp/1/modules/optional
    [echo] +----------------------------------------
    [delete] Deleting directory /home/existusr/continuum-1.0-alpha-3/apps/continuum/temp/1/modules/optional/target
    [echo]
    [echo] +----------------------------------------
    [echo] | Cleaning: /home/existusr/continuum-1.0-alpha-3/apps/continuum/temp/1/modules/ra
    [echo] +----------------------------------------
    [delete] Deleting directory /home/existusr/continuum-1.0-alpha-3/apps/continuum/temp/1/modules/ra/target
    [echo]
    [echo] +----------------------------------------
    [echo] | Cleaning: /home/existusr/continuum-1.0-alpha-3/apps/continuum/temp/1/modules/assembly
    [echo] +----------------------------------------
    [delete] Deleting directory /home/existusr/continuum-1.0-alpha-3/apps/continuum/temp/1/modules/assembly/target
    [echo]
    [echo] +----------------------------------------
    [echo] | Cleaning: /home/existusr/continuum-1.0-alpha-3/apps/continuum/temp/1/modules/core
    [echo] +----------------------------------------
    [delete] Deleting directory /home/existusr/continuum-1.0-alpha-3/apps/continuum/temp/1/modules/core/target
    [echo]

    [echo] Compiling the codes
Tag library requested that is not present: 'local:modules' in plugin: 'null'
init:

default:
multiproject:projects-init:
    [echo] Gathering project list
Starting the reactor...
Our processing order:
ActiveMQ :: Core
ActiveMQ :: Web
ActiveMQ :: Optional
ActiveMQ :: Resource Adapter
ActiveMQ :: Container
ActiveMQ :: GBeans
ActiveMQ :: Assembly
+----------------------------------------
| Gathering project list ActiveMQ :: Core
| Memory: 10M/13M
+----------------------------------------
+----------------------------------------
| Gathering project list ActiveMQ :: Web
| Memory: 10M/13M
+----------------------------------------
+----------------------------------------
| Gathering project list ActiveMQ :: Optional
| Memory: 10M/13M
+----------------------------------------
+----------------------------------------
| Gathering project list ActiveMQ :: Resource Adapter
| Memory: 10M/13M
+----------------------------------------
+----------------------------------------
| Gathering project list ActiveMQ :: Container
| Memory: 10M/13M
+----------------------------------------
+----------------------------------------
| Gathering project list ActiveMQ :: GBeans
| Memory: 10M/13M
+----------------------------------------
+----------------------------------------
| Gathering project list ActiveMQ :: Assembly
| Memory: 10M/13M
+----------------------------------------
Starting the reactor...
Our processing order:
ActiveMQ :: Core
ActiveMQ :: Web
ActiveMQ :: Optional
ActiveMQ :: Resource Adapter
ActiveMQ :: Container
ActiveMQ :: GBeans
ActiveMQ :: Assembly
+----------------------------------------
| Executing default ActiveMQ :: Core
| Memory: 10M/13M
+----------------------------------------
Attempting to download activecluster-1.1-SNAPSHOT.jar.

multiproject:goal:
build:start:

java:prepare-filesystem:
    [mkdir] Created dir: /home/existusr/continuum-1.0-alpha-3/apps/continuum/temp/1/modules/core/target/classes

java:compile:
    [depend] Deleted 0 out of date files in 0 seconds
    [echo] Compiling to /home/existusr/continuum-1.0-alpha-3/apps/continuum/temp/1/modules/core/target/classes
    [javac] Compiling 474 source files to /home/existusr/continuum-1.0-alpha-3/apps/continuum/temp/1/modules/core/target/classes

java:jar-resources:
Copying 34 files to /home/existusr/continuum-1.0-alpha-3/apps/continuum/temp/1/modules/core/target/classes

test:prepare-filesystem:
    [mkdir] Created dir: /home/existusr/continuum-1.0-alpha-3/apps/continuum/temp/1/modules/core/target/test-classes
    [mkdir] Created dir: /home/existusr/continuum-1.0-alpha-3/apps/continuum/temp/1/modules/core/target/test-reports

test:test-resources:
Copying 11 files to /home/existusr/continuum-1.0-alpha-3/apps/continuum/temp/1/modules/core/target/test-classes

test:compile:
    [javac] Compiling 200 source files to /home/existusr/continuum-1.0-alpha-3/apps/continuum/temp/1/modules/core/target/test-classes
    [jar] Building jar: /home/existusr/continuum-1.0-alpha-3/apps/continuum/temp/1/modules/core/target/activemq-core-test-3.1-SNAPSHOT.jar
    [copy] Copying 1 file to /home/existusr/.maven/repository/activemq/jars

test:test:
    [junit] Running org.activemq.JmsQueueTransactionTest
    [junit] Tests run: 11, Failures: 0, Errors: 0, Time elapsed: 49.804 sec
    [junit] Running org.activemq.security.jassjacc.PropertiesConfigLoaderTest
    [junit] Tests run: 1, Failures: 0, Errors: 0, Time elapsed: 0.247 sec
    [junit] Running org.activemq.EmbeddedBrokerTest
    [junit] Tests run: 2, Failures: 0, Errors: 0, Time elapsed: 5.975 sec
    [junit] Running org.activemq.ConnectionCleanupTest
    [junit] Tests run: 1, Failures: 0, Errors: 0, Time elapsed: 6.011 sec
    [junit] Running org.activemq.jndi.InitialContextTest
    [junit] Tests run: 2, Failures: 0, Errors: 0, Time elapsed: 0.903 sec
    [junit] Running org.activemq.jndi.AdminObjectTest
    [junit] Tests run: 1, Failures: 0, Errors: 0, Time elapsed: 0.226 sec
    [junit] Running org.activemq.jndi.DestinationNameWithSlashTest
    [junit] Tests run: 1, Failures: 0, Errors: 0, Time elapsed: 4.39 sec
    [junit] Running org.activemq.jndi.CustomConnectionFactoryNameTest
    [junit] Tests run: 4, Failures: 0, Errors: 0, Time elapsed: 6.148 sec
    [junit] Running org.activemq.jndi.ActiveMQInitialContextFactoryTest
    [junit] Tests run: 3, Failures: 0, Errors: 0, Time elapsed: 5.567 sec
    [junit] Running org.activemq.CompressionMessageTest
    [junit] Tests run: 1, Failures: 0, Errors: 0, Time elapsed: 11.905 sec
    [junit] Running org.activemq.JmsTopicTransactionTest
    [junit] Tests run: 8, Failures: 0, Errors: 0, Time elapsed: 33.234 sec
    [junit] Running org.activemq.filter.DestinationPathTest
    [junit] Tests run: 1, Failures: 0, Errors: 0, Time elapsed: 0.182 sec
    [junit] Running org.activemq.filter.MultiExpressionEvaluatorTest
    [junit] Tests run: 3, Failures: 0, Errors: 0, Time elapsed: 1.667 sec
    [junit] Running org.activemq.filter.DestinationMapTest
    [junit] Tests run: 8, Failures: 0, Errors: 0, Time elapsed: 0.247 sec
    [junit] Running org.activemq.filter.DestinationFilterTest
    [junit] Tests run: 9, Failures: 0, Errors: 0, Time elapsed: 0.188 sec
    [junit] Running org.activemq.JmsDurableTopicWildcardSendReceiveTest
    [junit] Tests run: 1, Failures: 0, Errors: 0, Time elapsed: 7.939 sec
    [junit] Running org.activemq.advisories.TempDestinationAdvisorTest
    [junit] Tests run: 1, Failures: 0, Errors: 0, Time elapsed: 19.166 sec
    [junit] Running org.activemq.advisories.ProducerAdvisorTest
    [junit] Tests run: 1, Failures: 0, Errors: 0, Time elapsed: 6.878 sec
    [junit] Running org.activemq.advisories.ProducerDemandAdvisorTest
    [junit] Tests run: 2, Failures: 0, Errors: 0, Time elapsed: 8.582 sec
    [junit] Running org.activemq.advisories.ConnectionAdvisorTest
    [junit] Tests run: 1, Failures: 0, Errors: 0, Time elapsed: 7.144 sec
    [junit] Running org.activemq.advisories.ConsumerAdvisorTest
    [junit] Tests run: 1, Failures: 0, Errors: 0, Time elapsed: 6.623 sec
    [junit] Running org.activemq.JmsQueueWildcardSendReceiveTest
    [junit] Tests run: 1, Failures: 0, Errors: 0, Time elapsed: 6.445 sec
    [junit] Running org.activemq.JmsDurableQueueWildcardSendReceiveTest
    [junit] Tests run: 1, Failures: 0, Errors: 0, Time elapsed: 8.415 sec
    [junit] Running org.activemq.JmsSessionRecoverTest
    [junit] Tests run: 6, Failures: 0, Errors: 0, Time elapsed: 25.945 sec
    [junit] Running org.activemq.JmsQueueXATransactionTest
    [junit] Tests run: 4, Failures: 0, Errors: 0, Time elapsed: 18.536 sec
    [junit] Running org.activemq.ActiveMQMessageAuditTest
    [junit] Tests run: 1, Failures: 0, Errors: 0, Time elapsed: 0.949 sec
    [junit] Running org.activemq.JmsQueueSendReceiveTwoConnectionsTest
    [junit] Tests run: 1, Failures: 0, Errors: 0, Time elapsed: 9.141 sec
    [junit] Running org.activemq.FragmentPersistentQueueTest
    [junit] Tests run: 1, Failures: 0, Errors: 0, Time elapsed: 16.036 sec
    [junit] Running org.activemq.test.JmsTopicSendReceiveWithTwoConnectionsTest
    [junit] Tests run: 1, Failures: 0, Errors: 0, Time elapsed: 8.443 sec
    [junit] Running org.activemq.test.QueueSendReceiveTest
    [junit] Tests run: 2, Failures: 0, Errors: 0, Time elapsed: 9.298 sec
    [junit] Running org.activemq.test.SendReceiveTest
    [junit] Tests run: 2, Failures: 0, Errors: 0, Time elapsed: 8.672 sec
    [junit] Running org.activemq.test.RollbackTest
    [junit] Tests run: 1, Failures: 0, Errors: 0, Time elapsed: 7.112 sec
    [junit] Running org.activemq.test.JmsTopicSendReceiveTest
    [junit] Tests run: 1, Failures: 0, Errors: 0, Time elapsed: 6.848 sec
    [junit] Running org.activemq.streams.JMSInputStreamTest
    [junit] Tests run: 2, Failures: 0, Errors: 0, Time elapsed: 12.982 sec
    [junit] Running org.activemq.util.IdGeneratorTest
    [junit] Tests run: 4, Failures: 0, Errors: 0, Time elapsed: 1.58 sec
    [junit] Running org.activemq.util.ReflectionSupportTest
    [junit] Tests run: 1, Failures: 0, Errors: 0, Time elapsed: 0.562 sec
    [junit] Running org.activemq.util.BitArrayBinTest
    [junit] Tests run: 2, Failures: 0, Errors: 0, Time elapsed: 0.185 sec
    [junit] Running org.activemq.util.JmsLogAppenderTest
    [junit] Tests run: 1, Failures: 0, Errors: 0, Time elapsed: 0.179 sec
    [junit] Running org.activemq.util.BitArrayTest
    [junit] Tests run: 4, Failures: 0, Errors: 0, Time elapsed: 0.516 sec
    [junit] Running org.activemq.util.AsyncProxyTest
    [junit] Tests run: 1, Failures: 0, Errors: 0, Time elapsed: 60.603 sec
    [junit] Running org.activemq.util.URIHelperTest
    [junit] Tests run: 3, Failures: 0, Errors: 0, Time elapsed: 0.189 sec
    [junit] Running org.activemq.broker.impl.AdvisorySupportTest
    [junit] Tests run: 3, Failures: 0, Errors: 0, Time elapsed: 0.755 sec
    [junit] Running org.activemq.broker.BrokerAdminTest
    [junit] Tests run: 3, Failures: 0, Errors: 0, Time elapsed: 7.325 sec
    [junit] Running org.activemq.JmsDurableTopicSendReceiveTest
    [junit] Tests run: 1, Failures: 0, Errors: 0, Time elapsed: 9.791 sec
    [junit] Running org.activemq.JmsTopicSendReceiveWithTwoConnectionsTest
    [junit] Tests run: 1, Failures: 0, Errors: 0, Time elapsed: 8.522 sec
    [junit] Running org.activemq.JmsQueueRequestReplyTest
    [junit] Tests run: 2, Failures: 0, Errors: 0, Time elapsed: 12.201 sec
    [junit] Running org.activemq.service.TransientQueueGarbageCollectionTest
    [junit] Tests run: 2, Failures: 0, Errors: 0, Time elapsed: 4.678 sec
    [junit] Running org.activemq.service.impl.LocalTransactionCommandTest
    [junit] Tests run: 1, Failures: 0, Errors: 0, Time elapsed: 0.175 sec
    [junit] Running org.activemq.service.impl.DefaultQueueListTest
    [junit] Tests run: 5, Failures: 0, Errors: 0, Time elapsed: 0.194 sec
    [junit] Running org.activemq.service.impl.XATransactionCommandTest
    [junit] Tests run: 1, Failures: 0, Errors: 0, Time elapsed: 0.175 sec
    [junit] Running org.activemq.service.impl.XATransactionTest
    [junit] Tests run: 1, Failures: 0, Errors: 0, Time elapsed: 0.189 sec
    [junit] Running org.activemq.service.SimpleQueueBrokerTest
    [junit] Tests run: 1, Failures: 0, Errors: 0, Time elapsed: 5.763 sec
    [junit] Running org.activemq.service.TopicBrokerTest
    [junit] Tests run: 1, Failures: 0, Errors: 0, Time elapsed: 5.101 sec
    [junit] Running org.activemq.service.SimpleTopicBrokerTest
    [junit] Tests run: 1, Failures: 0, Errors: 0, Time elapsed: 4.963 sec
    [junit] Running org.activemq.service.AsyncSimpleBrokerTest
    [junit] Tests run: 1, Failures: 0, Errors: 0, Time elapsed: 4.929 sec
    [junit] Running org.activemq.service.QueueBrokerTest
    [junit] Tests run: 1, Failures: 0, Errors: 0, Time elapsed: 4.952 sec
    [junit] Running org.activemq.JmsDurableSubscriptionTest
    [junit] Tests run: 1, Failures: 0, Errors: 0, Time elapsed: 4.421 sec
    [junit] Running org.activemq.JmsDurableTopicTransactionTest
    [junit] Tests run: 8, Failures: 0, Errors: 0, Time elapsed: 34.161 sec
    [junit] Running org.activemq.JmsTopicWildcardSendReceiveTest
    [junit] Tests run: 1, Failures: 0, Errors: 0, Time elapsed: 7.555 sec
    [junit] Running org.activemq.JmsTopicSendSameMessageTest
    [junit] Tests run: 1, Failures: 0, Errors: 0, Time elapsed: 7.796 sec
    [junit] Running org.activemq.message.ActiveMQMapMessageTest
    [junit] Tests run: 29, Failures: 0, Errors: 0, Time elapsed: 0.211 sec
    [junit] Running org.activemq.message.ActiveMQBytesMessageTest
    [junit] Tests run: 18, Failures: 0, Errors: 0, Time elapsed: 0.223 sec
    [junit] Running org.activemq.message.ActiveMQStreamMessageTest
    [junit] Tests run: 15, Failures: 0, Errors: 0, Time elapsed: 0.22 sec
    [junit] Running org.activemq.message.SessionInfoTest
    [junit] Tests run: 4, Failures: 0, Errors: 0, Time elapsed: 0.153 sec
    [junit] Running org.activemq.message.ActiveMQDestinationTest
    [junit] Tests run: 10, Failures: 0, Errors: 0, Time elapsed: 0.185 sec
    [junit] Running org.activemq.message.ActiveMQTextMessageTest
    [junit] Tests run: 3, Failures: 0, Errors: 0, Time elapsed: 0.173 sec
    [junit] Running org.activemq.message.ActiveMQObjectMessageTest
    [junit] Tests run: 2, Failures: 0, Errors: 0, Time elapsed: 0.222 sec
    [junit] Running org.activemq.message.ActiveMQMessageTest
    [junit] Tests run: 51, Failures: 0, Errors: 0, Time elapsed: 0.26 sec
    [junit] Running org.activemq.message.PackageFacadeTest
    [junit] Tests run: 2, Failures: 0, Errors: 0, Time elapsed: 0.67 sec
    [junit] Running org.activemq.message.ActiveMQXidTest
    [junit] Tests run: 1, Failures: 0, Errors: 0, Time elapsed: 0.574 sec
    [junit] Running org.activemq.spring.SpringTest
    [junit] Tests run: 5, Failures: 0, Errors: 0, Time elapsed: 21.149 sec
    [junit] Running org.activemq.JmsQueueSendReceiveUsingTwoSessionsTest
    [junit] Tests run: 1, Failures: 0, Errors: 0, Time elapsed: 7.604 sec
    [junit] Running org.activemq.JmsCreateConsumerInOnMessageTest
    [junit] Tests run: 1, Failures: 0, Errors: 0, Time elapsed: 6.54 sec
    [junit] Running org.activemq.JmsTempDestinationTest
    [junit] Tests run: 6, Failures: 0, Errors: 0, Time elapsed: 21.788 sec
    [junit] Running org.activemq.store.jdbc.JDBCTopicMessageContainerTest
    [junit] Tests run: 1, Failures: 0, Errors: 0, Time elapsed: 5.862 sec
    [junit] Running org.activemq.store.jdbc.JDBCQueueMessageContainerTest
    [junit] Tests run: 1, Failures: 0, Errors: 0, Time elapsed: 5.654 sec
    [junit] Running org.activemq.store.jdbc.JDBCQueueMessageStoreTest
    [junit] Tests run: 2, Failures: 0, Errors: 0, Time elapsed: 7.521 sec
    [junit] Running org.activemq.store.jdbc.PersistenceAdapterTest
    [junit] Tests run: 1, Failures: 0, Errors: 0, Time elapsed: 5.335 sec
    [junit] Running org.activemq.store.journal.JournalQueueMessageContainerTest
    [junit] Tests run: 1, Failures: 0, Errors: 0, Time elapsed: 0.52 sec
    [junit] Running org.activemq.store.journal.JournalTopicMessageContainerTest
    [junit] Tests run: 1, Failures: 0, Errors: 0, Time elapsed: 0.506 sec
    [junit] Running org.activemq.store.journal.JournalQueueMessageStoreTest
    [junit] Tests run: 2, Failures: 0, Errors: 0, Time elapsed: 0.621 sec
    [junit] Running org.activemq.store.vm.VMTopicMessageContainerTest
    [junit] Tests run: 1, Failures: 0, Errors: 0, Time elapsed: 0.191 sec
    [junit] Running org.activemq.store.vm.VMQueueMessageContainerTest
    [junit] Tests run: 1, Failures: 0, Errors: 0, Time elapsed: 0.203 sec
    [junit] Running org.activemq.JmsClientAckTest
    [junit] Tests run: 2, Failures: 0, Errors: 0, Time elapsed: 11.663 sec
    [junit] Running org.activemq.JmsTopicRequestReplyTest
    [junit] Tests run: 2, Failures: 0, Errors: 0, Time elapsed: 10.129 sec
    [junit] Running org.activemq.BrokerAdminCommandsTest
    [junit] Tests run: 1, Failures: 0, Errors: 0, Time elapsed: 8.035 sec
    [junit] Running org.activemq.JmsTopicSendReceiveSubscriberTest
    [junit] Tests run: 1, Failures: 0, Errors: 0, Time elapsed: 7.513 sec
    [junit] Running org.activemq.selector.SelectorTest
    [junit] Tests run: 17, Failures: 0, Errors: 0, Time elapsed: 1.185 sec
    [junit] Running org.activemq.selector.SelectorParserTest
    [junit] Tests run: 2, Failures: 0, Errors: 0, Time elapsed: 0.588 sec
    [junit] Running org.activemq.JmsConnectionStartStopTest
    [junit] Tests run: 2, Failures: 0, Errors: 0, Time elapsed: 14.815 sec
    [junit] Running org.activemq.management.RangeStatisticTest
    [junit] Tests run: 1, Failures: 0, Errors: 0, Time elapsed: 0.677 sec
    [junit] Running org.activemq.management.TimeStatisticTest
    [junit] Tests run: 1, Failures: 0, Errors: 0, Time elapsed: 0.682 sec
    [junit] Running org.activemq.management.CountStatisticTest
    [junit] Tests run: 1, Failures: 0, Errors: 0, Time elapsed: 0.686 sec
    [junit] Running org.activemq.management.BoundaryStatisticTest
    [junit] Tests run: 1, Failures: 0, Errors: 0, Time elapsed: 0.174 sec
    [junit] Running org.activemq.management.BoundedRangeStatisticTest
    [junit] Tests run: 1, Failures: 0, Errors: 0, Time elapsed: 0.683 sec
    [junit] Running org.activemq.FragmentTransientQueueTest
    [junit] Tests run: 1, Failures: 0, Errors: 0, Time elapsed: 12.888 sec
    [junit] Running org.activemq.transport.composite.CompositeTransportChannelWithLeadingSlashesTest
    [junit] Tests run: 4, Failures: 0, Errors: 0, Time elapsed: 0.559 sec
    [junit] Running org.activemq.transport.composite.CompositeTransportChannelTest
    [junit] Tests run: 4, Failures: 0, Errors: 0, Time elapsed: 0.58 sec
    [junit] Running org.activemq.transport.jabber.JabberWireFormatTest
    [junit] Tests run: 1, Failures: 0, Errors: 0, Time elapsed: 0.164 sec
    [junit] Running org.activemq.transport.tcp.TcpQueueSendReceiveTwoConnectionsTest
    [junit] Tests run: 1, Failures: 0, Errors: 0, Time elapsed: 6.09 sec
    [junit] Running org.activemq.transport.tcp.TcpTopicSendReceiveTest
    [junit] Tests run: 1, Failures: 0, Errors: 0, Time elapsed: 6.286 sec
    [junit] Running org.activemq.transport.tcp.TcpQueueSendReceiveTest
    [junit] Tests run: 1, Failures: 0, Errors: 0, Time elapsed: 6.354 sec
    [junit] Running org.activemq.transport.tcp.TcpTopicSendReceiveTwoConnectionsTest
    [junit] Tests run: 1, Failures: 0, Errors: 0, Time elapsed: 6.276 sec
    [junit] Running org.activemq.transport.tcp.ExceptionListenerTest
    [junit] Tests run: 1, Failures: 0, Errors: 0, Time elapsed: 5.581 sec
    [junit] Running org.activemq.transport.tcp.TcpTransportChannelTest
    [junit] Tests run: 4, Failures: 0, Errors: 0, Time elapsed: 0.578 sec
    [junit] Running org.activemq.transport.UriParseTest
    [junit] Tests run: 4, Failures: 0, Errors: 0, Time elapsed: 0.265 sec
    [junit] Running org.activemq.transport.reliable.ReliableTransportChannelTest
    [junit] Tests run: 4, Failures: 0, Errors: 0, Time elapsed: 0.54 sec
    [junit] Running org.activemq.transport.reliable.ReliableTransportChannelFactoryTest
    [junit] Tests run: 1, Failures: 0, Errors: 0, Time elapsed: 0.197 sec
    [junit] Running org.activemq.transport.activeio.ActiveIOQueueSendReceiveTest
    [junit] Tests run: 3, Failures: 0, Errors: 0, Time elapsed: 15.686 sec
    [junit] Running org.activemq.transport.activeio.ActiveIOTopicSendReceiveTest
    [junit] Tests run: 2, Failures: 0, Errors: 0, Time elapsed: 22.397 sec
    [junit] Running org.activemq.transport.activeio.URIConverterTest
    [junit] Tests run: 1, Failures: 0, Errors: 0, Time elapsed: 0.184 sec
    [junit] Running org.activemq.transport.activeio.ActiveIOQueueSendReceiveTwoConnectionsTest
    [junit] Tests run: 2, Failures: 0, Errors: 0, Time elapsed: 19.369 sec
    [junit] Running org.activemq.transport.activeio.ActiveIOTopicSendReceiveTwoConnectionsTest
    [junit] Tests run: 3, Failures: 1, Errors: 0, Time elapsed: 54.367 sec
    [junit] [ERROR] TEST org.activemq.transport.activeio.ActiveIOTopicSendReceiveTwoConnectionsTest FAILED
    [junit] Running org.activemq.transport.activeio.ActiveIOTransportChannelTest
    [junit] Tests run: 12, Failures: 0, Errors: 0, Time elapsed: 11.743 sec
    [junit] Running org.activemq.capacity.BasicCapacityMonitorTest
    [junit] Tests run: 1, Failures: 0, Errors: 0, Time elapsed: 0.198 sec
    [junit] Running org.activemq.JmsTopicSendReceiveTest
    [junit] Tests run: 1, Failures: 0, Errors: 0, Time elapsed: 7.718 sec
    [junit] Running org.activemq.JmsRedeliveredTest
    [junit] Tests run: 16, Failures: 0, Errors: 0, Time elapsed: 41.423 sec
    [junit] Running org.activemq.io.impl.ActiveMQMessageReaderTest
    [junit] Tests run: 3, Failures: 0, Errors: 0, Time elapsed: 15.602 sec
    [junit] Running org.activemq.io.impl.TransactionInfoReaderTest
    [junit] Tests run: 7, Failures: 0, Errors: 0, Time elapsed: 0.577 sec
    [junit] Running org.activemq.io.impl.MessageAckReaderTest
    [junit] Tests run: 3, Failures: 0, Errors: 0, Time elapsed: 1.54 sec
    [junit] Running org.activemq.io.impl.ActiveMQTextMessageReaderTest
    [junit] Tests run: 4, Failures: 0, Errors: 0, Time elapsed: 15.998 sec
    [junit] Running org.activemq.io.impl.ProducerInfoReaderTest
    [junit] Tests run: 3, Failures: 0, Errors: 0, Time elapsed: 1.041 sec
    [junit] Running org.activemq.io.impl.ActiveMQMapMessageReaderTest
    [junit] Tests run: 4, Failures: 0, Errors: 0, Time elapsed: 16.391 sec
    [junit] Running org.activemq.io.impl.ActiveMQObjectMessageReaderTest
    [junit] Tests run: 4, Failures: 0, Errors: 0, Time elapsed: 15.795 sec
    [junit] Running org.activemq.io.impl.ActiveMQStreamMessageReaderTest
    [junit] Tests run: 4, Failures: 0, Errors: 0, Time elapsed: 16.533 sec
    [junit] Running org.activemq.io.impl.ReceiptReaderTest
    [junit] Tests run: 7, Failures: 0, Errors: 0, Time elapsed: 0.687 sec
    [junit] Running org.activemq.io.impl.XATransactionInfoReaderTest
    [junit] Tests run: 8, Failures: 0, Errors: 0, Time elapsed: 0.776 sec
    [junit] Running org.activemq.io.impl.DefaultWireFormatTest
    [junit] Tests run: 4, Failures: 0, Errors: 0, Time elapsed: 0.719 sec
    [junit] Running org.activemq.io.impl.ConsumerInfoReaderTest
    [junit] Tests run: 3, Failures: 0, Errors: 0, Time elapsed: 1.517 sec
    [junit] Running org.activemq.io.impl.ActiveMQBytesMessageReaderTest
    [junit] Tests run: 4, Failures: 0, Errors: 0, Time elapsed: 16.807 sec
    [junit] Running org.activemq.io.util.MemoryBoundedMessageCacheTest
    [junit] Tests run: 2, Failures: 0, Errors: 0, Time elapsed: 0.246 sec
    [junit] Running org.activemq.io.util.ByteArrayFragmentationTest
    [junit] Tests run: 1, Failures: 0, Errors: 0, Time elapsed: 1.556 sec
    [junit] Running org.activemq.io.util.ByteArrayCompressionTest
    [junit] Tests run: 1, Failures: 0, Errors: 0, Time elapsed: 0.197 sec
    [junit] Running org.activemq.io.util.MemoryBoundedQueueTest
    [junit] Tests run: 12, Failures: 0, Errors: 0, Time elapsed: 1.779 sec
    [junit] Running org.activemq.io.util.MemoryBoundedPrioritizedQueueTest
    [junit] Tests run: 13, Failures: 0, Errors: 0, Time elapsed: 1.844 sec
    [junit] Running org.activemq.io.WireFormatLoaderTest
    [junit] Tests run: 1, Failures: 0, Errors: 0, Time elapsed: 0.623 sec
    [junit] Running org.activemq.FragmentTopicTest
    [junit] Tests run: 1, Failures: 0, Errors: 0, Time elapsed: 101.296 sec
    [junit] Running org.activemq.JmsQueueSendReceiveTest
    [junit] Tests run: 1, Failures: 0, Errors: 0, Time elapsed: 20.67 sec
Total time: 22 minutes 10 seconds
Finished at: Fri Jul 29 19:06:21 PDT 2005


****************************************************************************

****************************************************************************
Standard Error:
****************************************************************************

BUILD FAILED
File...... /home/existusr/.maven/cache/maven-multiproject-plugin-1.3.1/plugin.jelly
Element... maven:reactor
Line...... 217
Column.... 9
Unable to obtain goal [test:test] -- /home/existusr/.maven/cache/maven-test-plugin-1.6.2/plugin.jelly:181:54: <fail> There were test failures.

****************************************************************************