[activemq-dev] [continuum] BUILD FAILURE: ActiveMQ

classic Classic list List threaded Threaded
1 message Options
Reply | Threaded
Open this post in threaded view
|

[activemq-dev] [continuum] BUILD FAILURE: ActiveMQ

Continuum@yami
****************************************************************************
Build statistics:
  State: Failed
  Previous State: Ok
  Started at: Fri, 15 Jul 2005 14:02:26 -0700
  Finished at: Fri, 15 Jul 2005 14:03:52 -0700
  Total time: 1m 26s
  Building machine hostname: yami
****************************************************************************

****************************************************************************
Standard output:
****************************************************************************
 __  __
|  \/  |__ _Apache__ ___
| |\/| / _` \ V / -_) ' \  ~ intelligent projects ~
|_|  |_\__,_|\_/\___|_||_|  v. 1.0.2

Tag library requested that is not present: 'local:modules' in plugin: 'null'
build:start:

clean:clean:

init:

jar:install:
multiproject:projects-init:
    [echo] Gathering project list
Starting the reactor...
Our processing order:
ActiveMQ :: Core
ActiveMQ :: Optional
ActiveMQ :: Resource Adapter
ActiveMQ :: GBeans
ActiveMQ :: Web
ActiveMQ :: Container
ActiveMQ :: Assembly
+----------------------------------------
| Gathering project list ActiveMQ :: Core
| Memory: 5M/8M
+----------------------------------------
+----------------------------------------
| Gathering project list ActiveMQ :: Optional
| Memory: 5M/8M
+----------------------------------------
+----------------------------------------
| Gathering project list ActiveMQ :: Resource Adapter
| Memory: 5M/8M
+----------------------------------------
+----------------------------------------
| Gathering project list ActiveMQ :: GBeans
| Memory: 5M/8M
+----------------------------------------
+----------------------------------------
| Gathering project list ActiveMQ :: Web
| Memory: 5M/8M
+----------------------------------------
+----------------------------------------
| Gathering project list ActiveMQ :: Container
| Memory: 5M/8M
+----------------------------------------
+----------------------------------------
| Gathering project list ActiveMQ :: Assembly
| Memory: 5M/8M
+----------------------------------------
Starting the reactor...
Our processing order:
ActiveMQ :: Core
ActiveMQ :: Optional
ActiveMQ :: Resource Adapter
ActiveMQ :: GBeans
ActiveMQ :: Web
ActiveMQ :: Container
ActiveMQ :: Assembly
+----------------------------------------
| Executing jar:install ActiveMQ :: Core
| Memory: 5M/8M
+----------------------------------------
Attempting to download activecluster-1.1-SNAPSHOT.jar.

multiproject:goal:
build:start:

java:prepare-filesystem:

java:compile:
    [depend] Deleted 0 out of date files in 2 seconds
    [echo] Compiling to /home/existusr/continuum-1.0-alpha-2/apps/continuum/temp/1/modules/core/target/classes

java:jar-resources:

test:prepare-filesystem:

test:test-resources:

test:compile:

test:test:
    [echo] NOTICE: Skipping tests; they seem to have passed already
    [echo] No tests to run.
Copying: from '/home/existusr/continuum-1.0-alpha-2/apps/continuum/temp/1/modules/core/target/activemq-core-3.1-SNAPSHOT.jar' to: '/home/existusr/.maven/repository/activemq/jars/activemq-core-3.1-SNAPSHOT.jar'
Copying: from '/home/existusr/continuum-1.0-alpha-2/apps/continuum/temp/1/modules/core/project.xml' to: '/home/existusr/.maven/repository/activemq/poms/activemq-core-3.1-SNAPSHOT.pom'
+----------------------------------------
| Executing jar:install ActiveMQ :: Optional
| Memory: 9M/10M
+----------------------------------------
Attempting to download activemq-core-3.1-SNAPSHOT.jar.
Attempting to download geronimo-kernel-1.0-SNAPSHOT.jar.
Attempting to download geronimo-system-1.0-SNAPSHOT.jar.
Attempting to download org.mortbay.jetty-5.1-SNAPSHOT.jar.
Attempting to download activemq-core-test-3.1-SNAPSHOT.jar.
Artifact /activemq/jars/activemq-core-test-3.1-SNAPSHOT.jar doesn't exists in remote repository, but it exists locally

jar:jar:

jar:install:

build:end:

build:start:

java:prepare-filesystem:

java:compile:
    [depend] Deleted 0 out of date files in 0 seconds
    [echo] Compiling to /home/existusr/continuum-1.0-alpha-2/apps/continuum/temp/1/modules/optional/target/classes

java:jar-resources:

test:prepare-filesystem:

test:test-resources:

test:compile:

test:test:
    [echo] NOTICE: Skipping tests; they seem to have passed already
    [echo] No tests to run.
Copying: from '/home/existusr/continuum-1.0-alpha-2/apps/continuum/temp/1/modules/optional/target/activemq-optional-3.1-SNAPSHOT.jar' to: '/home/existusr/.maven/repository/activemq/jars/activemq-optional-3.1-SNAPSHOT.jar'
Copying: from '/home/existusr/continuum-1.0-alpha-2/apps/continuum/temp/1/modules/optional/project.xml' to: '/home/existusr/.maven/repository/activemq/poms/activemq-optional-3.1-SNAPSHOT.pom'
+----------------------------------------
| Executing jar:install ActiveMQ :: Resource Adapter
| Memory: 9M/10M
+----------------------------------------
Attempting to download activemq-core-3.1-SNAPSHOT.jar.
Attempting to download activemq-optional-3.1-SNAPSHOT.jar.
Attempting to download activemq-core-test-3.1-SNAPSHOT.jar.
Artifact /activemq/jars/activemq-core-test-3.1-SNAPSHOT.jar doesn't exists in remote repository, but it exists locally
Attempting to download activecluster-1.1-SNAPSHOT.jar.

jar:jar:

jar:install:

build:end:

build:start:

java:prepare-filesystem:

java:compile:
    [depend] Deleted 0 out of date files in 0 seconds
    [echo] Compiling to /home/existusr/continuum-1.0-alpha-2/apps/continuum/temp/1/modules/ra/target/classes

java:jar-resources:

test:prepare-filesystem:

test:test-resources:

test:compile:

test:test:
    [echo] NOTICE: Skipping tests; they seem to have passed already
    [echo] No tests to run.
Copying: from '/home/existusr/continuum-1.0-alpha-2/apps/continuum/temp/1/modules/ra/target/activemq-ra-3.1-SNAPSHOT.jar' to: '/home/existusr/.maven/repository/activemq/jars/activemq-ra-3.1-SNAPSHOT.jar'
Copying: from '/home/existusr/continuum-1.0-alpha-2/apps/continuum/temp/1/modules/ra/project.xml' to: '/home/existusr/.maven/repository/activemq/poms/activemq-ra-3.1-SNAPSHOT.pom'
+----------------------------------------
| Executing jar:install ActiveMQ :: GBeans
| Memory: 10M/10M
+----------------------------------------
Attempting to download activemq-core-3.1-SNAPSHOT.jar.
Attempting to download activemq-core-test-3.1-SNAPSHOT.jar.
Artifact /activemq/jars/activemq-core-test-3.1-SNAPSHOT.jar doesn't exists in remote repository, but it exists locally
Attempting to download geronimo-kernel-1.0-SNAPSHOT.jar.
Attempting to download geronimo-system-1.0-SNAPSHOT.jar.

jar:jar:

jar:install:

build:end:

build:start:

java:prepare-filesystem:

java:compile:
    [depend] Deleted 0 out of date files in 0 seconds
    [echo] Compiling to /home/existusr/continuum-1.0-alpha-2/apps/continuum/temp/1/modules/gbean/target/classes

java:jar-resources:

test:prepare-filesystem:

test:test-resources:

test:compile:
    [echo] No test source files to compile.

test:test:
    [echo] NOTICE: Skipping tests; they seem to have passed already
    [echo] No tests to run.
Copying: from '/home/existusr/continuum-1.0-alpha-2/apps/continuum/temp/1/modules/gbean/target/activemq-gbean-3.1-SNAPSHOT.jar' to: '/home/existusr/.maven/repository/activemq/jars/activemq-gbean-3.1-SNAPSHOT.jar'
Copying: from '/home/existusr/continuum-1.0-alpha-2/apps/continuum/temp/1/modules/gbean/project.xml' to: '/home/existusr/.maven/repository/activemq/poms/activemq-gbean-3.1-SNAPSHOT.pom'
+----------------------------------------
| Executing jar:install ActiveMQ :: Web
| Memory: 7M/12M
+----------------------------------------
Attempting to download activemq-core-3.1-SNAPSHOT.jar.
Attempting to download activemq-core-test-3.1-SNAPSHOT.jar.
Artifact /activemq/jars/activemq-core-test-3.1-SNAPSHOT.jar doesn't exists in remote repository, but it exists locally

jar:jar:

jar:install:

build:end:

build:start:

java:prepare-filesystem:

java:compile:
    [depend] Deleted 0 out of date files in 0 seconds
    [echo] Compiling to /home/existusr/continuum-1.0-alpha-2/apps/continuum/temp/1/modules/web/target/classes

java:jar-resources:

test:prepare-filesystem:

test:test-resources:

test:compile:
    [echo] No test source files to compile.

test:test:
    [echo] NOTICE: Skipping tests; they seem to have passed already
    [echo] No tests to run.
Copying: from '/home/existusr/continuum-1.0-alpha-2/apps/continuum/temp/1/modules/web/target/activemq-web-3.1-SNAPSHOT.jar' to: '/home/existusr/.maven/repository/activemq/jars/activemq-web-3.1-SNAPSHOT.jar'
Copying: from '/home/existusr/continuum-1.0-alpha-2/apps/continuum/temp/1/modules/web/project.xml' to: '/home/existusr/.maven/repository/activemq/poms/activemq-web-3.1-SNAPSHOT.pom'
+----------------------------------------
| Executing jar:install ActiveMQ :: Container
| Memory: 8M/12M
+----------------------------------------
Attempting to download activemq-core-3.1-SNAPSHOT.jar.
Attempting to download activemq-ra-3.1-SNAPSHOT.jar.

jar:jar:

jar:install:

build:end:

build:start:

java:prepare-filesystem:

java:compile:
    [depend] Deleted 0 out of date files in 0 seconds
    [echo] Compiling to /home/existusr/continuum-1.0-alpha-2/apps/continuum/temp/1/modules/container/target/classes

java:jar-resources:

test:prepare-filesystem:

test:test-resources:
Copying 1 file to /home/existusr/continuum-1.0-alpha-2/apps/continuum/temp/1/modules/container/target/test-classes

test:compile:
    [javac] Compiling 1 source file to /home/existusr/continuum-1.0-alpha-2/apps/continuum/temp/1/modules/container/target/test-classes
Total time: 1 minutes 26 seconds
Finished at: Fri Jul 15 14:03:52 PDT 2005


****************************************************************************

****************************************************************************
Standard error:
****************************************************************************
/home/existusr/continuum-1.0-alpha-2/apps/continuum/temp/1/modules/container/src/test/org/activemq/jca/JCAContainerWithoutSpringTest.java:52: <anonymous org.activemq.jca.JCAContainerWithoutSpringTest$2> is not abstract and does not override abstract method getType(java.lang.String) in org.springframework.beans.factory.BeanFactory
            public String[] getAliases(String name) throws NoSuchBeanDefinitionException {
                            ^
1 error

BUILD FAILED
File...... /home/existusr/.maven/cache/maven-multiproject-plugin-1.3.1/plugin.jelly
Element... maven:reactor
Line...... 217
Column.... 9
Unable to obtain goal [test:compile] -- /home/existusr/.maven/cache/maven-test-plugin-1.6.2/plugin.jelly:52:46: <javac> Compile failed; see the compiler error output for details.

****************************************************************************