[activemq-dev] [continuum] BUILD FAILURE: ActiveMQ

Previous Topic Next Topic
 
classic Classic list List threaded Threaded
1 message Options
Reply | Threaded
Open this post in threaded view
|

[activemq-dev] [continuum] BUILD FAILURE: ActiveMQ

Continuum@yami
****************************************************************************
Build statistics:
  State: Failed
  Previous State: Ok
  Started at: Sun, 10 Jul 2005 06:34:13 -0700
  Finished at: Sun, 10 Jul 2005 06:48:08 -0700
  Total time: 13m 55s
  Building machine hostname: yami
****************************************************************************

****************************************************************************
Standard output:
****************************************************************************
 __  __
|  \/  |__ _Apache__ ___
| |\/| / _` \ V / -_) ' \  ~ intelligent projects ~
|_|  |_\__,_|\_/\___|_||_|  v. 1.0.2

Tag library requested that is not present: 'local:modules' in plugin: 'null'
build:start:

clean:clean:

init:

jar:install:
multiproject:projects-init:
    [echo] Gathering project list
Starting the reactor...
Our processing order:
ActiveMQ :: Core
ActiveMQ :: Optional
ActiveMQ :: Resource Adapter
ActiveMQ :: GBeans
ActiveMQ :: Web
ActiveMQ :: Container
ActiveMQ :: Assembly
+----------------------------------------
| Gathering project list ActiveMQ :: Core
| Memory: 5M/9M
+----------------------------------------
+----------------------------------------
| Gathering project list ActiveMQ :: Optional
| Memory: 5M/9M
+----------------------------------------
+----------------------------------------
| Gathering project list ActiveMQ :: Resource Adapter
| Memory: 5M/9M
+----------------------------------------
+----------------------------------------
| Gathering project list ActiveMQ :: GBeans
| Memory: 5M/9M
+----------------------------------------
+----------------------------------------
| Gathering project list ActiveMQ :: Web
| Memory: 5M/9M
+----------------------------------------
+----------------------------------------
| Gathering project list ActiveMQ :: Container
| Memory: 5M/9M
+----------------------------------------
+----------------------------------------
| Gathering project list ActiveMQ :: Assembly
| Memory: 5M/9M
+----------------------------------------
Starting the reactor...
Our processing order:
ActiveMQ :: Core
ActiveMQ :: Optional
ActiveMQ :: Resource Adapter
ActiveMQ :: GBeans
ActiveMQ :: Web
ActiveMQ :: Container
ActiveMQ :: Assembly
+----------------------------------------
| Executing jar:install ActiveMQ :: Core
| Memory: 5M/9M
+----------------------------------------
Attempting to download activecluster-1.1-SNAPSHOT.jar.

multiproject:goal:
build:start:

java:prepare-filesystem:

java:compile:
    [depend] Deleted 0 out of date files in 2 seconds
    [echo] Compiling to /home/existusr/continuum-1.0-alpha-2/apps/continuum/temp/1/modules/core/target/classes
    [javac] Compiling 2 source files to /home/existusr/continuum-1.0-alpha-2/apps/continuum/temp/1/modules/core/target/classes

java:jar-resources:

test:prepare-filesystem:

test:test-resources:

test:compile:

test:test:
    [junit] Running org.activemq.JmsQueueSendReceiveTwoConnectionsTest
    [junit] Tests run: 1, Failures: 0, Errors: 0, Time elapsed: 5.609 sec
    [junit] Running org.activemq.JmsQueueWildcardSendReceiveTest
    [junit] Tests run: 1, Failures: 0, Errors: 0, Time elapsed: 4.787 sec
    [junit] Running org.activemq.store.journal.JournalQueueMessageContainerTest
    [junit] Tests run: 1, Failures: 0, Errors: 0, Time elapsed: 0.334 sec
    [junit] Running org.activemq.store.journal.JournalTopicMessageContainerTest
    [junit] Tests run: 1, Failures: 0, Errors: 0, Time elapsed: 0.328 sec
    [junit] Running org.activemq.store.journal.JournalQueueMessageStoreTest
    [junit] Tests run: 2, Failures: 0, Errors: 0, Time elapsed: 0.417 sec
    [junit] Running org.activemq.store.jdbc.JDBCTopicMessageContainerTest
    [junit] Tests run: 1, Failures: 0, Errors: 0, Time elapsed: 3.05 sec
    [junit] Running org.activemq.store.jdbc.JDBCQueueMessageStoreTest
    [junit] Tests run: 2, Failures: 0, Errors: 0, Time elapsed: 3.955 sec
    [junit] Running org.activemq.store.jdbc.JDBCQueueMessageContainerTest
    [junit] Tests run: 1, Failures: 0, Errors: 0, Time elapsed: 3.17 sec
    [junit] Running org.activemq.store.jdbc.PersistenceAdapterTest
    [junit] Tests run: 1, Failures: 0, Errors: 0, Time elapsed: 2.807 sec
    [junit] Running org.activemq.store.vm.VMQueueMessageContainerTest
    [junit] Tests run: 1, Failures: 0, Errors: 0, Time elapsed: 0.081 sec
    [junit] Running org.activemq.store.vm.VMTopicMessageContainerTest
    [junit] Tests run: 1, Failures: 0, Errors: 0, Time elapsed: 0.07 sec
    [junit] Running org.activemq.FragmentTransientQueueTest
    [junit] Tests run: 1, Failures: 0, Errors: 0, Time elapsed: 10.283 sec
    [junit] Running org.activemq.JmsDurableTopicWildcardSendReceiveTest
    [junit] Tests run: 1, Failures: 0, Errors: 0, Time elapsed: 4.897 sec
    [junit] Running org.activemq.test.RollbackTest
    [junit] Tests run: 1, Failures: 0, Errors: 0, Time elapsed: 6.064 sec
    [junit] Running org.activemq.test.JmsTopicSendReceiveTest
    [junit] Tests run: 1, Failures: 0, Errors: 0, Time elapsed: 4.725 sec
    [junit] Running org.activemq.test.QueueSendReceiveTest
    [junit] Tests run: 2, Failures: 0, Errors: 0, Time elapsed: 6.866 sec
    [junit] Running org.activemq.test.JmsTopicSendReceiveWithTwoConnectionsTest
    [junit] Tests run: 1, Failures: 0, Errors: 0, Time elapsed: 5.195 sec
    [junit] Running org.activemq.test.SendReceiveTest
    [junit] Tests run: 2, Failures: 0, Errors: 0, Time elapsed: 6.379 sec
    [junit] Running org.activemq.ConnectionCleanupTest
    [junit] Tests run: 1, Failures: 0, Errors: 0, Time elapsed: 4.465 sec
    [junit] Running org.activemq.JmsQueueSendReceiveUsingTwoSessionsTest
    [junit] Tests run: 1, Failures: 0, Errors: 0, Time elapsed: 4.684 sec
    [junit] Running org.activemq.JmsDurableSubscriptionTest
    [junit] Tests run: 1, Failures: 0, Errors: 0, Time elapsed: 3.844 sec
    [junit] Running org.activemq.message.SessionInfoTest
    [junit] Tests run: 4, Failures: 0, Errors: 0, Time elapsed: 0.032 sec
    [junit] Running org.activemq.message.ActiveMQObjectMessageTest
    [junit] Tests run: 2, Failures: 0, Errors: 0, Time elapsed: 0.072 sec
    [junit] Running org.activemq.message.ActiveMQTextMessageTest
    [junit] Tests run: 3, Failures: 0, Errors: 0, Time elapsed: 0.057 sec
    [junit] Running org.activemq.message.ActiveMQDestinationTest
    [junit] Tests run: 10, Failures: 0, Errors: 0, Time elapsed: 0.037 sec
    [junit] Running org.activemq.message.ActiveMQBytesMessageTest
    [junit] Tests run: 18, Failures: 0, Errors: 0, Time elapsed: 0.078 sec
    [junit] Running org.activemq.message.ActiveMQStreamMessageTest
    [junit] Tests run: 15, Failures: 0, Errors: 0, Time elapsed: 0.071 sec
    [junit] Running org.activemq.message.PackageFacadeTest
    [junit] Tests run: 2, Failures: 0, Errors: 0, Time elapsed: 0.268 sec
    [junit] Running org.activemq.message.ActiveMQXidTest
    [junit] Tests run: 1, Failures: 0, Errors: 0, Time elapsed: 0.184 sec
    [junit] Running org.activemq.message.ActiveMQMessageTest
    [junit] Tests run: 51, Failures: 0, Errors: 0, Time elapsed: 0.077 sec
    [junit] Running org.activemq.message.ActiveMQMapMessageTest
    [junit] Tests run: 29, Failures: 0, Errors: 0, Time elapsed: 0.062 sec
    [junit] Running org.activemq.JmsTopicSendReceiveTest
    [junit] Tests run: 1, Failures: 0, Errors: 0, Time elapsed: 4.688 sec
    [junit] Running org.activemq.JmsConnectionStartStopTest
    [junit] Tests run: 2, Failures: 0, Errors: 0, Time elapsed: 11.581 sec
    [junit] Running org.activemq.security.jassjacc.PropertiesConfigLoaderTest
    [junit] Tests run: 1, Failures: 0, Errors: 0, Time elapsed: 0.075 sec
    [junit] Running org.activemq.FragmentPersistentQueueTest
    [junit] Tests run: 1, Failures: 0, Errors: 0, Time elapsed: 12.696 sec
    [junit] Running org.activemq.JmsTopicTransactionTest
    [junit] Tests run: 8, Failures: 0, Errors: 0, Time elapsed: 28.172 sec
    [junit] Running org.activemq.jndi.ActiveMQInitialContextFactoryTest
    [junit] Tests run: 2, Failures: 0, Errors: 0, Time elapsed: 4.02 sec
    [junit] Running org.activemq.jndi.CustomConnectionFactoryNameTest
    [junit] Tests run: 3, Failures: 0, Errors: 0, Time elapsed: 3.798 sec
    [junit] Running org.activemq.jndi.InitialContextTest
    [junit] Tests run: 2, Failures: 0, Errors: 0, Time elapsed: 0.413 sec
    [junit] Running org.activemq.jndi.DestinationNameWithSlashTest
    [junit] Tests run: 1, Failures: 0, Errors: 0, Time elapsed: 2.681 sec
    [junit] Running org.activemq.jndi.AdminObjectTest
    [junit] Tests run: 1, Failures: 0, Errors: 0, Time elapsed: 0.046 sec
    [junit] Running org.activemq.filter.DestinationFilterTest
    [junit] Tests run: 9, Failures: 0, Errors: 0, Time elapsed: 0.053 sec
    [junit] Running org.activemq.filter.MultiExpressionEvaluatorTest
    [junit] Tests run: 3, Failures: 0, Errors: 0, Time elapsed: 0.69 sec
    [junit] Running org.activemq.filter.DestinationMapTest
    [junit] Tests run: 8, Failures: 0, Errors: 0, Time elapsed: 0.065 sec
    [junit] Running org.activemq.filter.DestinationPathTest
    [junit] Tests run: 1, Failures: 0, Errors: 0, Time elapsed: 0.034 sec
    [junit] Running org.activemq.JmsCreateConsumerInOnMessageTest
    [junit] Tests run: 1, Failures: 0, Errors: 0, Time elapsed: 4.274 sec
    [junit] Running org.activemq.capacity.BasicCapacityMonitorTest
    [junit] Tests run: 1, Failures: 0, Errors: 0, Time elapsed: 0.048 sec
    [junit] Running org.activemq.io.impl.ActiveMQMapMessageReaderTest
    [junit] Tests run: 4, Failures: 0, Errors: 0, Time elapsed: 12.626 sec
    [junit] Running org.activemq.io.impl.DefaultWireFormatTest
    [junit] Tests run: 4, Failures: 0, Errors: 0, Time elapsed: 0.278 sec
    [junit] Running org.activemq.io.impl.MessageAckReaderTest
    [junit] Tests run: 3, Failures: 0, Errors: 0, Time elapsed: 1.35 sec
    [junit] Running org.activemq.io.impl.ActiveMQMessageReaderTest
    [junit] Tests run: 3, Failures: 0, Errors: 0, Time elapsed: 12.092 sec
    [junit] Running org.activemq.io.impl.ActiveMQBytesMessageReaderTest
    [junit] Tests run: 4, Failures: 0, Errors: 0, Time elapsed: 12.724 sec
    [junit] Running org.activemq.io.impl.ReceiptReaderTest
    [junit] Tests run: 7, Failures: 0, Errors: 0, Time elapsed: 0.654 sec
    [junit] Running org.activemq.io.impl.ActiveMQTextMessageReaderTest
    [junit] Tests run: 4, Failures: 0, Errors: 0, Time elapsed: 12.447 sec
    [junit] Running org.activemq.io.impl.ActiveMQObjectMessageReaderTest
    [junit] Tests run: 4, Failures: 0, Errors: 0, Time elapsed: 12.699 sec
    [junit] Running org.activemq.io.impl.XATransactionInfoReaderTest
    [junit] Tests run: 8, Failures: 0, Errors: 0, Time elapsed: 0.649 sec
    [junit] Running org.activemq.io.impl.TransactionInfoReaderTest
    [junit] Tests run: 7, Failures: 0, Errors: 0, Time elapsed: 0.651 sec
    [junit] Running org.activemq.io.impl.ProducerInfoReaderTest
    [junit] Tests run: 3, Failures: 0, Errors: 0, Time elapsed: 1.042 sec
    [junit] Running org.activemq.io.impl.ConsumerInfoReaderTest
    [junit] Tests run: 3, Failures: 0, Errors: 0, Time elapsed: 2.169 sec
    [junit] Running org.activemq.io.impl.ActiveMQStreamMessageReaderTest
    [junit] Tests run: 4, Failures: 0, Errors: 0, Time elapsed: 12.633 sec
    [junit] Running org.activemq.io.WireFormatLoaderTest
    [junit] Tests run: 1, Failures: 0, Errors: 0, Time elapsed: 0.238 sec
    [junit] Running org.activemq.io.util.MemoryBoundedMessageCacheTest
    [junit] Tests run: 2, Failures: 0, Errors: 0, Time elapsed: 0.049 sec
    [junit] Running org.activemq.io.util.ByteArrayFragmentationTest
    [junit] Tests run: 1, Failures: 0, Errors: 0, Time elapsed: 1.807 sec
    [junit] Running org.activemq.io.util.ByteArrayCompressionTest
    [junit] Tests run: 1, Failures: 0, Errors: 0, Time elapsed: 0.045 sec
    [junit] Running org.activemq.io.util.MemoryBoundedQueueTest
    [junit] Tests run: 12, Failures: 0, Errors: 0, Time elapsed: 4.245 sec
    [junit] Running org.activemq.JmsSessionRecoverTest
    [junit] Tests run: 6, Failures: 0, Errors: 0, Time elapsed: 13.889 sec
    [junit] Running org.activemq.JmsTempDestinationTest
    [junit] Tests run: 6, Failures: 0, Errors: 0, Time elapsed: 17.824 sec
    [junit] Running org.activemq.advisories.ConsumerAdvisorTest
    [junit] Tests run: 1, Failures: 0, Errors: 0, Time elapsed: 4.42 sec
    [junit] Running org.activemq.advisories.ProducerDemandAdvisorTest
    [junit] Tests run: 2, Failures: 0, Errors: 0, Time elapsed: 6.093 sec
    [junit] Running org.activemq.advisories.ConnectionAdvisorTest
    [junit] Tests run: 1, Failures: 0, Errors: 0, Time elapsed: 4.386 sec
    [junit] Running org.activemq.advisories.TempDestinationAdvisorTest
    [junit] Tests run: 1, Failures: 0, Errors: 0, Time elapsed: 14.377 sec
    [junit] Running org.activemq.advisories.ProducerAdvisorTest
    [junit] Tests run: 1, Failures: 0, Errors: 0, Time elapsed: 4.352 sec
    [junit] Running org.activemq.management.BoundaryStatisticTest
    [junit] Tests run: 1, Failures: 0, Errors: 0, Time elapsed: 0.032 sec
    [junit] Running org.activemq.management.RangeStatisticTest
    [junit] Tests run: 1, Failures: 0, Errors: 0, Time elapsed: 0.534 sec
    [junit] Running org.activemq.management.BoundedRangeStatisticTest
    [junit] Tests run: 1, Failures: 0, Errors: 0, Time elapsed: 0.535 sec
    [junit] Running org.activemq.management.TimeStatisticTest
    [junit] Tests run: 1, Failures: 0, Errors: 0, Time elapsed: 0.534 sec
    [junit] Running org.activemq.management.CountStatisticTest
    [junit] Tests run: 1, Failures: 0, Errors: 0, Time elapsed: 0.544 sec
    [junit] Running org.activemq.ActiveMQMessageAuditTest
    [junit] Tests run: 1, Failures: 0, Errors: 0, Time elapsed: 0.405 sec
    [junit] Running org.activemq.JmsTopicRequestReplyTest
    [junit] Tests run: 2, Failures: 0, Errors: 0, Time elapsed: 7.129 sec
    [junit] Running org.activemq.JmsQueueTransactionTest
    [junit] Tests run: 11, Failures: 0, Errors: 0, Time elapsed: 43.809 sec
    [junit] Running org.activemq.streams.JMSInputStreamTest
    [junit] Tests run: 2, Failures: 0, Errors: 0, Time elapsed: 9.686 sec
    [junit] Running org.activemq.BrokerAdminCommandsTest
    [junit] Tests run: 1, Failures: 0, Errors: 0, Time elapsed: 5.897 sec
    [junit] Running org.activemq.JmsClientAckTest
    [junit] Tests run: 2, Failures: 0, Errors: 0, Time elapsed: 8.667 sec
    [junit] Running org.activemq.JmsTopicWildcardSendReceiveTest
    [junit] Tests run: 1, Failures: 0, Errors: 0, Time elapsed: 4.644 sec
    [junit] Running org.activemq.EmbeddedBrokerTest
    [junit] Tests run: 2, Failures: 0, Errors: 0, Time elapsed: 4.107 sec
    [junit] Running org.activemq.FragmentTopicTest
    [junit] Tests run: 1, Failures: 0, Errors: 0, Time elapsed: 23.704 sec
    [junit] Running org.activemq.JmsTopicSendReceiveSubscriberTest
    [junit] Tests run: 1, Failures: 0, Errors: 0, Time elapsed: 16.089 sec
    [junit] Running org.activemq.JmsTopicSendReceiveWithTwoConnectionsTest
    [junit] Tests run: 1, Failures: 0, Errors: 0, Time elapsed: 18.613 sec
    [junit] Running org.activemq.JmsDurableTopicSendReceiveTest
    [junit] Tests run: 1, Failures: 0, Errors: 0, Time elapsed: 4.948 sec
    [junit] Running org.activemq.JmsQueueSendReceiveTest
    [junit] Tests run: 1, Failures: 0, Errors: 0, Time elapsed: 4.985 sec
    [junit] Running org.activemq.broker.impl.AdvisorySupportTest
    [junit] Tests run: 3, Failures: 0, Errors: 0, Time elapsed: 0.321 sec
    [junit] Running org.activemq.broker.BrokerAdminTest
    [junit] Tests run: 3, Failures: 0, Errors: 0, Time elapsed: 3.273 sec
    [junit] Running org.activemq.JmsRedeliveredTest
    [junit] Tests run: 16, Failures: 0, Errors: 0, Time elapsed: 33.369 sec
    [junit] Running org.activemq.CompressionMessageTest
    [junit] Tests run: 1, Failures: 0, Errors: 0, Time elapsed: 9.257 sec
    [junit] Running org.activemq.selector.SelectorParserTest
    [junit] Tests run: 2, Failures: 0, Errors: 0, Time elapsed: 0.214 sec
    [junit] Running org.activemq.selector.SelectorTest
    [junit] Tests run: 17, Failures: 0, Errors: 0, Time elapsed: 0.357 sec
    [junit] Running org.activemq.service.TopicBrokerTest
    [junit] Tests run: 1, Failures: 0, Errors: 0, Time elapsed: 2.944 sec
    [junit] Running org.activemq.service.impl.XATransactionTest
    [junit] Tests run: 1, Failures: 0, Errors: 0, Time elapsed: 0.032 sec
    [junit] Running org.activemq.service.impl.LocalTransactionCommandTest
    [junit] Tests run: 1, Failures: 0, Errors: 0, Time elapsed: 0.035 sec
    [junit] Running org.activemq.service.impl.XATransactionCommandTest
    [junit] Tests run: 1, Failures: 0, Errors: 0, Time elapsed: 0.036 sec
    [junit] Running org.activemq.service.impl.DefaultQueueListTest
    [junit] Tests run: 5, Failures: 0, Errors: 0, Time elapsed: 0.036 sec
    [junit] Running org.activemq.service.QueueBrokerTest
    [junit] Tests run: 1, Failures: 0, Errors: 0, Time elapsed: 2.563 sec
    [junit] Running org.activemq.service.TransientQueueGarbageCollectionTest
    [junit] Tests run: 2, Failures: 0, Errors: 0, Time elapsed: 4.272 sec
    [junit] Running org.activemq.service.SimpleTopicBrokerTest
    [junit] Tests run: 1, Failures: 0, Errors: 0, Time elapsed: 2.438 sec
    [junit] Running org.activemq.service.AsyncSimpleBrokerTest
    [junit] Tests run: 1, Failures: 0, Errors: 0, Time elapsed: 2.559 sec
    [junit] Running org.activemq.service.SimpleQueueBrokerTest
    [junit] Tests run: 1, Failures: 0, Errors: 0, Time elapsed: 2.913 sec
    [junit] Running org.activemq.JmsTopicSendSameMessageTest
    [junit] Tests run: 1, Failures: 0, Errors: 0, Time elapsed: 5.19 sec
    [junit] Running org.activemq.spring.SpringTest
    [junit] Tests run: 5, Failures: 0, Errors: 0, Time elapsed: 15.905 sec
    [junit] Running org.activemq.JmsQueueRequestReplyTest
    [junit] Tests run: 2, Failures: 0, Errors: 0, Time elapsed: 7.919 sec
    [junit] Running org.activemq.util.BitArrayTest
    [junit] Tests run: 4, Failures: 0, Errors: 0, Time elapsed: 0.355 sec
    [junit] Running org.activemq.util.IdGeneratorTest
    [junit] Tests run: 4, Failures: 0, Errors: 0, Time elapsed: 0.833 sec
    [junit] Running org.activemq.util.JmsLogAppenderTest
    [junit] Tests run: 1, Failures: 0, Errors: 0, Time elapsed: 0.031 sec
    [junit] Running org.activemq.util.ReflectionSupportTest
    [junit] Tests run: 1, Failures: 0, Errors: 0, Time elapsed: 0.184 sec
    [junit] Running org.activemq.util.BitArrayBinTest
    [junit] Tests run: 2, Failures: 0, Errors: 0, Time elapsed: 0.035 sec
    [junit] Running org.activemq.util.URIHelperTest
    [junit] Tests run: 3, Failures: 0, Errors: 0, Time elapsed: 0.038 sec
    [junit] Running org.activemq.util.AsyncProxyTest
    [junit] Tests run: 1, Failures: 0, Errors: 0, Time elapsed: 60.206 sec
    [junit] Running org.activemq.JmsDurableTopicTransactionTest
    [junit] Tests run: 8, Failures: 0, Errors: 0, Time elapsed: 27.395 sec
    [junit] Running org.activemq.JmsQueueXATransactionTest
    [junit] Tests run: 4, Failures: 0, Errors: 0, Time elapsed: 13.361 sec
    [junit] Running org.activemq.transport.composite.CompositeTransportChannelTest
    [junit] Tests run: 4, Failures: 0, Errors: 0, Time elapsed: 0.394 sec
    [junit] Running org.activemq.transport.composite.CompositeTransportChannelWithLeadingSlashesTest
    [junit] Tests run: 4, Failures: 0, Errors: 0, Time elapsed: 0.372 sec
    [junit] Running org.activemq.transport.UriParseTest
    [junit] Tests run: 4, Failures: 0, Errors: 0, Time elapsed: 0.111 sec
    [junit] Running org.activemq.transport.reliable.ReliableTransportChannelTest
    [junit] Tests run: 4, Failures: 0, Errors: 0, Time elapsed: 0.377 sec
    [junit] Running org.activemq.transport.reliable.ReliableTransportChannelFactoryTest
    [junit] Tests run: 1, Failures: 0, Errors: 0, Time elapsed: 0.044 sec
    [junit] Running org.activemq.transport.activeio.ActiveIOTopicSendReceiveTwoConnectionsTest
    [junit] Tests run: 3, Failures: 0, Errors: 0, Time elapsed: 11.926 sec
    [junit] Running org.activemq.transport.activeio.ActiveIOQueueSendReceiveTwoConnectionsTest
    [junit] Tests run: 2, Failures: 0, Errors: 0, Time elapsed: 7.94 sec
    [junit] Running org.activemq.transport.activeio.ActiveIOTransportChannelTest
    [junit] Tests run: 12, Failures: 0, Errors: 0, Time elapsed: 0.777 sec
    [junit] Running org.activemq.transport.activeio.ActiveIOQueueSendReceiveTest
    [junit] Tests run: 3, Failures: 0, Errors: 0, Time elapsed: 9.733 sec
    [junit] Running org.activemq.transport.activeio.URIConverterTest
    [junit] Tests run: 1, Failures: 0, Errors: 0, Time elapsed: 0.035 sec
    [junit] Running org.activemq.transport.activeio.ActiveIOTopicSendReceiveTest
    [junit] Tests run: 2, Failures: 0, Errors: 0, Time elapsed: 8.019 sec
    [junit] Running org.activemq.transport.jabber.JabberWireFormatTest
    [junit] Tests run: 1, Failures: 0, Errors: 0, Time elapsed: 0.046 sec
    [junit] Running org.activemq.transport.tcp.TcpTransportChannelTest
    [junit] Tests run: 4, Failures: 0, Errors: 0, Time elapsed: 0.334 sec
    [junit] Running org.activemq.transport.tcp.TcpQueueSendReceiveTwoConnectionsTest
    [junit] Tests run: 1, Failures: 0, Errors: 0, Time elapsed: 4.591 sec
    [junit] Running org.activemq.transport.tcp.TcpQueueSendReceiveTest
    [junit] Tests run: 1, Failures: 0, Errors: 0, Time elapsed: 4.288 sec
    [junit] Running org.activemq.transport.tcp.TcpTopicSendReceiveTwoConnectionsTest
    [junit] Tests run: 1, Failures: 0, Errors: 0, Time elapsed: 4.392 sec
    [junit] Running org.activemq.transport.tcp.TcpTopicSendReceiveTest
    [junit] Tests run: 1, Failures: 0, Errors: 0, Time elapsed: 4.552 sec
    [junit] Running org.activemq.transport.tcp.ExceptionListenerTest
    [junit] Tests run: 1, Failures: 0, Errors: 0, Time elapsed: 3.939 sec
    [junit] Running org.activemq.JmsDurableQueueWildcardSendReceiveTest
    [junit] Tests run: 1, Failures: 0, Errors: 0, Time elapsed: 5.051 sec

jar:jar:
    [jar] Building jar: /home/existusr/continuum-1.0-alpha-2/apps/continuum/temp/1/modules/core/target/activemq-core-3.1-SNAPSHOT.jar
Copying: from '/home/existusr/continuum-1.0-alpha-2/apps/continuum/temp/1/modules/core/target/activemq-core-3.1-SNAPSHOT.jar' to: '/home/existusr/.maven/repository/activemq/jars/activemq-core-3.1-SNAPSHOT.jar'
Copying: from '/home/existusr/continuum-1.0-alpha-2/apps/continuum/temp/1/modules/core/project.xml' to: '/home/existusr/.maven/repository/activemq/poms/activemq-core-3.1-SNAPSHOT.pom'
+----------------------------------------
| Executing jar:install ActiveMQ :: Optional
| Memory: 20M/21M
+----------------------------------------
Attempting to download activemq-core-3.1-SNAPSHOT.jar.
Attempting to download activemq-core-test-3.1-SNAPSHOT.jar.
Artifact /activemq/jars/activemq-core-test-3.1-SNAPSHOT.jar doesn't exists in remote repository, but it exists locally
Attempting to download geronimo-kernel-1.0-SNAPSHOT.jar.
Attempting to download geronimo-system-1.0-SNAPSHOT.jar.
Attempting to download org.mortbay.jetty-5.1-SNAPSHOT.jar.

jar:install:

build:end:

build:start:

java:prepare-filesystem:

java:compile:
    [depend] Deleted 0 out of date files in 0 seconds
    [echo] Compiling to /home/existusr/continuum-1.0-alpha-2/apps/continuum/temp/1/modules/optional/target/classes

java:jar-resources:

test:prepare-filesystem:

test:test-resources:

test:compile:

test:test:
    [echo] NOTICE: Skipping tests; they seem to have passed already
    [echo] No tests to run.
Copying: from '/home/existusr/continuum-1.0-alpha-2/apps/continuum/temp/1/modules/optional/target/activemq-optional-3.1-SNAPSHOT.jar' to: '/home/existusr/.maven/repository/activemq/jars/activemq-optional-3.1-SNAPSHOT.jar'
Copying: from '/home/existusr/continuum-1.0-alpha-2/apps/continuum/temp/1/modules/optional/project.xml' to: '/home/existusr/.maven/repository/activemq/poms/activemq-optional-3.1-SNAPSHOT.pom'
+----------------------------------------
| Executing jar:install ActiveMQ :: Resource Adapter
| Memory: 8M/21M
+----------------------------------------
Attempting to download activemq-core-3.1-SNAPSHOT.jar.
Attempting to download activemq-optional-3.1-SNAPSHOT.jar.
Attempting to download activemq-core-test-3.1-SNAPSHOT.jar.
Artifact /activemq/jars/activemq-core-test-3.1-SNAPSHOT.jar doesn't exists in remote repository, but it exists locally
Attempting to download activecluster-1.1-SNAPSHOT.jar.

jar:jar:

jar:install:

build:end:

build:start:

java:prepare-filesystem:

java:compile:
    [depend] Deleted 0 out of date files in 0 seconds
    [echo] Compiling to /home/existusr/continuum-1.0-alpha-2/apps/continuum/temp/1/modules/ra/target/classes
    [javac] Compiling 10 source files to /home/existusr/continuum-1.0-alpha-2/apps/continuum/temp/1/modules/ra/target/classes

java:jar-resources:

test:prepare-filesystem:

test:test-resources:

test:compile:

test:test:
    [junit] Running org.activemq.ra.MessageEndpointProxyTest
    [junit] Tests run: 5, Failures: 0, Errors: 0, Time elapsed: 0.261 sec
    [junit] Running org.activemq.ra.CircularQueueTest
    [junit] Tests run: 1, Failures: 0, Errors: 0, Time elapsed: 0.033 sec
    [junit] Running org.activemq.ra.ManagedConnectionFactoryTest
    [junit] Tests run: 4, Failures: 0, Errors: 1, Time elapsed: 3.937 sec
    [junit] [ERROR] TEST org.activemq.ra.ManagedConnectionFactoryTest FAILED
    [junit] Running org.activemq.ra.ManagedConnectionTest
    [junit] Tests run: 9, Failures: 0, Errors: 9, Time elapsed: 0.057 sec
    [junit] [ERROR] TEST org.activemq.ra.ManagedConnectionTest FAILED
    [junit] Running org.activemq.ra.ActiveMQAsfEndpointWorkerTest
    [junit] Tests run: 1, Failures: 0, Errors: 0, Time elapsed: 0.662 sec
    [junit] Running org.activemq.ra.ActiveMQActivationSpecTest
    [junit] Tests run: 25, Failures: 3, Errors: 0, Time elapsed: 0.096 sec
    [junit] [ERROR] TEST org.activemq.ra.ActiveMQActivationSpecTest FAILED
    [junit] Running org.activemq.ra.ActiveMQResourceAdapterJavaBeanEqualityTest
    [junit] Tests run: 17, Failures: 3, Errors: 0, Time elapsed: 0.193 sec
    [junit] [ERROR] TEST org.activemq.ra.ActiveMQResourceAdapterJavaBeanEqualityTest FAILED
Total time: 13 minutes 54 seconds
Finished at: Sun Jul 10 06:48:08 PDT 2005


****************************************************************************

****************************************************************************
Standard error:
****************************************************************************

BUILD FAILED
File...... /home/existusr/.maven/cache/maven-multiproject-plugin-1.3.1/plugin.jelly
Element... maven:reactor
Line...... 217
Column.... 9
Unable to obtain goal [test:test] -- /home/existusr/.maven/cache/maven-test-plugin-1.6.2/plugin.jelly:181:54: <fail> There were test failures.

****************************************************************************