[activemq-dev] [continuum] BUILD FAILURE: ActiveMQ

Previous Topic Next Topic
 
classic Classic list List threaded Threaded
1 message Options
Reply | Threaded
Open this post in threaded view
|

[activemq-dev] [continuum] BUILD FAILURE: ActiveMQ

Continuum@yami
****************************************************************************
Build statistics:
  State: Failed
  Previous State: Ok
  Started at: Fri, 8 Jul 2005 09:34:13 -0700
  Finished at: Fri, 8 Jul 2005 09:47:45 -0700
  Total time: 13m 32s
  Building machine hostname: yami
****************************************************************************

****************************************************************************
Standard output:
****************************************************************************
 __  __
|  \/  |__ _Apache__ ___
| |\/| / _` \ V / -_) ' \  ~ intelligent projects ~
|_|  |_\__,_|\_/\___|_||_|  v. 1.0.2

Tag library requested that is not present: 'local:modules' in plugin: 'null'
build:start:

clean:clean:

init:

jar:install:
multiproject:projects-init:
    [echo] Gathering project list
Starting the reactor...
Our processing order:
ActiveMQ :: Core
ActiveMQ :: Optional
ActiveMQ :: Resource Adapter
ActiveMQ :: GBeans
ActiveMQ :: Web
ActiveMQ :: Container
ActiveMQ :: Assembly
+----------------------------------------
| Gathering project list ActiveMQ :: Core
| Memory: 5M/9M
+----------------------------------------
+----------------------------------------
| Gathering project list ActiveMQ :: Optional
| Memory: 5M/9M
+----------------------------------------
+----------------------------------------
| Gathering project list ActiveMQ :: Resource Adapter
| Memory: 5M/9M
+----------------------------------------
+----------------------------------------
| Gathering project list ActiveMQ :: GBeans
| Memory: 5M/9M
+----------------------------------------
+----------------------------------------
| Gathering project list ActiveMQ :: Web
| Memory: 5M/9M
+----------------------------------------
+----------------------------------------
| Gathering project list ActiveMQ :: Container
| Memory: 5M/9M
+----------------------------------------
+----------------------------------------
| Gathering project list ActiveMQ :: Assembly
| Memory: 5M/9M
+----------------------------------------
Starting the reactor...
Our processing order:
ActiveMQ :: Core
ActiveMQ :: Optional
ActiveMQ :: Resource Adapter
ActiveMQ :: GBeans
ActiveMQ :: Web
ActiveMQ :: Container
ActiveMQ :: Assembly
+----------------------------------------
| Executing jar:install ActiveMQ :: Core
| Memory: 5M/9M
+----------------------------------------
Attempting to download activecluster-1.1-SNAPSHOT.jar.

multiproject:goal:
build:start:

java:prepare-filesystem:

java:compile:
    [depend] Deleted 0 out of date files in 2 seconds
    [echo] Compiling to /home/existusr/continuum-1.0-alpha-2/apps/continuum/temp/1/modules/core/target/classes
    [javac] Compiling 1 source file to /home/existusr/continuum-1.0-alpha-2/apps/continuum/temp/1/modules/core/target/classes

java:jar-resources:

test:prepare-filesystem:

test:test-resources:
Copying 1 file to /home/existusr/continuum-1.0-alpha-2/apps/continuum/temp/1/modules/core/target/test-classes

test:compile:
    [jar] Building jar: /home/existusr/continuum-1.0-alpha-2/apps/continuum/temp/1/modules/core/target/activemq-core-test-3.1-SNAPSHOT.jar
    [copy] Copying 1 file to /home/existusr/.maven/repository/activemq/jars

test:test:
    [junit] Running org.activemq.JmsQueueSendReceiveTwoConnectionsTest
    [junit] Tests run: 1, Failures: 0, Errors: 0, Time elapsed: 5.526 sec
    [junit] Running org.activemq.JmsQueueWildcardSendReceiveTest
    [junit] Tests run: 1, Failures: 0, Errors: 0, Time elapsed: 4.795 sec
    [junit] Running org.activemq.store.journal.JournalQueueMessageContainerTest
    [junit] Tests run: 1, Failures: 0, Errors: 0, Time elapsed: 0.336 sec
    [junit] Running org.activemq.store.journal.JournalTopicMessageContainerTest
    [junit] Tests run: 1, Failures: 0, Errors: 0, Time elapsed: 0.33 sec
    [junit] Running org.activemq.store.journal.JournalQueueMessageStoreTest
    [junit] Tests run: 2, Failures: 0, Errors: 0, Time elapsed: 0.412 sec
    [junit] Running org.activemq.store.jdbc.JDBCTopicMessageContainerTest
    [junit] Tests run: 1, Failures: 0, Errors: 0, Time elapsed: 3.173 sec
    [junit] Running org.activemq.store.jdbc.JDBCQueueMessageStoreTest
    [junit] Tests run: 2, Failures: 0, Errors: 0, Time elapsed: 4.336 sec
    [junit] Running org.activemq.store.jdbc.JDBCQueueMessageContainerTest
    [junit] Tests run: 1, Failures: 0, Errors: 0, Time elapsed: 3.099 sec
    [junit] Running org.activemq.store.jdbc.PersistenceAdapterTest
    [junit] Tests run: 1, Failures: 0, Errors: 0, Time elapsed: 2.817 sec
    [junit] Running org.activemq.store.vm.VMQueueMessageContainerTest
    [junit] Tests run: 1, Failures: 0, Errors: 0, Time elapsed: 0.082 sec
    [junit] Running org.activemq.store.vm.VMTopicMessageContainerTest
    [junit] Tests run: 1, Failures: 0, Errors: 0, Time elapsed: 0.07 sec
    [junit] Running org.activemq.FragmentTransientQueueTest
    [junit] Tests run: 1, Failures: 0, Errors: 0, Time elapsed: 10.339 sec
    [junit] Running org.activemq.JmsDurableTopicWildcardSendReceiveTest
    [junit] Tests run: 1, Failures: 0, Errors: 0, Time elapsed: 4.868 sec
    [junit] Running org.activemq.test.RollbackTest
    [junit] Tests run: 1, Failures: 0, Errors: 0, Time elapsed: 6.061 sec
    [junit] Running org.activemq.test.JmsTopicSendReceiveTest
    [junit] Tests run: 1, Failures: 0, Errors: 0, Time elapsed: 4.739 sec
    [junit] Running org.activemq.test.QueueSendReceiveTest
    [junit] Tests run: 2, Failures: 0, Errors: 0, Time elapsed: 6.861 sec
    [junit] Running org.activemq.test.JmsTopicSendReceiveWithTwoConnectionsTest
    [junit] Tests run: 1, Failures: 0, Errors: 0, Time elapsed: 5.185 sec
    [junit] Running org.activemq.test.SendReceiveTest
    [junit] Tests run: 2, Failures: 0, Errors: 0, Time elapsed: 6.409 sec
    [junit] Running org.activemq.ConnectionCleanupTest
    [junit] Tests run: 1, Failures: 0, Errors: 0, Time elapsed: 4.487 sec
    [junit] Running org.activemq.JmsQueueSendReceiveUsingTwoSessionsTest
    [junit] Tests run: 1, Failures: 0, Errors: 0, Time elapsed: 4.703 sec
    [junit] Running org.activemq.JmsDurableSubscriptionTest
    [junit] Tests run: 1, Failures: 0, Errors: 0, Time elapsed: 3.835 sec
    [junit] Running org.activemq.message.SessionInfoTest
    [junit] Tests run: 4, Failures: 0, Errors: 0, Time elapsed: 0.033 sec
    [junit] Running org.activemq.message.ActiveMQObjectMessageTest
    [junit] Tests run: 2, Failures: 0, Errors: 0, Time elapsed: 0.071 sec
    [junit] Running org.activemq.message.ActiveMQTextMessageTest
    [junit] Tests run: 3, Failures: 0, Errors: 0, Time elapsed: 0.058 sec
    [junit] Running org.activemq.message.ActiveMQDestinationTest
    [junit] Tests run: 10, Failures: 0, Errors: 0, Time elapsed: 0.037 sec
    [junit] Running org.activemq.message.ActiveMQBytesMessageTest
    [junit] Tests run: 18, Failures: 0, Errors: 0, Time elapsed: 0.078 sec
    [junit] Running org.activemq.message.ActiveMQStreamMessageTest
    [junit] Tests run: 15, Failures: 0, Errors: 0, Time elapsed: 0.071 sec
    [junit] Running org.activemq.message.PackageFacadeTest
    [junit] Tests run: 2, Failures: 0, Errors: 0, Time elapsed: 0.268 sec
    [junit] Running org.activemq.message.ActiveMQXidTest
    [junit] Tests run: 1, Failures: 0, Errors: 0, Time elapsed: 0.186 sec
    [junit] Running org.activemq.message.ActiveMQMessageTest
    [junit] Tests run: 51, Failures: 0, Errors: 0, Time elapsed: 0.077 sec
    [junit] Running org.activemq.message.ActiveMQMapMessageTest
    [junit] Tests run: 29, Failures: 0, Errors: 0, Time elapsed: 0.062 sec
    [junit] Running org.activemq.JmsTopicSendReceiveTest
    [junit] Tests run: 1, Failures: 0, Errors: 0, Time elapsed: 4.718 sec
    [junit] Running org.activemq.JmsConnectionStartStopTest
    [junit] Tests run: 2, Failures: 0, Errors: 0, Time elapsed: 11.566 sec
    [junit] Running org.activemq.security.jassjacc.PropertiesConfigLoaderTest
    [junit] Tests run: 1, Failures: 0, Errors: 0, Time elapsed: 0.076 sec
    [junit] Running org.activemq.FragmentPersistentQueueTest
    [junit] Tests run: 1, Failures: 0, Errors: 0, Time elapsed: 12.705 sec
    [junit] Running org.activemq.JmsTopicTransactionTest
    [junit] Tests run: 8, Failures: 0, Errors: 0, Time elapsed: 27.939 sec
    [junit] Running org.activemq.jndi.ActiveMQInitialContextFactoryTest
    [junit] Tests run: 2, Failures: 0, Errors: 0, Time elapsed: 3.929 sec
    [junit] Running org.activemq.jndi.CustomConnectionFactoryNameTest
    [junit] Tests run: 3, Failures: 0, Errors: 0, Time elapsed: 3.704 sec
    [junit] Running org.activemq.jndi.InitialContextTest
    [junit] Tests run: 3, Failures: 1, Errors: 0, Time elapsed: 0.423 sec
    [junit] [ERROR] TEST org.activemq.jndi.InitialContextTest FAILED
    [junit] Running org.activemq.jndi.DestinationNameWithSlashTest
    [junit] Tests run: 1, Failures: 0, Errors: 0, Time elapsed: 2.685 sec
    [junit] Running org.activemq.jndi.AdminObjectTest
    [junit] Tests run: 1, Failures: 0, Errors: 0, Time elapsed: 0.046 sec
    [junit] Running org.activemq.filter.DestinationFilterTest
    [junit] Tests run: 9, Failures: 0, Errors: 0, Time elapsed: 0.053 sec
    [junit] Running org.activemq.filter.MultiExpressionEvaluatorTest
    [junit] Tests run: 3, Failures: 0, Errors: 0, Time elapsed: 0.692 sec
    [junit] Running org.activemq.filter.DestinationMapTest
    [junit] Tests run: 8, Failures: 0, Errors: 0, Time elapsed: 0.064 sec
    [junit] Running org.activemq.filter.DestinationPathTest
    [junit] Tests run: 1, Failures: 0, Errors: 0, Time elapsed: 0.034 sec
    [junit] Running org.activemq.JmsCreateConsumerInOnMessageTest
    [junit] Tests run: 1, Failures: 0, Errors: 0, Time elapsed: 4.283 sec
    [junit] Running org.activemq.capacity.BasicCapacityMonitorTest
    [junit] Tests run: 1, Failures: 0, Errors: 0, Time elapsed: 0.048 sec
    [junit] Running org.activemq.io.impl.ActiveMQMapMessageReaderTest
    [junit] Tests run: 4, Failures: 0, Errors: 0, Time elapsed: 12.665 sec
    [junit] Running org.activemq.io.impl.DefaultWireFormatTest
    [junit] Tests run: 4, Failures: 0, Errors: 0, Time elapsed: 0.28 sec
    [junit] Running org.activemq.io.impl.MessageAckReaderTest
    [junit] Tests run: 3, Failures: 0, Errors: 0, Time elapsed: 1.352 sec
    [junit] Running org.activemq.io.impl.ActiveMQMessageReaderTest
    [junit] Tests run: 3, Failures: 0, Errors: 0, Time elapsed: 12.072 sec
    [junit] Running org.activemq.io.impl.ActiveMQBytesMessageReaderTest
    [junit] Tests run: 4, Failures: 0, Errors: 0, Time elapsed: 12.803 sec
    [junit] Running org.activemq.io.impl.ReceiptReaderTest
    [junit] Tests run: 7, Failures: 0, Errors: 0, Time elapsed: 0.653 sec
    [junit] Running org.activemq.io.impl.ActiveMQTextMessageReaderTest
    [junit] Tests run: 4, Failures: 0, Errors: 0, Time elapsed: 12.466 sec
    [junit] Running org.activemq.io.impl.ActiveMQObjectMessageReaderTest
    [junit] Tests run: 4, Failures: 0, Errors: 0, Time elapsed: 12.731 sec
    [junit] Running org.activemq.io.impl.XATransactionInfoReaderTest
    [junit] Tests run: 8, Failures: 0, Errors: 0, Time elapsed: 0.653 sec
    [junit] Running org.activemq.io.impl.TransactionInfoReaderTest
    [junit] Tests run: 7, Failures: 0, Errors: 0, Time elapsed: 0.647 sec
    [junit] Running org.activemq.io.impl.ProducerInfoReaderTest
    [junit] Tests run: 3, Failures: 0, Errors: 0, Time elapsed: 1.041 sec
    [junit] Running org.activemq.io.impl.ConsumerInfoReaderTest
    [junit] Tests run: 3, Failures: 0, Errors: 0, Time elapsed: 2.164 sec
    [junit] Running org.activemq.io.impl.ActiveMQStreamMessageReaderTest
    [junit] Tests run: 4, Failures: 0, Errors: 0, Time elapsed: 12.662 sec
    [junit] Running org.activemq.io.WireFormatLoaderTest
    [junit] Tests run: 1, Failures: 0, Errors: 0, Time elapsed: 0.237 sec
    [junit] Running org.activemq.io.util.MemoryBoundedMessageCacheTest
    [junit] Tests run: 2, Failures: 0, Errors: 0, Time elapsed: 0.05 sec
    [junit] Running org.activemq.io.util.ByteArrayFragmentationTest
    [junit] Tests run: 1, Failures: 0, Errors: 0, Time elapsed: 1.797 sec
    [junit] Running org.activemq.io.util.ByteArrayCompressionTest
    [junit] Tests run: 1, Failures: 0, Errors: 0, Time elapsed: 0.045 sec
    [junit] Running org.activemq.io.util.MemoryBoundedQueueTest
    [junit] Tests run: 12, Failures: 0, Errors: 0, Time elapsed: 4.232 sec
    [junit] Running org.activemq.JmsSessionRecoverTest
    [junit] Tests run: 6, Failures: 0, Errors: 0, Time elapsed: 13.872 sec
    [junit] Running org.activemq.JmsTempDestinationTest
    [junit] Tests run: 6, Failures: 0, Errors: 0, Time elapsed: 17.884 sec
    [junit] Running org.activemq.advisories.ConsumerAdvisorTest
    [junit] Tests run: 1, Failures: 0, Errors: 0, Time elapsed: 4.435 sec
    [junit] Running org.activemq.advisories.ProducerDemandAdvisorTest
    [junit] Tests run: 2, Failures: 0, Errors: 0, Time elapsed: 6.105 sec
    [junit] Running org.activemq.advisories.ConnectionAdvisorTest
    [junit] Tests run: 1, Failures: 0, Errors: 0, Time elapsed: 4.36 sec
    [junit] Running org.activemq.advisories.TempDestinationAdvisorTest
    [junit] Tests run: 1, Failures: 0, Errors: 0, Time elapsed: 14.335 sec
    [junit] Running org.activemq.advisories.ProducerAdvisorTest
    [junit] Tests run: 1, Failures: 0, Errors: 0, Time elapsed: 4.365 sec
    [junit] Running org.activemq.management.BoundaryStatisticTest
    [junit] Tests run: 1, Failures: 0, Errors: 0, Time elapsed: 0.031 sec
    [junit] Running org.activemq.management.RangeStatisticTest
    [junit] Tests run: 1, Failures: 0, Errors: 0, Time elapsed: 0.534 sec
    [junit] Running org.activemq.management.BoundedRangeStatisticTest
    [junit] Tests run: 1, Failures: 0, Errors: 0, Time elapsed: 0.534 sec
    [junit] Running org.activemq.management.TimeStatisticTest
    [junit] Tests run: 1, Failures: 0, Errors: 0, Time elapsed: 0.535 sec
    [junit] Running org.activemq.management.CountStatisticTest
    [junit] Tests run: 1, Failures: 0, Errors: 0, Time elapsed: 0.544 sec
    [junit] Running org.activemq.ActiveMQMessageAuditTest
    [junit] Tests run: 1, Failures: 0, Errors: 0, Time elapsed: 0.404 sec
    [junit] Running org.activemq.JmsTopicRequestReplyTest
    [junit] Tests run: 2, Failures: 0, Errors: 0, Time elapsed: 7.129 sec
    [junit] Running org.activemq.JmsQueueTransactionTest
    [junit] Tests run: 11, Failures: 0, Errors: 0, Time elapsed: 43.806 sec
    [junit] Running org.activemq.streams.JMSInputStreamTest
    [junit] Tests run: 2, Failures: 0, Errors: 0, Time elapsed: 9.689 sec
    [junit] Running org.activemq.BrokerAdminCommandsTest
    [junit] Tests run: 1, Failures: 0, Errors: 0, Time elapsed: 5.867 sec
    [junit] Running org.activemq.JmsClientAckTest
    [junit] Tests run: 2, Failures: 0, Errors: 0, Time elapsed: 8.658 sec
    [junit] Running org.activemq.JmsTopicWildcardSendReceiveTest
    [junit] Tests run: 1, Failures: 0, Errors: 0, Time elapsed: 4.648 sec
    [junit] Running org.activemq.EmbeddedBrokerTest
    [junit] Tests run: 2, Failures: 0, Errors: 0, Time elapsed: 4.122 sec
    [junit] Running org.activemq.FragmentTopicTest
    [junit] Tests run: 1, Failures: 0, Errors: 0, Time elapsed: 23.837 sec
    [junit] Running org.activemq.JmsTopicSendReceiveSubscriberTest
    [junit] Tests run: 1, Failures: 0, Errors: 0, Time elapsed: 16.064 sec
    [junit] Running org.activemq.JmsTopicSendReceiveWithTwoConnectionsTest
    [junit] Tests run: 1, Failures: 0, Errors: 0, Time elapsed: 18.412 sec
    [junit] Running org.activemq.JmsDurableTopicSendReceiveTest
    [junit] Tests run: 1, Failures: 0, Errors: 0, Time elapsed: 4.975 sec
    [junit] Running org.activemq.JmsQueueSendReceiveTest
    [junit] Tests run: 1, Failures: 0, Errors: 0, Time elapsed: 4.982 sec
    [junit] Running org.activemq.broker.impl.AdvisorySupportTest
    [junit] Tests run: 3, Failures: 0, Errors: 0, Time elapsed: 0.322 sec
    [junit] Running org.activemq.broker.BrokerAdminTest
    [junit] Tests run: 3, Failures: 0, Errors: 0, Time elapsed: 3.231 sec
    [junit] Running org.activemq.JmsRedeliveredTest
    [junit] Tests run: 16, Failures: 0, Errors: 0, Time elapsed: 33.452 sec
    [junit] Running org.activemq.CompressionMessageTest
    [junit] Tests run: 1, Failures: 0, Errors: 0, Time elapsed: 9.336 sec
    [junit] Running org.activemq.selector.SelectorParserTest
    [junit] Tests run: 2, Failures: 0, Errors: 0, Time elapsed: 0.22 sec
    [junit] Running org.activemq.selector.SelectorTest
    [junit] Tests run: 17, Failures: 0, Errors: 0, Time elapsed: 0.359 sec
    [junit] Running org.activemq.service.TopicBrokerTest
    [junit] Tests run: 1, Failures: 0, Errors: 0, Time elapsed: 2.92 sec
    [junit] Running org.activemq.service.impl.XATransactionTest
    [junit] Tests run: 1, Failures: 0, Errors: 0, Time elapsed: 0.031 sec
    [junit] Running org.activemq.service.impl.LocalTransactionCommandTest
    [junit] Tests run: 1, Failures: 0, Errors: 0, Time elapsed: 0.035 sec
    [junit] Running org.activemq.service.impl.XATransactionCommandTest
    [junit] Tests run: 1, Failures: 0, Errors: 0, Time elapsed: 0.036 sec
    [junit] Running org.activemq.service.impl.DefaultQueueListTest
    [junit] Tests run: 5, Failures: 0, Errors: 0, Time elapsed: 0.036 sec
    [junit] Running org.activemq.service.QueueBrokerTest
    [junit] Tests run: 1, Failures: 0, Errors: 0, Time elapsed: 2.59 sec
    [junit] Running org.activemq.service.TransientQueueGarbageCollectionTest
    [junit] Tests run: 2, Failures: 0, Errors: 0, Time elapsed: 4.272 sec
    [junit] Running org.activemq.service.SimpleTopicBrokerTest
    [junit] Tests run: 1, Failures: 0, Errors: 0, Time elapsed: 2.448 sec
    [junit] Running org.activemq.service.AsyncSimpleBrokerTest
    [junit] Tests run: 1, Failures: 0, Errors: 0, Time elapsed: 2.537 sec
    [junit] Running org.activemq.service.SimpleQueueBrokerTest
    [junit] Tests run: 1, Failures: 0, Errors: 0, Time elapsed: 2.928 sec
    [junit] Running org.activemq.JmsTopicSendSameMessageTest
    [junit] Tests run: 1, Failures: 0, Errors: 0, Time elapsed: 5.169 sec
    [junit] Running org.activemq.spring.SpringTest
    [junit] Tests run: 5, Failures: 0, Errors: 0, Time elapsed: 15.96 sec
    [junit] Running org.activemq.JmsQueueRequestReplyTest
    [junit] Tests run: 2, Failures: 0, Errors: 0, Time elapsed: 7.939 sec
    [junit] Running org.activemq.util.BitArrayTest
    [junit] Tests run: 4, Failures: 0, Errors: 0, Time elapsed: 0.352 sec
    [junit] Running org.activemq.util.IdGeneratorTest
    [junit] Tests run: 4, Failures: 0, Errors: 0, Time elapsed: 0.829 sec
    [junit] Running org.activemq.util.JmsLogAppenderTest
    [junit] Tests run: 1, Failures: 0, Errors: 0, Time elapsed: 0.032 sec
    [junit] Running org.activemq.util.ReflectionSupportTest
    [junit] Tests run: 1, Failures: 0, Errors: 0, Time elapsed: 0.186 sec
    [junit] Running org.activemq.util.BitArrayBinTest
    [junit] Tests run: 2, Failures: 0, Errors: 0, Time elapsed: 0.036 sec
    [junit] Running org.activemq.util.URIHelperTest
    [junit] Tests run: 3, Failures: 0, Errors: 0, Time elapsed: 0.038 sec
    [junit] Running org.activemq.util.AsyncProxyTest
    [junit] Tests run: 1, Failures: 0, Errors: 0, Time elapsed: 60.205 sec
    [junit] Running org.activemq.JmsDurableTopicTransactionTest
    [junit] Tests run: 8, Failures: 0, Errors: 0, Time elapsed: 27.47 sec
    [junit] Running org.activemq.JmsQueueXATransactionTest
    [junit] Tests run: 4, Failures: 0, Errors: 0, Time elapsed: 13.429 sec
    [junit] Running org.activemq.transport.composite.CompositeTransportChannelTest
    [junit] Tests run: 4, Failures: 0, Errors: 0, Time elapsed: 0.395 sec
    [junit] Running org.activemq.transport.composite.CompositeTransportChannelWithLeadingSlashesTest
    [junit] Tests run: 4, Failures: 0, Errors: 0, Time elapsed: 0.371 sec
    [junit] Running org.activemq.transport.UriParseTest
    [junit] Tests run: 4, Failures: 0, Errors: 0, Time elapsed: 0.112 sec
    [junit] Running org.activemq.transport.reliable.ReliableTransportChannelTest
    [junit] Tests run: 4, Failures: 0, Errors: 0, Time elapsed: 0.375 sec
    [junit] Running org.activemq.transport.reliable.ReliableTransportChannelFactoryTest
    [junit] Tests run: 1, Failures: 0, Errors: 0, Time elapsed: 0.044 sec
    [junit] Running org.activemq.transport.activeio.ActiveIOTopicSendReceiveTwoConnectionsTest
    [junit] Tests run: 3, Failures: 0, Errors: 0, Time elapsed: 11.654 sec
    [junit] Running org.activemq.transport.activeio.ActiveIOQueueSendReceiveTwoConnectionsTest
    [junit] Tests run: 2, Failures: 0, Errors: 0, Time elapsed: 8.385 sec
    [junit] Running org.activemq.transport.activeio.ActiveIOTransportChannelTest
    [junit] ActiveIO unexpected error:
    [junit] java.nio.channels.CancelledKeyException
    [junit] at sun.nio.ch.SelectionKeyImpl.ensureValid(SelectionKeyImpl.java:55)
    [junit] at sun.nio.ch.SelectionKeyImpl.interestOps(SelectionKeyImpl.java:64)
    [junit] at org.activeio.net.NIOAsynchChannelSelectorManager$SocketChannelAsynchChannelSelection.enable(NIOAsynchChannelSelectorManager.java:87)
    [junit] at org.activeio.net.NIOAsynchChannelSelectorManager$1.run(NIOAsynchChannelSelectorManager.java:189)
    [junit] at EDU.oswego.cs.dl.util.concurrent.DirectExecutor.execute(Unknown Source)
    [junit] at org.activeio.net.NIOAsynchChannelSelectorManager$SelectorWorker.run(NIOAsynchChannelSelectorManager.java:185)
    [junit] at EDU.oswego.cs.dl.util.concurrent.PooledExecutor$Worker.run(Unknown Source)
    [junit] at java.lang.Thread.run(Thread.java:534)
    [junit] Tests run: 12, Failures: 0, Errors: 0, Time elapsed: 0.777 sec
    [junit] Running org.activemq.transport.activeio.ActiveIOQueueSendReceiveTest
    [junit] Tests run: 3, Failures: 0, Errors: 0, Time elapsed: 9.258 sec
    [junit] Running org.activemq.transport.activeio.URIConverterTest
    [junit] Tests run: 1, Failures: 0, Errors: 0, Time elapsed: 0.035 sec
    [junit] Running org.activemq.transport.activeio.ActiveIOTopicSendReceiveTest
    [junit] Tests run: 2, Failures: 0, Errors: 0, Time elapsed: 7.971 sec
    [junit] Running org.activemq.transport.jabber.JabberWireFormatTest
    [junit] Tests run: 1, Failures: 0, Errors: 0, Time elapsed: 0.046 sec
    [junit] Running org.activemq.transport.tcp.TcpTransportChannelTest
    [junit] Tests run: 4, Failures: 0, Errors: 0, Time elapsed: 0.335 sec
    [junit] Running org.activemq.transport.tcp.TcpQueueSendReceiveTwoConnectionsTest
    [junit] Tests run: 1, Failures: 0, Errors: 0, Time elapsed: 4.602 sec
    [junit] Running org.activemq.transport.tcp.TcpQueueSendReceiveTest
    [junit] Tests run: 1, Failures: 0, Errors: 0, Time elapsed: 4.29 sec
    [junit] Running org.activemq.transport.tcp.TcpTopicSendReceiveTwoConnectionsTest
    [junit] Tests run: 1, Failures: 0, Errors: 0, Time elapsed: 4.401 sec
    [junit] Running org.activemq.transport.tcp.TcpTopicSendReceiveTest
    [junit] Tests run: 1, Failures: 0, Errors: 0, Time elapsed: 4.53 sec
    [junit] Running org.activemq.transport.tcp.ExceptionListenerTest
    [junit] Tests run: 1, Failures: 0, Errors: 0, Time elapsed: 3.993 sec
    [junit] Running org.activemq.JmsDurableQueueWildcardSendReceiveTest
    [junit] Tests run: 1, Failures: 0, Errors: 0, Time elapsed: 5.067 sec
Total time: 13 minutes 32 seconds
Finished at: Fri Jul 08 09:47:45 PDT 2005


****************************************************************************

****************************************************************************
Standard error:
****************************************************************************

BUILD FAILED
File...... /home/existusr/.maven/cache/maven-multiproject-plugin-1.3.1/plugin.jelly
Element... maven:reactor
Line...... 217
Column.... 9
Unable to obtain goal [test:test] -- /home/existusr/.maven/cache/maven-test-plugin-1.6.2/plugin.jelly:181:54: <fail> There were test failures.

****************************************************************************