[activemq-dev] Activemq 3.1 build failure

classic Classic list List threaded Threaded
2 messages Options
Reply | Threaded
Open this post in threaded view
|

[activemq-dev] Activemq 3.1 build failure

Lusk, Andrew
I'm having the same build failure that I see automated messages about earlier in the dev@ archives.  What's the resolution to this?  (not on list, please cc me)

Thanks,
--Andrew Lusk

BUILD FAILED
File...... /home/andrewlu/.maven/cache/maven-multiproject-plugin-1.3.1/plugin.jelly
Element... maven:reactor
Line...... 217
Column.... 9
Unable to obtain goal [test:test] -- /home/andrewlu/.maven/cache/maven-test-plugin-1.6.2/plugin.jelly:181:54: <fail> There were test failures.
Total time: 15 minutes 54 seconds
Finished at: Mon Aug 29 16:50:22 PDT 2005
Reply | Threaded
Open this post in threaded view
|

Re: [activemq-dev] Activemq 3.1 build failure

James Strachan-2

On 30 Aug 2005, at 01:28, Lusk, Andrew wrote:

> I'm having the same build failure that I see automated messages  
> about earlier in the dev@ archives.  What's the resolution to  
> this?  (not on list, please cc me)
>
> Thanks,
> --Andrew Lusk
>
> BUILD FAILED
> File...... /home/andrewlu/.maven/cache/maven-multiproject-
> plugin-1.3.1/plugin.jelly
> Element... maven:reactor
> Line...... 217
> Column.... 9
> Unable to obtain goal [test:test] -- /home/andrewlu/.maven/cache/
> maven-test-plugin-1.6.2/plugin.jelly:181:54: <fail> There were test  
> failures.

This means that one of the unit test cases did not pass on your  
platform/OS/JVM. If you scroll up and search for [ERROR] you should  
see the test case that failed. To find the output of the test case,  
in the module that was built (e.g. activemq/module/core) there should  
be a file called target/test-reports/TEST-${classname}.txt which  
contains the actual output of the test cases.

If you want to do a complete build and disable the unit test cases  
see...

http://activemq.org/How+do+I+build+but+disable+the+unit+tests

James
-------
http://radio.weblogs.com/0112098/