Jenkins build is unstable: ActiveMQ-Java8-All-UnitTests #643

Previous Topic Next Topic
 
classic Classic list List threaded Threaded
16 messages Options
Reply | Threaded
Open this post in threaded view
|

Jenkins build is unstable: ActiveMQ-Java8-All-UnitTests #643

Apache Jenkins Server-2
Reply | Threaded
Open this post in threaded view
|

Jenkins build is still unstable: ActiveMQ-Java8-All-UnitTests #644

Apache Jenkins Server-2
Reply | Threaded
Open this post in threaded view
|

Jenkins build is still unstable: ActiveMQ-Java8-All-UnitTests #645

Apache Jenkins Server-2
Reply | Threaded
Open this post in threaded view
|

Jenkins build is still unstable: ActiveMQ-Java8-All-UnitTests #646

Apache Jenkins Server-2
Reply | Threaded
Open this post in threaded view
|

Jenkins build is still unstable: ActiveMQ-Java8-All-UnitTests #647

Apache Jenkins Server-2
Reply | Threaded
Open this post in threaded view
|

Jenkins build is still unstable: ActiveMQ-Java8-All-UnitTests #648

Apache Jenkins Server-2
Reply | Threaded
Open this post in threaded view
|

Jenkins build is still unstable: ActiveMQ-Java8-All-UnitTests #649

Apache Jenkins Server-2
Reply | Threaded
Open this post in threaded view
|

Jenkins build is still unstable: ActiveMQ-Java8-All-UnitTests #650

Apache Jenkins Server-2
Reply | Threaded
Open this post in threaded view
|

Jenkins build is still unstable: ActiveMQ-Java8-All-UnitTests #651

Apache Jenkins Server-2
Reply | Threaded
Open this post in threaded view
|

Jenkins build is still unstable: ActiveMQ-Java8-All-UnitTests #652

Apache Jenkins Server-2
Reply | Threaded
Open this post in threaded view
|

Jenkins build is still unstable: ActiveMQ-Java8-All-UnitTests #653

Apache Jenkins Server-2
Reply | Threaded
Open this post in threaded view
|

Jenkins build is still unstable: ActiveMQ-Java8-All-UnitTests #654

Apache Jenkins Server-2
Reply | Threaded
Open this post in threaded view
|

Jenkins build is still unstable: ActiveMQ-Java8-All-UnitTests #655

Apache Jenkins Server-2
Reply | Threaded
Open this post in threaded view
|

Jenkins build is still unstable: ActiveMQ-Java8-All-UnitTests #656

Apache Jenkins Server-2
Reply | Threaded
Open this post in threaded view
|

Jenkins build is still unstable: ActiveMQ-Java8-All-UnitTests #657

Apache Jenkins Server-2
Reply | Threaded
Open this post in threaded view
|

Build failed in Jenkins: ActiveMQ-Java8-All-UnitTests #658

Apache Jenkins Server-2
See <https://builds.apache.org/job/ActiveMQ-Java8-All-UnitTests/658/display/redirect?page=changes>

Changes:

[gtully] [AMQ-6630][AMQ-6493] fix feature and add explicit 2.0 jms dep to karaf

------------------------------------------
[...truncated 402.63 KB...]
Tests run: 2, Failures: 0, Errors: 0, Skipped: 0, Time elapsed: 1.803 sec - in org.apache.activemq.transport.failover.FailoverXATransactionTest
Running org.apache.activemq.transport.failover.InitalReconnectDelayTest
Tests run: 2, Failures: 0, Errors: 0, Skipped: 0, Time elapsed: 17.108 sec - in org.apache.activemq.transport.failover.InitalReconnectDelayTest
Running org.apache.activemq.transport.failover.ReconnectTest
Tests run: 1, Failures: 0, Errors: 0, Skipped: 0, Time elapsed: 20.058 sec - in org.apache.activemq.transport.failover.ReconnectTest
Running org.apache.activemq.transport.failover.SlowConnectionTest
Tests run: 1, Failures: 0, Errors: 0, Skipped: 0, Time elapsed: 1.531 sec - in org.apache.activemq.transport.failover.SlowConnectionTest
Running org.apache.activemq.transport.failover.TwoBrokerFailoverClusterTest
Tests run: 1, Failures: 0, Errors: 0, Skipped: 0, Time elapsed: 19.463 sec - in org.apache.activemq.transport.failover.TwoBrokerFailoverClusterTest
Running org.apache.activemq.transport.fanout.FanoutTest
Tests run: 1, Failures: 0, Errors: 0, Skipped: 0, Time elapsed: 0.989 sec - in org.apache.activemq.transport.fanout.FanoutTest
Running org.apache.activemq.transport.fanout.FanoutTransportBrokerTest
Tests run: 6, Failures: 0, Errors: 0, Skipped: 0, Time elapsed: 7.25 sec - in org.apache.activemq.transport.fanout.FanoutTransportBrokerTest
Running org.apache.activemq.transport.reliable.ReliableTransportTest
Tests run: 7, Failures: 0, Errors: 0, Skipped: 0, Time elapsed: 0.134 sec - in org.apache.activemq.transport.reliable.ReliableTransportTest
Running org.apache.activemq.transport.tcp.InactivityMonitorTest
Tests run: 3, Failures: 0, Errors: 0, Skipped: 0, Time elapsed: 14.299 sec - in org.apache.activemq.transport.tcp.InactivityMonitorTest
Running org.apache.activemq.transport.tcp.QualityOfServiceUtilsTest
Tests run: 6, Failures: 0, Errors: 0, Skipped: 0, Time elapsed: 0.039 sec - in org.apache.activemq.transport.tcp.QualityOfServiceUtilsTest
Running org.apache.activemq.transport.tcp.SslBrokerServiceTest
Tests run: 130, Failures: 0, Errors: 1, Skipped: 0, Time elapsed: 35.581 sec <<< FAILURE! - in org.apache.activemq.transport.tcp.SslBrokerServiceTest
testCipherSuitesDisabled(org.apache.activemq.transport.tcp.SslBrokerServiceTest)  Time elapsed: 0.03 sec  <<< ERROR!
javax.net.ssl.SSLException: Connection has been shutdown: javax.net.ssl.SSLHandshakeException: No appropriate protocol (protocol is disabled or cipher suites are inappropriate)
        at sun.security.ssl.Handshaker.activate(Handshaker.java:503)
        at sun.security.ssl.SSLSocketImpl.kickstartHandshake(SSLSocketImpl.java:1482)
        at sun.security.ssl.SSLSocketImpl.performInitialHandshake(SSLSocketImpl.java:1351)
        at sun.security.ssl.SSLSocketImpl.startHandshake(SSLSocketImpl.java:1403)
        at sun.security.ssl.SSLSocketImpl.getSession(SSLSocketImpl.java:2267)
        at org.apache.activemq.transport.tcp.SslBrokerServiceTest.makeSSLConnection(SslBrokerServiceTest.java:128)
        at org.apache.activemq.transport.tcp.SslBrokerServiceTest.testCipherSuitesDisabled(SslBrokerServiceTest.java:116)

Running org.apache.activemq.transport.tcp.SslContextBrokerServiceTest
Tests run: 1, Failures: 0, Errors: 0, Skipped: 0, Time elapsed: 1.605 sec - in org.apache.activemq.transport.tcp.SslContextBrokerServiceTest
Running org.apache.activemq.transport.tcp.SslContextNBrokerServiceTest
Tests run: 2, Failures: 0, Errors: 1, Skipped: 0, Time elapsed: 2.182 sec <<< FAILURE! - in org.apache.activemq.transport.tcp.SslContextNBrokerServiceTest
testActiveMQDotOrgConfigurationIsolation(org.apache.activemq.transport.tcp.SslContextNBrokerServiceTest)  Time elapsed: 1.723 sec  <<< ERROR!
javax.net.ssl.SSLHandshakeException: java.security.cert.CertificateException: Certificates does not conform to algorithm constraints
        at sun.security.ssl.AbstractTrustManagerWrapper.checkAlgorithmConstraints(SSLContextImpl.java:1117)
        at sun.security.ssl.AbstractTrustManagerWrapper.checkAdditionalTrust(SSLContextImpl.java:1043)
        at sun.security.ssl.AbstractTrustManagerWrapper.checkServerTrusted(SSLContextImpl.java:985)
        at sun.security.ssl.ClientHandshaker.serverCertificate(ClientHandshaker.java:1496)
        at sun.security.ssl.ClientHandshaker.processMessage(ClientHandshaker.java:216)
        at sun.security.ssl.Handshaker.processLoop(Handshaker.java:1026)
        at sun.security.ssl.Handshaker.process_record(Handshaker.java:961)
        at sun.security.ssl.SSLSocketImpl.readRecord(SSLSocketImpl.java:1062)
        at sun.security.ssl.SSLSocketImpl.performInitialHandshake(SSLSocketImpl.java:1375)
        at sun.security.ssl.SSLSocketImpl.startHandshake(SSLSocketImpl.java:1403)
        at sun.security.ssl.SSLSocketImpl.startHandshake(SSLSocketImpl.java:1387)
        at org.apache.activemq.transport.tcp.SslContextNBrokerServiceTest.verifySslCredentials(SslContextNBrokerServiceTest.java:85)
        at org.apache.activemq.transport.tcp.SslContextNBrokerServiceTest.verifyCredentials(SslContextNBrokerServiceTest.java:66)
        at org.apache.activemq.transport.tcp.SslContextNBrokerServiceTest.testActiveMQDotOrgConfigurationIsolation(SslContextNBrokerServiceTest.java:56)

Running org.apache.activemq.transport.tcp.SslTransportFactoryTest
Tests run: 2, Failures: 0, Errors: 0, Skipped: 0, Time elapsed: 0.58 sec - in org.apache.activemq.transport.tcp.SslTransportFactoryTest
Running org.apache.activemq.transport.tcp.SslTransportServerTest
Tests run: 2, Failures: 0, Errors: 0, Skipped: 0, Time elapsed: 0.153 sec - in org.apache.activemq.transport.tcp.SslTransportServerTest
Running org.apache.activemq.transport.tcp.SslTransportTest
Tests run: 1, Failures: 0, Errors: 0, Skipped: 0, Time elapsed: 0.161 sec - in org.apache.activemq.transport.tcp.SslTransportTest
Running org.apache.activemq.transport.tcp.TcpTransportBindTest
Tests run: 2, Failures: 0, Errors: 0, Skipped: 0, Time elapsed: 1.865 sec - in org.apache.activemq.transport.tcp.TcpTransportBindTest
Running org.apache.activemq.transport.tcp.TcpTransportBrokerTest
Tests run: 127, Failures: 0, Errors: 0, Skipped: 0, Time elapsed: 17.545 sec - in org.apache.activemq.transport.tcp.TcpTransportBrokerTest
Running org.apache.activemq.transport.tcp.TcpTransportCloseSocketTest
Tests run: 4, Failures: 0, Errors: 0, Skipped: 0, Time elapsed: 10.206 sec - in org.apache.activemq.transport.tcp.TcpTransportCloseSocketTest
Running org.apache.activemq.transport.tcp.TcpTransportServerTest
Tests run: 1, Failures: 0, Errors: 0, Skipped: 0, Time elapsed: 0.247 sec - in org.apache.activemq.transport.tcp.TcpTransportServerTest
Running org.apache.activemq.transport.tcp.TransportConnectorInvalidSocketOptionsTest
Tests run: 2, Failures: 0, Errors: 0, Skipped: 0, Time elapsed: 0.84 sec - in org.apache.activemq.transport.tcp.TransportConnectorInvalidSocketOptionsTest
Running org.apache.activemq.transport.tcp.TransportUriTest
Tests run: 14, Failures: 0, Errors: 0, Skipped: 0, Time elapsed: 1.234 sec - in org.apache.activemq.transport.tcp.TransportUriTest
Running org.apache.activemq.transport.tcp.WireformatNegociationTest
Tests run: 5, Failures: 0, Errors: 0, Skipped: 0, Time elapsed: 0.299 sec - in org.apache.activemq.transport.tcp.WireformatNegociationTest
Running org.apache.activemq.transport.udp.UdpSendReceiveWithTwoConnectionsAndLargeMessagesTest
Tests run: 1, Failures: 0, Errors: 0, Skipped: 0, Time elapsed: 0.97 sec - in org.apache.activemq.transport.udp.UdpSendReceiveWithTwoConnectionsAndLargeMessagesTest
Running org.apache.activemq.transport.udp.UdpSendReceiveWithTwoConnectionsTest
Tests run: 1, Failures: 0, Errors: 0, Skipped: 0, Time elapsed: 1.008 sec - in org.apache.activemq.transport.udp.UdpSendReceiveWithTwoConnectionsTest
Running org.apache.activemq.transport.udp.UdpTransportTest
Tests run: 3, Failures: 0, Errors: 0, Skipped: 0, Time elapsed: 0.248 sec - in org.apache.activemq.transport.udp.UdpTransportTest
Running org.apache.activemq.transport.udp.UdpTransportUsingServerTest
Tests run: 4, Failures: 0, Errors: 0, Skipped: 0, Time elapsed: 0.305 sec - in org.apache.activemq.transport.udp.UdpTransportUsingServerTest
Running org.apache.activemq.transport.udp.UpdTransportBindTest
Tests run: 1, Failures: 0, Errors: 0, Skipped: 0, Time elapsed: 0.92 sec - in org.apache.activemq.transport.udp.UpdTransportBindTest
Running org.apache.activemq.transport.vm.VMTransportBrokerNameTest
Tests run: 3, Failures: 0, Errors: 0, Skipped: 0, Time elapsed: 0.974 sec - in org.apache.activemq.transport.vm.VMTransportBrokerNameTest
Running org.apache.activemq.transport.vm.VMTransportBrokerTest
Tests run: 127, Failures: 0, Errors: 0, Skipped: 0, Time elapsed: 17.09 sec - in org.apache.activemq.transport.vm.VMTransportBrokerTest
Running org.apache.activemq.transport.vm.VMTransportEmbeddedBrokerTest
Tests run: 1, Failures: 0, Errors: 0, Skipped: 0, Time elapsed: 0.805 sec - in org.apache.activemq.transport.vm.VMTransportEmbeddedBrokerTest
Running org.apache.activemq.transport.vm.VMTransportThreadSafeTest
Tests run: 19, Failures: 0, Errors: 0, Skipped: 0, Time elapsed: 75.877 sec - in org.apache.activemq.transport.vm.VMTransportThreadSafeTest
Running org.apache.activemq.transport.vm.VMTransportWaitForTest
Tests run: 3, Failures: 0, Errors: 0, Skipped: 0, Time elapsed: 12.879 sec - in org.apache.activemq.transport.vm.VMTransportWaitForTest
Running org.apache.activemq.transport.vm.VmTransportNetworkBrokerTest
Tests run: 2, Failures: 0, Errors: 0, Skipped: 0, Time elapsed: 31.813 sec - in org.apache.activemq.transport.vm.VmTransportNetworkBrokerTest
Running org.apache.activemq.usage.CompositeMessageCursorUsageTest
Tests run: 1, Failures: 0, Errors: 0, Skipped: 0, Time elapsed: 0.973 sec - in org.apache.activemq.usage.CompositeMessageCursorUsageTest
Running org.apache.activemq.usage.JobSchedulerStoreUsageTest
Tests run: 1, Failures: 0, Errors: 0, Skipped: 0, Time elapsed: 3.692 sec - in org.apache.activemq.usage.JobSchedulerStoreUsageTest
Running org.apache.activemq.usage.PercentDiskUsageLimitTest
Tests run: 4, Failures: 0, Errors: 0, Skipped: 0, Time elapsed: 2.409 sec - in org.apache.activemq.usage.PercentDiskUsageLimitTest
Running org.apache.activemq.usage.PeriodicDiskUsageLimitTest
Tests run: 6, Failures: 0, Errors: 0, Skipped: 0, Time elapsed: 30.094 sec - in org.apache.activemq.usage.PeriodicDiskUsageLimitTest
Running org.apache.activemq.usage.StoreUsageLimitsTest
Tests run: 2, Failures: 0, Errors: 0, Skipped: 0, Time elapsed: 0.705 sec - in org.apache.activemq.usage.StoreUsageLimitsTest
Running org.apache.activemq.usage.StoreUsageTest
Tests run: 1, Failures: 0, Errors: 0, Skipped: 0, Time elapsed: 4.287 sec - in org.apache.activemq.usage.StoreUsageTest
Running org.apache.activemq.usecases.AMQ2927Test
Tests run: 2, Failures: 0, Errors: 0, Skipped: 0, Time elapsed: 28.712 sec - in org.apache.activemq.usecases.AMQ2927Test
Running org.apache.activemq.usecases.AMQ5153LevelDBSubscribedDestTest
Tests run: 1, Failures: 0, Errors: 0, Skipped: 0, Time elapsed: 1.946 sec - in org.apache.activemq.usecases.AMQ5153LevelDBSubscribedDestTest
Running org.apache.activemq.usecases.AMQ6366Test
Tests run: 2, Failures: 0, Errors: 0, Skipped: 0, Time elapsed: 20.593 sec - in org.apache.activemq.usecases.AMQ6366Test
Running org.apache.activemq.usecases.AMQ6446Test
Tests run: 2, Failures: 0, Errors: 0, Skipped: 0, Time elapsed: 0.876 sec - in org.apache.activemq.usecases.AMQ6446Test
Running org.apache.activemq.usecases.AMQ6477Test
Tests run: 6, Failures: 0, Errors: 0, Skipped: 0, Time elapsed: 2.089 sec - in org.apache.activemq.usecases.AMQ6477Test
Running org.apache.activemq.usecases.AMQStackOverFlowTest
Tests run: 1, Failures: 0, Errors: 0, Skipped: 0, Time elapsed: 1.84 sec - in org.apache.activemq.usecases.AMQStackOverFlowTest
Running org.apache.activemq.usecases.AdvisoryTopicCleanUpTest
Tests run: 1, Failures: 0, Errors: 0, Skipped: 0, Time elapsed: 4.119 sec - in org.apache.activemq.usecases.AdvisoryTopicCleanUpTest
Running org.apache.activemq.usecases.AdvisoryTopicDeletionTest
Tests run: 2, Failures: 0, Errors: 0, Skipped: 0, Time elapsed: 0.957 sec - in org.apache.activemq.usecases.AdvisoryTopicDeletionTest
Running org.apache.activemq.usecases.AdvisoryViaNetworkTest
Tests run: 10, Failures: 0, Errors: 0, Skipped: 0, Time elapsed: 22.423 sec - in org.apache.activemq.usecases.AdvisoryViaNetworkTest
Running org.apache.activemq.usecases.AuthorizationFromAdminViewTest
Tests run: 1, Failures: 0, Errors: 0, Skipped: 0, Time elapsed: 0.723 sec - in org.apache.activemq.usecases.AuthorizationFromAdminViewTest
Running org.apache.activemq.usecases.BacklogNetworkCrossTalkTest
Tests run: 1, Failures: 0, Errors: 0, Skipped: 0, Time elapsed: 7.001 sec - in org.apache.activemq.usecases.BacklogNetworkCrossTalkTest
Running org.apache.activemq.usecases.BatchedMessagePriorityConsumerTest
Tests run: 2, Failures: 0, Errors: 0, Skipped: 0, Time elapsed: 2.974 sec - in org.apache.activemq.usecases.BatchedMessagePriorityConsumerTest
Running org.apache.activemq.usecases.BrokerQueueNetworkWithDisconnectTest
Tests run: 4, Failures: 0, Errors: 0, Skipped: 0, Time elapsed: 75.912 sec - in org.apache.activemq.usecases.BrokerQueueNetworkWithDisconnectTest
Running org.apache.activemq.usecases.BrowseDLQTest
Tests run: 1, Failures: 0, Errors: 0, Skipped: 0, Time elapsed: 3.805 sec - in org.apache.activemq.usecases.BrowseDLQTest
Running org.apache.activemq.usecases.BrowseOverNetworkTest
Tests run: 3, Failures: 0, Errors: 0, Skipped: 0, Time elapsed: 38.881 sec - in org.apache.activemq.usecases.BrowseOverNetworkTest
Running org.apache.activemq.usecases.ChangeSentMessageTest
Tests run: 1, Failures: 0, Errors: 0, Skipped: 0, Time elapsed: 1.034 sec - in org.apache.activemq.usecases.ChangeSentMessageTest
Running org.apache.activemq.usecases.ChangeSessionDeliveryModeTest
Tests run: 1, Failures: 0, Errors: 0, Skipped: 0, Time elapsed: 0.885 sec - in org.apache.activemq.usecases.ChangeSessionDeliveryModeTest
Running org.apache.activemq.usecases.ClientRebalanceTest
Tests run: 1, Failures: 0, Errors: 0, Skipped: 0, Time elapsed: 12.926 sec - in org.apache.activemq.usecases.ClientRebalanceTest
Running org.apache.activemq.usecases.CompositeConsumeTest
Tests run: 1, Failures: 0, Errors: 0, Skipped: 0, Time elapsed: 0.933 sec - in org.apache.activemq.usecases.CompositeConsumeTest
Running org.apache.activemq.usecases.CompositePublishTest
Tests run: 1, Failures: 0, Errors: 0, Skipped: 0, Time elapsed: 61.323 sec - in org.apache.activemq.usecases.CompositePublishTest
Running org.apache.activemq.usecases.ConcurrentDestinationCreationTest
Tests run: 1, Failures: 0, Errors: 0, Skipped: 0, Time elapsed: 3.437 sec - in org.apache.activemq.usecases.ConcurrentDestinationCreationTest
Running org.apache.activemq.usecases.ConcurrentProducerDurableConsumerTest
Tests run: 3, Failures: 0, Errors: 0, Skipped: 0, Time elapsed: 31.785 sec - in org.apache.activemq.usecases.ConcurrentProducerDurableConsumerTest
Running org.apache.activemq.usecases.ConcurrentProducerQueueConsumerTest
Tests run: 3, Failures: 0, Errors: 0, Skipped: 0, Time elapsed: 438.294 sec - in org.apache.activemq.usecases.ConcurrentProducerQueueConsumerTest
Running org.apache.activemq.usecases.ConsumeQueuePrefetchTest
Tests run: 4, Failures: 0, Errors: 0, Skipped: 0, Time elapsed: 1.261 sec - in org.apache.activemq.usecases.ConsumeQueuePrefetchTest
Running org.apache.activemq.usecases.ConsumeTopicPrefetchTest
Tests run: 3, Failures: 0, Errors: 0, Skipped: 0, Time elapsed: 1.146 sec - in org.apache.activemq.usecases.ConsumeTopicPrefetchTest
Running org.apache.activemq.usecases.ConsumeUncompressedCompressedMessageTest
Tests run: 2, Failures: 0, Errors: 0, Skipped: 0, Time elapsed: 1.08 sec - in org.apache.activemq.usecases.ConsumeUncompressedCompressedMessageTest
Running org.apache.activemq.usecases.CreateLotsOfTemporaryQueuesTest
Tests run: 1, Failures: 0, Errors: 0, Skipped: 0, Time elapsed: 12.345 sec - in org.apache.activemq.usecases.CreateLotsOfTemporaryQueuesTest
Running org.apache.activemq.usecases.CreateTemporaryQueueBeforeStartTest
Tests run: 3, Failures: 0, Errors: 0, Skipped: 0, Time elapsed: 1.006 sec - in org.apache.activemq.usecases.CreateTemporaryQueueBeforeStartTest
Running org.apache.activemq.usecases.DiscriminatingConsumerLoadTest
Tests run: 2, Failures: 0, Errors: 0, Skipped: 0, Time elapsed: 59.633 sec - in org.apache.activemq.usecases.DiscriminatingConsumerLoadTest
Running org.apache.activemq.usecases.DispatchMultipleConsumersTest
Tests run: 1, Failures: 0, Errors: 0, Skipped: 0, Time elapsed: 307.134 sec - in org.apache.activemq.usecases.DispatchMultipleConsumersTest
Running org.apache.activemq.usecases.DuplexAdvisoryRaceTest
Tests run: 1, Failures: 0, Errors: 0, Skipped: 0, Time elapsed: 133.32 sec - in org.apache.activemq.usecases.DuplexAdvisoryRaceTest
Running org.apache.activemq.usecases.DurableConsumerCloseAndReconnectTcpTest
Tests run: 3, Failures: 0, Errors: 0, Skipped: 0, Time elapsed: 59.353 sec - in org.apache.activemq.usecases.DurableConsumerCloseAndReconnectTcpTest
Running org.apache.activemq.usecases.DurableConsumerCloseAndReconnectTest
Tests run: 2, Failures: 0, Errors: 0, Skipped: 0, Time elapsed: 7.134 sec - in org.apache.activemq.usecases.DurableConsumerCloseAndReconnectTest
Running org.apache.activemq.usecases.DurableSubCacheTest
Tests run: 2, Failures: 0, Errors: 0, Skipped: 0, Time elapsed: 1.718 sec - in org.apache.activemq.usecases.DurableSubCacheTest
Running org.apache.activemq.usecases.DurableSubDelayedUnsubscribeTest
Tests run: 1, Failures: 0, Errors: 0, Skipped: 0, Time elapsed: 212.057 sec - in org.apache.activemq.usecases.DurableSubDelayedUnsubscribeTest
Running org.apache.activemq.usecases.DurableSubInBrokerNetworkTest
Tests run: 2, Failures: 0, Errors: 0, Skipped: 0, Time elapsed: 2.138 sec - in org.apache.activemq.usecases.DurableSubInBrokerNetworkTest
Running org.apache.activemq.usecases.DurableSubProcessConcurrentCommitActivateNoDuplicateTest
Tests run: 1, Failures: 0, Errors: 0, Skipped: 1, Time elapsed: 0.182 sec - in org.apache.activemq.usecases.DurableSubProcessConcurrentCommitActivateNoDuplicateTest
Running org.apache.activemq.usecases.DurableSubProcessMultiRestartTest
Tests run: 1, Failures: 1, Errors: 0, Skipped: 0, Time elapsed: 243.205 sec <<< FAILURE! - in org.apache.activemq.usecases.DurableSubProcessMultiRestartTest
testProcess(org.apache.activemq.usecases.DurableSubProcessMultiRestartTest)  Time elapsed: 243.006 sec  <<< FAILURE!
java.lang.AssertionError: only less than two journal files should be left: 5
        at org.junit.Assert.fail(Assert.java:88)
        at org.junit.Assert.assertTrue(Assert.java:41)
        at org.apache.activemq.usecases.DurableSubProcessMultiRestartTest.testProcess(DurableSubProcessMultiRestartTest.java:119)

Running org.apache.activemq.usecases.DurableSubProcessTest
Tests run: 1, Failures: 0, Errors: 0, Skipped: 0, Time elapsed: 241.744 sec - in org.apache.activemq.usecases.DurableSubProcessTest
Running org.apache.activemq.usecases.DurableSubProcessWithRestartTest
Tests run: 1, Failures: 0, Errors: 0, Skipped: 1, Time elapsed: 0.189 sec - in org.apache.activemq.usecases.DurableSubProcessWithRestartTest
Running org.apache.activemq.usecases.DurableSubSelectorDelayTest
Tests run: 1, Failures: 0, Errors: 0, Skipped: 0, Time elapsed: 321.602 sec - in org.apache.activemq.usecases.DurableSubSelectorDelayTest
Running org.apache.activemq.usecases.DurableSubSelectorDelayWithRestartTest
Tests run: 1, Failures: 0, Errors: 0, Skipped: 0, Time elapsed: 86.622 sec - in org.apache.activemq.usecases.DurableSubSelectorDelayWithRestartTest
Running org.apache.activemq.usecases.DurableSubsOfflineSelectorConcurrentConsumeIndexUseTest
Tests run: 1, Failures: 0, Errors: 0, Skipped: 0, Time elapsed: 14.047 sec - in org.apache.activemq.usecases.DurableSubsOfflineSelectorConcurrentConsumeIndexUseTest
Running org.apache.activemq.usecases.DurableSubsOfflineSelectorIndexUseTest
Tests run: 3, Failures: 0, Errors: 0, Skipped: 0, Time elapsed: 24.146 sec - in org.apache.activemq.usecases.DurableSubsOfflineSelectorIndexUseTest
Running org.apache.activemq.usecases.DurableSubscriberNonPersistentMessageTest
Tests run: 1, Failures: 0, Errors: 0, Skipped: 0, Time elapsed: 15.771 sec - in org.apache.activemq.usecases.DurableSubscriberNonPersistentMessageTest
Running org.apache.activemq.usecases.DurableSubscriberWithNetworkDisconnectTest
Tests run: 2, Failures: 0, Errors: 0, Skipped: 0, Time elapsed: 265.107 sec - in org.apache.activemq.usecases.DurableSubscriberWithNetworkDisconnectTest
Running org.apache.activemq.usecases.DurableSubscriberWithNetworkRestartTest
Tests run: 2, Failures: 0, Errors: 0, Skipped: 0, Time elapsed: 14.048 sec - in org.apache.activemq.usecases.DurableSubscriberWithNetworkRestartTest
Running org.apache.activemq.usecases.DurableSubscriptionActivationTest
Tests run: 1, Failures: 0, Errors: 0, Skipped: 0, Time elapsed: 1.877 sec - in org.apache.activemq.usecases.DurableSubscriptionActivationTest
Running org.apache.activemq.usecases.DurableSubscriptionOffline1Test
Tests run: 18, Failures: 0, Errors: 0, Skipped: 0, Time elapsed: 117.662 sec - in org.apache.activemq.usecases.DurableSubscriptionOffline1Test
Running org.apache.activemq.usecases.DurableSubscriptionOffline2Test
Tests run: 2, Failures: 0, Errors: 0, Skipped: 0, Time elapsed: 5.05 sec - in org.apache.activemq.usecases.DurableSubscriptionOffline2Test
Running org.apache.activemq.usecases.DurableSubscriptionOffline3Test
Tests run: 12, Failures: 0, Errors: 0, Skipped: 0, Time elapsed: 118.748 sec - in org.apache.activemq.usecases.DurableSubscriptionOffline3Test
Running org.apache.activemq.usecases.DurableSubscriptionOffline4Test
Tests run: 2, Failures: 0, Errors: 0, Skipped: 0, Time elapsed: 5.675 sec - in org.apache.activemq.usecases.DurableSubscriptionOffline4Test
Running org.apache.activemq.usecases.DurableSubscriptionOfflineBrowseRemoveTest
Tests run: 4, Failures: 0, Errors: 0, Skipped: 0, Time elapsed: 6.147 sec - in org.apache.activemq.usecases.DurableSubscriptionOfflineBrowseRemoveTest
Running org.apache.activemq.usecases.DurableSubscriptionOfflineTest
[locks-and-latches] Releasing all the locks
[locks-and-latches] All the locks released
ERROR: Failed to parse POMs
java.io.IOException: Backing channel 'ubuntu-1' is disconnected.
        at hudson.remoting.RemoteInvocationHandler.channelOrFail(RemoteInvocationHandler.java:191)
        at hudson.remoting.RemoteInvocationHandler.invoke(RemoteInvocationHandler.java:256)
        at com.sun.proxy.$Proxy115.isAlive(Unknown Source)
        at hudson.Launcher$RemoteLauncher$ProcImpl.isAlive(Launcher.java:1043)
        at hudson.maven.ProcessCache$MavenProcess.call(ProcessCache.java:166)
        at hudson.maven.MavenModuleSetBuild$MavenModuleSetBuildExecution.doRun(MavenModuleSetBuild.java:873)
        at hudson.model.AbstractBuild$AbstractBuildExecution.run(AbstractBuild.java:534)
        at hudson.model.Run.execute(Run.java:1728)
        at hudson.maven.MavenModuleSetBuild.run(MavenModuleSetBuild.java:544)
        at hudson.model.ResourceController.execute(ResourceController.java:98)
        at hudson.model.Executor.run(Executor.java:404)
Caused by: hudson.remoting.Channel$OrderlyShutdown
        at hudson.remoting.Channel$CloseCommand.execute(Channel.java:1121)
        at hudson.remoting.Channel$1.handle(Channel.java:526)
        at hudson.remoting.SynchronousCommandTransport$ReaderThread.run(SynchronousCommandTransport.java:83)
Caused by: Command close created at
        at hudson.remoting.Command.<init>(Command.java:59)
        at hudson.remoting.Channel$CloseCommand.<init>(Channel.java:1115)
        at hudson.remoting.Channel$CloseCommand.<init>(Channel.java:1113)
        at hudson.remoting.Channel.close(Channel.java:1273)
        at hudson.remoting.Channel.close(Channel.java:1255)
        at hudson.remoting.Channel$CloseCommand.execute(Channel.java:1120)
        ... 2 more
ERROR: ubuntu-1 is offline; cannot locate JDK 1.8 (latest)
ERROR: ubuntu-1 is offline; cannot locate Maven 3 (latest)