Jenkins build is unstable: ActiveMQ-Java8-5.15.x #527

classic Classic list List threaded Threaded
50 messages Options
123
Reply | Threaded
Open this post in threaded view
|

Jenkins build is still unstable: ActiveMQ-Java8-5.15.x #547

Apache Jenkins Server-2
Reply | Threaded
Open this post in threaded view
|

Jenkins build is still unstable: ActiveMQ-Java8-5.15.x #548

Apache Jenkins Server-2
Reply | Threaded
Open this post in threaded view
|

Build failed in Jenkins: ActiveMQ-Java8-5.15.x #549

Apache Jenkins Server-2
See <https://builds.apache.org/job/ActiveMQ-Java8-5.15.x/549/display/redirect>

Changes:


------------------------------------------
[...truncated 434.07 KB...]
[INFO] Tests run: 1, Failures: 0, Errors: 0, Skipped: 0, Time elapsed: 1.295 s - in org.apache.activemq.transport.udp.UdpSendReceiveWithTwoConnectionsTest
[INFO] Running org.apache.activemq.transport.udp.UdpTransportTest
[INFO] Tests run: 3, Failures: 0, Errors: 0, Skipped: 0, Time elapsed: 0.276 s - in org.apache.activemq.transport.udp.UdpTransportTest
[INFO] Running org.apache.activemq.transport.udp.UdpTransportUsingServerTest
[INFO] Tests run: 4, Failures: 0, Errors: 0, Skipped: 0, Time elapsed: 0.326 s - in org.apache.activemq.transport.udp.UdpTransportUsingServerTest
[INFO] Running org.apache.activemq.transport.udp.UpdTransportBindTest
[INFO] Tests run: 1, Failures: 0, Errors: 0, Skipped: 0, Time elapsed: 1.201 s - in org.apache.activemq.transport.udp.UpdTransportBindTest
[INFO] Running org.apache.activemq.transport.vm.VMTransportBrokerTest
[INFO] Tests run: 127, Failures: 0, Errors: 0, Skipped: 0, Time elapsed: 17.699 s - in org.apache.activemq.transport.vm.VMTransportBrokerTest
[INFO] Running org.apache.activemq.transport.vm.VMTransportEmbeddedBrokerTest
[INFO] Tests run: 1, Failures: 0, Errors: 0, Skipped: 0, Time elapsed: 1.168 s - in org.apache.activemq.transport.vm.VMTransportEmbeddedBrokerTest
[INFO] Running org.apache.activemq.transport.vm.VMTransportThreadSafeTest
[INFO] Tests run: 19, Failures: 0, Errors: 0, Skipped: 0, Time elapsed: 87.484 s - in org.apache.activemq.transport.vm.VMTransportThreadSafeTest
[INFO] Running org.apache.activemq.usage.CompositeMessageCursorUsageTest
[INFO] Tests run: 1, Failures: 0, Errors: 0, Skipped: 0, Time elapsed: 1.304 s - in org.apache.activemq.usage.CompositeMessageCursorUsageTest
[INFO] Running org.apache.activemq.usage.JobSchedulerStoreUsageTest
[INFO] Tests run: 1, Failures: 0, Errors: 0, Skipped: 0, Time elapsed: 5.664 s - in org.apache.activemq.usage.JobSchedulerStoreUsageTest
[INFO] Running org.apache.activemq.usage.PercentDiskUsageLimitTest
[INFO] Tests run: 4, Failures: 0, Errors: 0, Skipped: 0, Time elapsed: 2.909 s - in org.apache.activemq.usage.PercentDiskUsageLimitTest
[INFO] Running org.apache.activemq.usage.PeriodicDiskUsageLimitTest
[INFO] Tests run: 6, Failures: 0, Errors: 0, Skipped: 0, Time elapsed: 30.625 s - in org.apache.activemq.usage.PeriodicDiskUsageLimitTest
[INFO] Running org.apache.activemq.usage.QueueMemoryAndStoreUsageCleanupTest
[INFO] Tests run: 1, Failures: 0, Errors: 0, Skipped: 0, Time elapsed: 2.057 s - in org.apache.activemq.usage.QueueMemoryAndStoreUsageCleanupTest
[INFO] Running org.apache.activemq.usage.StoreUsageLimitsTest
[INFO] Tests run: 2, Failures: 0, Errors: 0, Skipped: 0, Time elapsed: 0.989 s - in org.apache.activemq.usage.StoreUsageLimitsTest
[INFO] Running org.apache.activemq.usecases.AMQ5153LevelDBSubscribedDestTest
[INFO] Tests run: 1, Failures: 0, Errors: 0, Skipped: 0, Time elapsed: 2.863 s - in org.apache.activemq.usecases.AMQ5153LevelDBSubscribedDestTest
[INFO] Running org.apache.activemq.usecases.AMQ6366Test
[INFO] Tests run: 2, Failures: 0, Errors: 0, Skipped: 0, Time elapsed: 21.79 s - in org.apache.activemq.usecases.AMQ6366Test
[INFO] Running org.apache.activemq.usecases.AMQ6446Test
[INFO] Tests run: 2, Failures: 0, Errors: 0, Skipped: 0, Time elapsed: 1.182 s - in org.apache.activemq.usecases.AMQ6446Test
[INFO] Running org.apache.activemq.usecases.AMQ6477Test
[INFO] Tests run: 4, Failures: 0, Errors: 0, Skipped: 0, Time elapsed: 2.737 s - in org.apache.activemq.usecases.AMQ6477Test
[INFO] Running org.apache.activemq.usecases.AdvisoryTopicDeletionTest
[INFO] Tests run: 2, Failures: 0, Errors: 0, Skipped: 0, Time elapsed: 1.22 s - in org.apache.activemq.usecases.AdvisoryTopicDeletionTest
[INFO] Running org.apache.activemq.usecases.AdvisoryViaNetworkTest
[INFO] Tests run: 10, Failures: 0, Errors: 0, Skipped: 0, Time elapsed: 24.703 s - in org.apache.activemq.usecases.AdvisoryViaNetworkTest
[INFO] Running org.apache.activemq.usecases.AuthorizationFromAdminViewTest
[INFO] Tests run: 1, Failures: 0, Errors: 0, Skipped: 0, Time elapsed: 1.058 s - in org.apache.activemq.usecases.AuthorizationFromAdminViewTest
[INFO] Running org.apache.activemq.usecases.BacklogNetworkCrossTalkTest
[INFO] Tests run: 1, Failures: 0, Errors: 0, Skipped: 0, Time elapsed: 134.283 s - in org.apache.activemq.usecases.BacklogNetworkCrossTalkTest
[INFO] Running org.apache.activemq.usecases.BatchedMessagePriorityConsumerTest
[INFO] Tests run: 2, Failures: 0, Errors: 0, Skipped: 0, Time elapsed: 3.254 s - in org.apache.activemq.usecases.BatchedMessagePriorityConsumerTest
[INFO] Running org.apache.activemq.usecases.BrokerQueueNetworkWithDisconnectTest
[INFO] Tests run: 4, Failures: 0, Errors: 0, Skipped: 0, Time elapsed: 84.44 s - in org.apache.activemq.usecases.BrokerQueueNetworkWithDisconnectTest
[INFO] Running org.apache.activemq.usecases.BrowseDLQTest
[INFO] Tests run: 1, Failures: 0, Errors: 0, Skipped: 0, Time elapsed: 6.616 s - in org.apache.activemq.usecases.BrowseDLQTest
[INFO] Running org.apache.activemq.usecases.ChangeSentMessageTest
[INFO] Tests run: 1, Failures: 0, Errors: 0, Skipped: 0, Time elapsed: 1.362 s - in org.apache.activemq.usecases.ChangeSentMessageTest
[INFO] Running org.apache.activemq.usecases.ChangeSessionDeliveryModeTest
[INFO] Tests run: 1, Failures: 0, Errors: 0, Skipped: 0, Time elapsed: 1.122 s - in org.apache.activemq.usecases.ChangeSessionDeliveryModeTest
[INFO] Running org.apache.activemq.usecases.CompositeConsumeTest
[INFO] Tests run: 1, Failures: 0, Errors: 0, Skipped: 0, Time elapsed: 1.244 s - in org.apache.activemq.usecases.CompositeConsumeTest
[INFO] Running org.apache.activemq.usecases.ConsumeQueuePrefetchTest
[INFO] Tests run: 4, Failures: 0, Errors: 0, Skipped: 0, Time elapsed: 1.489 s - in org.apache.activemq.usecases.ConsumeQueuePrefetchTest
[INFO] Running org.apache.activemq.usecases.ConsumeTopicPrefetchTest
[INFO] Tests run: 3, Failures: 0, Errors: 0, Skipped: 0, Time elapsed: 1.36 s - in org.apache.activemq.usecases.ConsumeTopicPrefetchTest
[INFO] Running org.apache.activemq.usecases.CreateTemporaryQueueBeforeStartTest
[INFO] Tests run: 3, Failures: 0, Errors: 0, Skipped: 0, Time elapsed: 1.233 s - in org.apache.activemq.usecases.CreateTemporaryQueueBeforeStartTest
[INFO] Running org.apache.activemq.usecases.DuplexAdvisoryRaceTest
[INFO] Tests run: 1, Failures: 0, Errors: 0, Skipped: 0, Time elapsed: 387.158 s - in org.apache.activemq.usecases.DuplexAdvisoryRaceTest
[INFO] Running org.apache.activemq.usecases.DurableRedeliveryTest
[INFO] Tests run: 1, Failures: 0, Errors: 0, Skipped: 0, Time elapsed: 1.331 s - in org.apache.activemq.usecases.DurableRedeliveryTest
[INFO] Running org.apache.activemq.usecases.DurableSubCacheTest
[INFO] Tests run: 2, Failures: 0, Errors: 0, Skipped: 0, Time elapsed: 3.337 s - in org.apache.activemq.usecases.DurableSubCacheTest
[INFO] Running org.apache.activemq.usecases.DurableSubInBrokerNetworkTest
[INFO] Tests run: 2, Failures: 0, Errors: 0, Skipped: 0, Time elapsed: 1.752 s - in org.apache.activemq.usecases.DurableSubInBrokerNetworkTest
[INFO] Running org.apache.activemq.usecases.DurableSubProcessConcurrentCommitActivateNoDuplicateTest
[WARNING] Tests run: 1, Failures: 0, Errors: 0, Skipped: 1, Time elapsed: 0.078 s - in org.apache.activemq.usecases.DurableSubProcessConcurrentCommitActivateNoDuplicateTest
[INFO] Running org.apache.activemq.usecases.DurableSubProcessWithRestartTest
[WARNING] Tests run: 1, Failures: 0, Errors: 0, Skipped: 1, Time elapsed: 0.093 s - in org.apache.activemq.usecases.DurableSubProcessWithRestartTest
[INFO] Running org.apache.activemq.usecases.DurableSubsOfflineSelectorConcurrentConsumeIndexUseTest
[INFO] Tests run: 1, Failures: 0, Errors: 0, Skipped: 0, Time elapsed: 210.085 s - in org.apache.activemq.usecases.DurableSubsOfflineSelectorConcurrentConsumeIndexUseTest
[INFO] Running org.apache.activemq.usecases.DurableSubsOfflineSelectorIndexUseTest
[INFO] Tests run: 3, Failures: 0, Errors: 0, Skipped: 0, Time elapsed: 52.756 s - in org.apache.activemq.usecases.DurableSubsOfflineSelectorIndexUseTest
[INFO] Running org.apache.activemq.usecases.DurableSubscriberWithNetworkRestartTest
[INFO] Tests run: 2, Failures: 0, Errors: 0, Skipped: 0, Time elapsed: 14.947 s - in org.apache.activemq.usecases.DurableSubscriberWithNetworkRestartTest
[INFO] Running org.apache.activemq.usecases.DurableSubscriptionOffline1Test
[INFO] Tests run: 18, Failures: 0, Errors: 0, Skipped: 0, Time elapsed: 172.586 s - in org.apache.activemq.usecases.DurableSubscriptionOffline1Test
[INFO] Running org.apache.activemq.usecases.DurableSubscriptionOffline2Test
[INFO] Tests run: 2, Failures: 0, Errors: 0, Skipped: 0, Time elapsed: 5.474 s - in org.apache.activemq.usecases.DurableSubscriptionOffline2Test
[INFO] Running org.apache.activemq.usecases.DurableSubscriptionOffline3Test
[INFO] Tests run: 12, Failures: 0, Errors: 0, Skipped: 0, Time elapsed: 188.31 s - in org.apache.activemq.usecases.DurableSubscriptionOffline3Test
[INFO] Running org.apache.activemq.usecases.DurableSubscriptionOffline4Test
[INFO] Tests run: 2, Failures: 0, Errors: 0, Skipped: 0, Time elapsed: 48.458 s - in org.apache.activemq.usecases.DurableSubscriptionOffline4Test
[INFO] Running org.apache.activemq.usecases.DurableSubscriptionOfflineBrowseRemoveTest
[INFO] Tests run: 4, Failures: 0, Errors: 0, Skipped: 0, Time elapsed: 38.275 s - in org.apache.activemq.usecases.DurableSubscriptionOfflineBrowseRemoveTest
[INFO] Running org.apache.activemq.usecases.DurableSubscriptionUpdatesTest
[INFO] Tests run: 3, Failures: 0, Errors: 0, Skipped: 0, Time elapsed: 12.159 s - in org.apache.activemq.usecases.DurableSubscriptionUpdatesTest
[INFO] Running org.apache.activemq.usecases.DurableSubscriptionWithNoLocalTest
ERROR: H42 is offline; cannot locate JDK 1.8 (latest)
ERROR: H42 is offline; cannot locate Maven 3 (latest)
No mail will be sent out, as 'ActiveMQ-Java8-5.15.x » ActiveMQ :: KahaDB Store #549' does not have a result yet. Please make sure you set a proper result in case of pipeline/build scripts.
ERROR: H42 is offline; cannot locate JDK 1.8 (latest)
ERROR: H42 is offline; cannot locate Maven 3 (latest)
No mail will be sent out, as 'ActiveMQ-Java8-5.15.x » ActiveMQ :: OSGi bundle #549' does not have a result yet. Please make sure you set a proper result in case of pipeline/build scripts.
ERROR: H42 is offline; cannot locate JDK 1.8 (latest)
ERROR: H42 is offline; cannot locate Maven 3 (latest)
No mail will be sent out, as 'ActiveMQ-Java8-5.15.x » ActiveMQ :: Unit Tests #549' does not have a result yet. Please make sure you set a proper result in case of pipeline/build scripts.
ERROR: H42 is offline; cannot locate JDK 1.8 (latest)
ERROR: H42 is offline; cannot locate Maven 3 (latest)
No mail will be sent out, as 'ActiveMQ-Java8-5.15.x » ActiveMQ :: Openwire Legacy Support #549' does not have a result yet. Please make sure you set a proper result in case of pipeline/build scripts.
ERROR: H42 is offline; cannot locate JDK 1.8 (latest)
ERROR: H42 is offline; cannot locate Maven 3 (latest)
No mail will be sent out, as 'ActiveMQ-Java8-5.15.x » ActiveMQ :: Karaf Integration Tests #549' does not have a result yet. Please make sure you set a proper result in case of pipeline/build scripts.
ERROR: H42 is offline; cannot locate JDK 1.8 (latest)
ERROR: H42 is offline; cannot locate Maven 3 (latest)
No mail will be sent out, as 'ActiveMQ-Java8-5.15.x » ActiveMQ :: RAR #549' does not have a result yet. Please make sure you set a proper result in case of pipeline/build scripts.
ERROR: H42 is offline; cannot locate JDK 1.8 (latest)
ERROR: H42 is offline; cannot locate Maven 3 (latest)
No mail will be sent out, as 'ActiveMQ-Java8-5.15.x » ActiveMQ :: HTTP Protocol Support #549' does not have a result yet. Please make sure you set a proper result in case of pipeline/build scripts.
ERROR: H42 is offline; cannot locate JDK 1.8 (latest)
ERROR: H42 is offline; cannot locate Maven 3 (latest)
No mail will be sent out, as 'ActiveMQ-Java8-5.15.x » ActiveMQ :: AMQP #549' does not have a result yet. Please make sure you set a proper result in case of pipeline/build scripts.
ERROR: H42 is offline; cannot locate JDK 1.8 (latest)
ERROR: H42 is offline; cannot locate Maven 3 (latest)
No mail will be sent out, as 'ActiveMQ-Java8-5.15.x » ActiveMQ :: Client #549' does not have a result yet. Please make sure you set a proper result in case of pipeline/build scripts.
ERROR: H42 is offline; cannot locate JDK 1.8 (latest)
ERROR: H42 is offline; cannot locate Maven 3 (latest)
No mail will be sent out, as 'ActiveMQ-Java8-5.15.x » ActiveMQ :: Blueprint #549' does not have a result yet. Please make sure you set a proper result in case of pipeline/build scripts.
ERROR: H42 is offline; cannot locate JDK 1.8 (latest)
ERROR: H42 is offline; cannot locate Maven 3 (latest)
No mail will be sent out, as 'ActiveMQ-Java8-5.15.x » ActiveMQ :: JUnit Rule #549' does not have a result yet. Please make sure you set a proper result in case of pipeline/build scripts.
ERROR: H42 is offline; cannot locate JDK 1.8 (latest)
ERROR: H42 is offline; cannot locate Maven 3 (latest)
No mail will be sent out, as 'ActiveMQ-Java8-5.15.x » ActiveMQ :: Tooling #549' does not have a result yet. Please make sure you set a proper result in case of pipeline/build scripts.
ERROR: H42 is offline; cannot locate JDK 1.8 (latest)
ERROR: H42 is offline; cannot locate Maven 3 (latest)
No mail will be sent out, as 'ActiveMQ-Java8-5.15.x » ActiveMQ :: Generic JMS Pool #549' does not have a result yet. Please make sure you set a proper result in case of pipeline/build scripts.
ERROR: H42 is offline; cannot locate JDK 1.8 (latest)
ERROR: H42 is offline; cannot locate Maven 3 (latest)
No mail will be sent out, as 'ActiveMQ-Java8-5.15.x » ActiveMQ :: Pool #549' does not have a result yet. Please make sure you set a proper result in case of pipeline/build scripts.
ERROR: H42 is offline; cannot locate JDK 1.8 (latest)
ERROR: H42 is offline; cannot locate Maven 3 (latest)
No mail will be sent out, as 'ActiveMQ-Java8-5.15.x » ActiveMQ :: JDBC Store #549' does not have a result yet. Please make sure you set a proper result in case of pipeline/build scripts.
ERROR: H42 is offline; cannot locate JDK 1.8 (latest)
ERROR: H42 is offline; cannot locate Maven 3 (latest)
No mail will be sent out, as 'ActiveMQ-Java8-5.15.x » ActiveMQ :: Camel #549' does not have a result yet. Please make sure you set a proper result in case of pipeline/build scripts.
ERROR: H42 is offline; cannot locate JDK 1.8 (latest)
ERROR: H42 is offline; cannot locate Maven 3 (latest)
No mail will be sent out, as 'ActiveMQ-Java8-5.15.x » ActiveMQ :: Runtime Configuration #549' does not have a result yet. Please make sure you set a proper result in case of pipeline/build scripts.
ERROR: H42 is offline; cannot locate JDK 1.8 (latest)
ERROR: H42 is offline; cannot locate Maven 3 (latest)
No mail will be sent out, as 'ActiveMQ-Java8-5.15.x » ActiveMQ #549' does not have a result yet. Please make sure you set a proper result in case of pipeline/build scripts.
ERROR: H42 is offline; cannot locate JDK 1.8 (latest)
ERROR: H42 is offline; cannot locate Maven 3 (latest)
Sending e-mails to: [hidden email]
ERROR: H42 is offline; cannot locate JDK 1.8 (latest)
ERROR: H42 is offline; cannot locate Maven 3 (latest)
No mail will be sent out, as 'ActiveMQ-Java8-5.15.x » ActiveMQ :: Openwire Generator #549' does not have a result yet. Please make sure you set a proper result in case of pipeline/build scripts.
ERROR: H42 is offline; cannot locate JDK 1.8 (latest)
ERROR: H42 is offline; cannot locate Maven 3 (latest)
No mail will be sent out, as 'ActiveMQ-Java8-5.15.x » ActiveMQ :: Broker #549' does not have a result yet. Please make sure you set a proper result in case of pipeline/build scripts.
ERROR: H42 is offline; cannot locate JDK 1.8 (latest)
ERROR: H42 is offline; cannot locate Maven 3 (latest)
No mail will be sent out, as 'ActiveMQ-Java8-5.15.x » ActiveMQ :: Web Demo #549' does not have a result yet. Please make sure you set a proper result in case of pipeline/build scripts.
ERROR: H42 is offline; cannot locate JDK 1.8 (latest)
ERROR: H42 is offline; cannot locate Maven 3 (latest)
Sending e-mails to: [hidden email]
ERROR: H42 is offline; cannot locate JDK 1.8 (latest)
ERROR: H42 is offline; cannot locate Maven 3 (latest)
No mail will be sent out, as 'ActiveMQ-Java8-5.15.x » ActiveMQ :: Shiro #549' does not have a result yet. Please make sure you set a proper result in case of pipeline/build scripts.
ERROR: H42 is offline; cannot locate JDK 1.8 (latest)
ERROR: H42 is offline; cannot locate Maven 3 (latest)
No mail will be sent out, as 'ActiveMQ-Java8-5.15.x » ActiveMQ :: Performance Test Plugin #549' does not have a result yet. Please make sure you set a proper result in case of pipeline/build scripts.
ERROR: H42 is offline; cannot locate JDK 1.8 (latest)
ERROR: H42 is offline; cannot locate Maven 3 (latest)
No mail will be sent out, as 'ActiveMQ-Java8-5.15.x » ActiveMQ :: Run Jar #549' does not have a result yet. Please make sure you set a proper result in case of pipeline/build scripts.
ERROR: H42 is offline; cannot locate JDK 1.8 (latest)
ERROR: H42 is offline; cannot locate Maven 3 (latest)
No mail will be sent out, as 'ActiveMQ-Java8-5.15.x » ActiveMQ :: StartUp/Stop Plugin #549' does not have a result yet. Please make sure you set a proper result in case of pipeline/build scripts.
ERROR: H42 is offline; cannot locate JDK 1.8 (latest)
ERROR: H42 is offline; cannot locate Maven 3 (latest)
No mail will be sent out, as 'ActiveMQ-Java8-5.15.x » ActiveMQ :: Apache Karaf #549' does not have a result yet. Please make sure you set a proper result in case of pipeline/build scripts.
ERROR: H42 is offline; cannot locate JDK 1.8 (latest)
ERROR: H42 is offline; cannot locate Maven 3 (latest)
No mail will be sent out, as 'ActiveMQ-Java8-5.15.x » ActiveMQ :: Web Console #549' does not have a result yet. Please make sure you set a proper result in case of pipeline/build scripts.
ERROR: H42 is offline; cannot locate JDK 1.8 (latest)
ERROR: H42 is offline; cannot locate Maven 3 (latest)
No mail will be sent out, as 'ActiveMQ-Java8-5.15.x » ActiveMQ :: JAAS #549' does not have a result yet. Please make sure you set a proper result in case of pipeline/build scripts.
ERROR: H42 is offline; cannot locate JDK 1.8 (latest)
ERROR: H42 is offline; cannot locate Maven 3 (latest)
No mail will be sent out, as 'ActiveMQ-Java8-5.15.x » ActiveMQ :: Integration Test :: Spring 3.1 #549' does not have a result yet. Please make sure you set a proper result in case of pipeline/build scripts.
ERROR: H42 is offline; cannot locate JDK 1.8 (latest)
ERROR: H42 is offline; cannot locate Maven 3 (latest)
No mail will be sent out, as 'ActiveMQ-Java8-5.15.x » ActiveMQ :: Memory Usage Test Plugin #549' does not have a result yet. Please make sure you set a proper result in case of pipeline/build scripts.
ERROR: H42 is offline; cannot locate JDK 1.8 (latest)
ERROR: H42 is offline; cannot locate Maven 3 (latest)
No mail will be sent out, as 'ActiveMQ-Java8-5.15.x » ActiveMQ :: RA #549' does not have a result yet. Please make sure you set a proper result in case of pipeline/build scripts.
ERROR: H42 is offline; cannot locate JDK 1.8 (latest)
ERROR: H42 is offline; cannot locate Maven 3 (latest)
No mail will be sent out, as 'ActiveMQ-Java8-5.15.x » ActiveMQ :: Partition Management #549' does not have a result yet. Please make sure you set a proper result in case of pipeline/build scripts.
ERROR: H42 is offline; cannot locate JDK 1.8 (latest)
ERROR: H42 is offline; cannot locate Maven 3 (latest)
No mail will be sent out, as 'ActiveMQ-Java8-5.15.x » ActiveMQ :: All JAR bundle #549' does not have a result yet. Please make sure you set a proper result in case of pipeline/build scripts.
ERROR: H42 is offline; cannot locate JDK 1.8 (latest)
ERROR: H42 is offline; cannot locate Maven 3 (latest)
No mail will be sent out, as 'ActiveMQ-Java8-5.15.x » ActiveMQ :: Assembly #549' does not have a result yet. Please make sure you set a proper result in case of pipeline/build scripts.
ERROR: H42 is offline; cannot locate JDK 1.8 (latest)
ERROR: H42 is offline; cannot locate Maven 3 (latest)
No mail will be sent out, as 'ActiveMQ-Java8-5.15.x » ActiveMQ :: Console #549' does not have a result yet. Please make sure you set a proper result in case of pipeline/build scripts.
ERROR: H42 is offline; cannot locate JDK 1.8 (latest)
ERROR: H42 is offline; cannot locate Maven 3 (latest)
No mail will be sent out, as 'ActiveMQ-Java8-5.15.x » ActiveMQ :: Spring #549' does not have a result yet. Please make sure you set a proper result in case of pipeline/build scripts.
ERROR: H42 is offline; cannot locate JDK 1.8 (latest)
ERROR: H42 is offline; cannot locate Maven 3 (latest)
No mail will be sent out, as 'ActiveMQ-Java8-5.15.x » ActiveMQ :: ConnectionFactory #549' does not have a result yet. Please make sure you set a proper result in case of pipeline/build scripts.
ERROR: H42 is offline; cannot locate JDK 1.8 (latest)
ERROR: H42 is offline; cannot locate Maven 3 (latest)
No mail will be sent out, as 'ActiveMQ-Java8-5.15.x » ActiveMQ :: LevelDB Store #549' does not have a result yet. Please make sure you set a proper result in case of pipeline/build scripts.
ERROR: H42 is offline; cannot locate JDK 1.8 (latest)
ERROR: H42 is offline; cannot locate Maven 3 (latest)
No mail will be sent out, as 'ActiveMQ-Java8-5.15.x » ActiveMQ :: Web #549' does not have a result yet. Please make sure you set a proper result in case of pipeline/build scripts.
ERROR: H42 is offline; cannot locate JDK 1.8 (latest)
ERROR: H42 is offline; cannot locate Maven 3 (latest)
No mail will be sent out, as 'ActiveMQ-Java8-5.15.x » ActiveMQ :: Log4j Appender #549' does not have a result yet. Please make sure you set a proper result in case of pipeline/build scripts.
[locks-and-latches] Releasing all the locks
[locks-and-latches] All the locks released
ERROR: Failed to parse POMs
java.io.IOException: Backing channel 'H42' is disconnected.
        at hudson.remoting.RemoteInvocationHandler.channelOrFail(RemoteInvocationHandler.java:214)
        at hudson.remoting.RemoteInvocationHandler.invoke(RemoteInvocationHandler.java:283)
        at com.sun.proxy.$Proxy143.isAlive(Unknown Source)
        at hudson.Launcher$RemoteLauncher$ProcImpl.isAlive(Launcher.java:1150)
        at hudson.maven.ProcessCache$MavenProcess.call(ProcessCache.java:166)
        at hudson.maven.MavenModuleSetBuild$MavenModuleSetBuildExecution.doRun(MavenModuleSetBuild.java:879)
        at hudson.model.AbstractBuild$AbstractBuildExecution.run(AbstractBuild.java:504)
        at hudson.model.Run.execute(Run.java:1815)
        at hudson.maven.MavenModuleSetBuild.run(MavenModuleSetBuild.java:543)
        at hudson.model.ResourceController.execute(ResourceController.java:97)
        at hudson.model.Executor.run(Executor.java:429)
Caused by: java.io.IOException: Unexpected termination of the channel
        at hudson.remoting.SynchronousCommandTransport$ReaderThread.run(SynchronousCommandTransport.java:77)
Caused by: java.io.EOFException
        at java.io.ObjectInputStream$PeekInputStream.readFully(ObjectInputStream.java:2681)
        at java.io.ObjectInputStream$BlockDataInputStream.readShort(ObjectInputStream.java:3156)
        at java.io.ObjectInputStream.readStreamHeader(ObjectInputStream.java:862)
        at java.io.ObjectInputStream.<init>(ObjectInputStream.java:358)
        at hudson.remoting.ObjectInputStreamEx.<init>(ObjectInputStreamEx.java:49)
        at hudson.remoting.Command.readFrom(Command.java:140)
        at hudson.remoting.Command.readFrom(Command.java:126)
        at hudson.remoting.AbstractSynchronousByteArrayCommandTransport.read(AbstractSynchronousByteArrayCommandTransport.java:36)
        at hudson.remoting.SynchronousCommandTransport$ReaderThread.run(SynchronousCommandTransport.java:63)
ERROR: H42 is offline; cannot locate JDK 1.8 (latest)
ERROR: H42 is offline; cannot locate Maven 3 (latest)
ERROR: H42 is offline; cannot locate JDK 1.8 (latest)
ERROR: H42 is offline; cannot locate Maven 3 (latest)
ERROR: H42 is offline; cannot locate JDK 1.8 (latest)
ERROR: H42 is offline; cannot locate Maven 3 (latest)
Reply | Threaded
Open this post in threaded view
|

Jenkins build is unstable: ActiveMQ-Java8-5.15.x #550

Apache Jenkins Server-2
Reply | Threaded
Open this post in threaded view
|

Jenkins build is still unstable: ActiveMQ-Java8-5.15.x #551

Apache Jenkins Server-2
Reply | Threaded
Open this post in threaded view
|

Jenkins build is still unstable: ActiveMQ-Java8-5.15.x #552

Apache Jenkins Server-2
Reply | Threaded
Open this post in threaded view
|

Jenkins build is still unstable: ActiveMQ-Java8-5.15.x #553

Apache Jenkins Server-2
Reply | Threaded
Open this post in threaded view
|

Jenkins build is still unstable: ActiveMQ-Java8-5.15.x #554

Apache Jenkins Server-2
Reply | Threaded
Open this post in threaded view
|

Jenkins build is still unstable: ActiveMQ-Java8-5.15.x #555

Apache Jenkins Server-2
Reply | Threaded
Open this post in threaded view
|

Jenkins build is still unstable: ActiveMQ-Java8-5.15.x #556

Apache Jenkins Server-2
Reply | Threaded
Open this post in threaded view
|

Jenkins build is still unstable: ActiveMQ-Java8-5.15.x #557

Apache Jenkins Server-2
Reply | Threaded
Open this post in threaded view
|

Build failed in Jenkins: ActiveMQ-Java8-5.15.x #558

Apache Jenkins Server-2
See <https://builds.apache.org/job/ActiveMQ-Java8-5.15.x/558/display/redirect>

Changes:


------------------------------------------
[...truncated 353.84 KB...]
    at sun.reflect.NativeMethodAccessorImpl.invoke (NativeMethodAccessorImpl.java:62)
    at sun.reflect.DelegatingMethodAccessorImpl.invoke (DelegatingMethodAccessorImpl.java:43)
    at java.lang.reflect.Method.invoke (Method.java:498)
    at hudson.maven.Maven3Builder.call (Maven3Builder.java:139)
    at hudson.maven.Maven3Builder.call (Maven3Builder.java:70)
    at hudson.remoting.UserRequest.perform (UserRequest.java:212)
    at hudson.remoting.UserRequest.perform (UserRequest.java:54)
    at hudson.remoting.Request$2.run (Request.java:369)
    at hudson.remoting.InterceptingExecutorService$1.call (InterceptingExecutorService.java:72)
    at java.util.concurrent.FutureTask.run (FutureTask.java:266)
    at java.util.concurrent.ThreadPoolExecutor.runWorker (ThreadPoolExecutor.java:1149)
    at java.util.concurrent.ThreadPoolExecutor$Worker.run (ThreadPoolExecutor.java:624)
    at java.lang.Thread.run (Thread.java:748)
Caused by: org.eclipse.aether.transfer.ArtifactTransferException: Could not transfer artifact org.apache.activemq:activemq-console:jar:5.15.14-20200712.021055-50 from/to apache.snapshots.https (https://repository.apache.org/content/repositories/snapshots): Transfer failed for https://repository.apache.org/content/repositories/snapshots/org/apache/activemq/activemq-console/5.15.14-SNAPSHOT/activemq-console-5.15.14-20200712.021055-50.jar 502 Proxy Error
    at org.eclipse.aether.connector.basic.ArtifactTransportListener.transferFailed (ArtifactTransportListener.java:52)
    at org.eclipse.aether.connector.basic.BasicRepositoryConnector$TaskRunner.run (BasicRepositoryConnector.java:369)
    at org.eclipse.aether.connector.basic.BasicRepositoryConnector.put (BasicRepositoryConnector.java:288)
    at org.eclipse.aether.internal.impl.DefaultDeployer.deploy (DefaultDeployer.java:295)
    at org.eclipse.aether.internal.impl.DefaultDeployer.deploy (DefaultDeployer.java:213)
    at org.eclipse.aether.internal.impl.DefaultRepositorySystem.deploy (DefaultRepositorySystem.java:386)
    at org.apache.maven.artifact.deployer.DefaultArtifactDeployer.deploy (DefaultArtifactDeployer.java:142)
    at org.apache.maven.plugin.deploy.AbstractDeployMojo.deploy (AbstractDeployMojo.java:171)
    at org.apache.maven.plugin.deploy.DeployMojo.deployProject (DeployMojo.java:250)
    at org.apache.maven.plugin.deploy.DeployMojo.execute (DeployMojo.java:169)
    at org.apache.maven.plugin.DefaultBuildPluginManager.executeMojo (DefaultBuildPluginManager.java:137)
    at org.apache.maven.lifecycle.internal.MojoExecutor.execute (MojoExecutor.java:210)
    at org.apache.maven.lifecycle.internal.MojoExecutor.execute (MojoExecutor.java:156)
    at org.apache.maven.lifecycle.internal.MojoExecutor.execute (MojoExecutor.java:148)
    at org.apache.maven.lifecycle.internal.LifecycleModuleBuilder.buildProject (LifecycleModuleBuilder.java:117)
    at org.apache.maven.lifecycle.internal.LifecycleModuleBuilder.buildProject (LifecycleModuleBuilder.java:81)
    at org.apache.maven.lifecycle.internal.builder.singlethreaded.SingleThreadedBuilder.build (SingleThreadedBuilder.java:56)
    at org.apache.maven.lifecycle.internal.LifecycleStarter.execute (LifecycleStarter.java:128)
    at org.apache.maven.DefaultMaven.doExecute (DefaultMaven.java:305)
    at org.apache.maven.DefaultMaven.doExecute (DefaultMaven.java:192)
    at org.apache.maven.DefaultMaven.execute (DefaultMaven.java:105)
    at org.jvnet.hudson.maven3.launcher.Maven35Launcher.main (Maven35Launcher.java:130)
    at sun.reflect.NativeMethodAccessorImpl.invoke0 (Native Method)
    at sun.reflect.NativeMethodAccessorImpl.invoke (NativeMethodAccessorImpl.java:62)
    at sun.reflect.DelegatingMethodAccessorImpl.invoke (DelegatingMethodAccessorImpl.java:43)
    at java.lang.reflect.Method.invoke (Method.java:498)
    at org.codehaus.plexus.classworlds.launcher.Launcher.launchEnhanced (Launcher.java:282)
    at org.codehaus.plexus.classworlds.launcher.Launcher.launch (Launcher.java:225)
    at jenkins.maven3.agent.Maven35Main.launch (Maven35Main.java:178)
    at sun.reflect.NativeMethodAccessorImpl.invoke0 (Native Method)
    at sun.reflect.NativeMethodAccessorImpl.invoke (NativeMethodAccessorImpl.java:62)
    at sun.reflect.DelegatingMethodAccessorImpl.invoke (DelegatingMethodAccessorImpl.java:43)
    at java.lang.reflect.Method.invoke (Method.java:498)
    at hudson.maven.Maven3Builder.call (Maven3Builder.java:139)
    at hudson.maven.Maven3Builder.call (Maven3Builder.java:70)
    at hudson.remoting.UserRequest.perform (UserRequest.java:212)
    at hudson.remoting.UserRequest.perform (UserRequest.java:54)
    at hudson.remoting.Request$2.run (Request.java:369)
    at hudson.remoting.InterceptingExecutorService$1.call (InterceptingExecutorService.java:72)
    at java.util.concurrent.FutureTask.run (FutureTask.java:266)
    at java.util.concurrent.ThreadPoolExecutor.runWorker (ThreadPoolExecutor.java:1149)
    at java.util.concurrent.ThreadPoolExecutor$Worker.run (ThreadPoolExecutor.java:624)
    at java.lang.Thread.run (Thread.java:748)
Caused by: org.apache.maven.wagon.TransferFailedException: Transfer failed for https://repository.apache.org/content/repositories/snapshots/org/apache/activemq/activemq-console/5.15.14-SNAPSHOT/activemq-console-5.15.14-20200712.021055-50.jar 502 Proxy Error
    at org.apache.maven.wagon.providers.http.wagon.shared.AbstractHttpClientWagon.put (AbstractHttpClientWagon.java:820)
    at org.apache.maven.wagon.providers.http.wagon.shared.AbstractHttpClientWagon.put (AbstractHttpClientWagon.java:737)
    at org.apache.maven.wagon.providers.http.wagon.shared.AbstractHttpClientWagon.put (AbstractHttpClientWagon.java:709)
    at org.apache.maven.wagon.providers.http.wagon.shared.AbstractHttpClientWagon.put (AbstractHttpClientWagon.java:703)
    at org.apache.maven.wagon.providers.http.wagon.shared.AbstractHttpClientWagon.put (AbstractHttpClientWagon.java:683)
    at org.eclipse.aether.transport.wagon.WagonTransporter$PutTaskRunner.run (WagonTransporter.java:686)
    at org.eclipse.aether.transport.wagon.WagonTransporter.execute (WagonTransporter.java:435)
    at org.eclipse.aether.transport.wagon.WagonTransporter.put (WagonTransporter.java:418)
    at org.eclipse.aether.connector.basic.BasicRepositoryConnector$PutTaskRunner.runTask (BasicRepositoryConnector.java:556)
    at org.eclipse.aether.connector.basic.BasicRepositoryConnector$TaskRunner.run (BasicRepositoryConnector.java:364)
    at org.eclipse.aether.connector.basic.BasicRepositoryConnector.put (BasicRepositoryConnector.java:288)
    at org.eclipse.aether.internal.impl.DefaultDeployer.deploy (DefaultDeployer.java:295)
    at org.eclipse.aether.internal.impl.DefaultDeployer.deploy (DefaultDeployer.java:213)
    at org.eclipse.aether.internal.impl.DefaultRepositorySystem.deploy (DefaultRepositorySystem.java:386)
    at org.apache.maven.artifact.deployer.DefaultArtifactDeployer.deploy (DefaultArtifactDeployer.java:142)
    at org.apache.maven.plugin.deploy.AbstractDeployMojo.deploy (AbstractDeployMojo.java:171)
    at org.apache.maven.plugin.deploy.DeployMojo.deployProject (DeployMojo.java:250)
    at org.apache.maven.plugin.deploy.DeployMojo.execute (DeployMojo.java:169)
    at org.apache.maven.plugin.DefaultBuildPluginManager.executeMojo (DefaultBuildPluginManager.java:137)
    at org.apache.maven.lifecycle.internal.MojoExecutor.execute (MojoExecutor.java:210)
    at org.apache.maven.lifecycle.internal.MojoExecutor.execute (MojoExecutor.java:156)
    at org.apache.maven.lifecycle.internal.MojoExecutor.execute (MojoExecutor.java:148)
    at org.apache.maven.lifecycle.internal.LifecycleModuleBuilder.buildProject (LifecycleModuleBuilder.java:117)
    at org.apache.maven.lifecycle.internal.LifecycleModuleBuilder.buildProject (LifecycleModuleBuilder.java:81)
    at org.apache.maven.lifecycle.internal.builder.singlethreaded.SingleThreadedBuilder.build (SingleThreadedBuilder.java:56)
    at org.apache.maven.lifecycle.internal.LifecycleStarter.execute (LifecycleStarter.java:128)
    at org.apache.maven.DefaultMaven.doExecute (DefaultMaven.java:305)
    at org.apache.maven.DefaultMaven.doExecute (DefaultMaven.java:192)
    at org.apache.maven.DefaultMaven.execute (DefaultMaven.java:105)
    at org.jvnet.hudson.maven3.launcher.Maven35Launcher.main (Maven35Launcher.java:130)
    at sun.reflect.NativeMethodAccessorImpl.invoke0 (Native Method)
    at sun.reflect.NativeMethodAccessorImpl.invoke (NativeMethodAccessorImpl.java:62)
    at sun.reflect.DelegatingMethodAccessorImpl.invoke (DelegatingMethodAccessorImpl.java:43)
    at java.lang.reflect.Method.invoke (Method.java:498)
    at org.codehaus.plexus.classworlds.launcher.Launcher.launchEnhanced (Launcher.java:282)
    at org.codehaus.plexus.classworlds.launcher.Launcher.launch (Launcher.java:225)
    at jenkins.maven3.agent.Maven35Main.launch (Maven35Main.java:178)
    at sun.reflect.NativeMethodAccessorImpl.invoke0 (Native Method)
    at sun.reflect.NativeMethodAccessorImpl.invoke (NativeMethodAccessorImpl.java:62)
    at sun.reflect.DelegatingMethodAccessorImpl.invoke (DelegatingMethodAccessorImpl.java:43)
    at java.lang.reflect.Method.invoke (Method.java:498)
    at hudson.maven.Maven3Builder.call (Maven3Builder.java:139)
    at hudson.maven.Maven3Builder.call (Maven3Builder.java:70)
    at hudson.remoting.UserRequest.perform (UserRequest.java:212)
    at hudson.remoting.UserRequest.perform (UserRequest.java:54)
    at hudson.remoting.Request$2.run (Request.java:369)
    at hudson.remoting.InterceptingExecutorService$1.call (InterceptingExecutorService.java:72)
    at java.util.concurrent.FutureTask.run (FutureTask.java:266)
    at java.util.concurrent.ThreadPoolExecutor.runWorker (ThreadPoolExecutor.java:1149)
    at java.util.concurrent.ThreadPoolExecutor$Worker.run (ThreadPoolExecutor.java:624)
    at java.lang.Thread.run (Thread.java:748)
[ERROR]
[ERROR] Re-run Maven using the -X switch to enable full debug logging.
[ERROR]
[ERROR] For more information about the errors and possible solutions, please read the following articles:
[ERROR] [Help 1] http://cwiki.apache.org/confluence/display/MAVEN/MojoExecutionException
[ERROR]
[ERROR] After correcting the problems, you can resume the build with the command
[ERROR]   mvn <goals> -rf :activemq-spring
[JENKINS] Archiving <https://builds.apache.org/job/ActiveMQ-Java8-5.15.x/ws/activemq-kahadb-store/pom.xml> to org.apache.activemq/activemq-kahadb-store/5.15.14-SNAPSHOT/activemq-kahadb-store-5.15.14-SNAPSHOT.pom
[JENKINS] Archiving <https://builds.apache.org/job/ActiveMQ-Java8-5.15.x/ws/activemq-kahadb-store/target/activemq-kahadb-store-5.15.14-SNAPSHOT.jar> to org.apache.activemq/activemq-kahadb-store/5.15.14-20200712.011538-52/activemq-kahadb-store-5.15.14-20200712.011538-52.jar
[JENKINS] Archiving <https://builds.apache.org/job/ActiveMQ-Java8-5.15.x/ws/activemq-kahadb-store/target/activemq-kahadb-store-5.15.14-SNAPSHOT-sources.jar> to org.apache.activemq/activemq-kahadb-store/5.15.14-20200712.011538-52/activemq-kahadb-store-5.15.14-20200712.011538-52-sources.jar
[JENKINS] Archiving <https://builds.apache.org/job/ActiveMQ-Java8-5.15.x/ws/activemq-osgi/pom.xml> to org.apache.activemq/activemq-osgi/5.15.14-SNAPSHOT/activemq-osgi-5.15.14-SNAPSHOT.pom
[JENKINS] Archiving <https://builds.apache.org/job/ActiveMQ-Java8-5.15.x/ws/activemq-unit-tests/pom.xml> to org.apache.activemq/activemq-unit-tests/5.15.14-SNAPSHOT/activemq-unit-tests-5.15.14-SNAPSHOT.pom
[Fast Archiver] Compressed 71.84 KB of artifacts by 44.5% relative to #557
[JENKINS] Archiving <https://builds.apache.org/job/ActiveMQ-Java8-5.15.x/ws/activemq-openwire-legacy/pom.xml> to org.apache.activemq/activemq-openwire-legacy/5.15.14-SNAPSHOT/activemq-openwire-legacy-5.15.14-SNAPSHOT.pom
[JENKINS] Archiving <https://builds.apache.org/job/ActiveMQ-Java8-5.15.x/ws/activemq-openwire-legacy/target/activemq-openwire-legacy-5.15.14-SNAPSHOT.jar> to org.apache.activemq/activemq-openwire-legacy/5.15.14-20200712.005457-52/activemq-openwire-legacy-5.15.14-20200712.005457-52.jar
[JENKINS] Archiving <https://builds.apache.org/job/ActiveMQ-Java8-5.15.x/ws/activemq-openwire-legacy/target/activemq-openwire-legacy-5.15.14-SNAPSHOT-sources.jar> to org.apache.activemq/activemq-openwire-legacy/5.15.14-20200712.005457-52/activemq-openwire-legacy-5.15.14-20200712.005457-52-sources.jar
[JENKINS] Archiving <https://builds.apache.org/job/ActiveMQ-Java8-5.15.x/ws/activemq-karaf-itest/pom.xml> to org.apache.activemq/activemq-karaf-itest/5.15.14-SNAPSHOT/activemq-karaf-itest-5.15.14-SNAPSHOT.pom
[JENKINS] Archiving <https://builds.apache.org/job/ActiveMQ-Java8-5.15.x/ws/activemq-rar/pom.xml> to org.apache.activemq/activemq-rar/5.15.14-SNAPSHOT/activemq-rar-5.15.14-SNAPSHOT.pom
[JENKINS] Archiving <https://builds.apache.org/job/ActiveMQ-Java8-5.15.x/ws/activemq-http/pom.xml> to org.apache.activemq/activemq-http/5.15.14-SNAPSHOT/activemq-http-5.15.14-SNAPSHOT.pom
[JENKINS] Archiving <https://builds.apache.org/job/ActiveMQ-Java8-5.15.x/ws/activemq-amqp/pom.xml> to org.apache.activemq/activemq-amqp/5.15.14-SNAPSHOT/activemq-amqp-5.15.14-SNAPSHOT.pom
[JENKINS] Archiving <https://builds.apache.org/job/ActiveMQ-Java8-5.15.x/ws/activemq-client/pom.xml> to org.apache.activemq/activemq-client/5.15.14-SNAPSHOT/activemq-client-5.15.14-SNAPSHOT.pom
[JENKINS] Archiving <https://builds.apache.org/job/ActiveMQ-Java8-5.15.x/ws/activemq-client/target/activemq-client-5.15.14-SNAPSHOT.jar> to org.apache.activemq/activemq-client/5.15.14-20200712.005442-52/activemq-client-5.15.14-20200712.005442-52.jar
[JENKINS] Archiving <https://builds.apache.org/job/ActiveMQ-Java8-5.15.x/ws/activemq-client/target/activemq-client-5.15.14-SNAPSHOT-sources.jar> to org.apache.activemq/activemq-client/5.15.14-20200712.005442-52/activemq-client-5.15.14-20200712.005442-52-sources.jar
[JENKINS] Archiving <https://builds.apache.org/job/ActiveMQ-Java8-5.15.x/ws/activemq-blueprint/pom.xml> to org.apache.activemq/activemq-blueprint/5.15.14-SNAPSHOT/activemq-blueprint-5.15.14-SNAPSHOT.pom
[JENKINS] Archiving <https://builds.apache.org/job/ActiveMQ-Java8-5.15.x/ws/activemq-blueprint/target/activemq-blueprint-5.15.14-SNAPSHOT.jar> to org.apache.activemq/activemq-blueprint/5.15.14-20200712.021412-49/activemq-blueprint-5.15.14-20200712.021412-49.jar
[JENKINS] Archiving <https://builds.apache.org/job/ActiveMQ-Java8-5.15.x/ws/activemq-blueprint/target/activemq-blueprint-5.15.14-SNAPSHOT-sources.jar> to org.apache.activemq/activemq-blueprint/5.15.14-20200712.021412-49/activemq-blueprint-5.15.14-20200712.021412-49-sources.jar
[JENKINS] Archiving <https://builds.apache.org/job/ActiveMQ-Java8-5.15.x/ws/activemq-tooling/activemq-junit/pom.xml> to org.apache.activemq.tooling/activemq-junit/5.15.14-SNAPSHOT/activemq-junit-5.15.14-SNAPSHOT.pom
[JENKINS] Archiving <https://builds.apache.org/job/ActiveMQ-Java8-5.15.x/ws/activemq-tooling/pom.xml> to org.apache.activemq.tooling/activemq-tooling/5.15.14-SNAPSHOT/activemq-tooling-5.15.14-SNAPSHOT.pom
[JENKINS] Archiving <https://builds.apache.org/job/ActiveMQ-Java8-5.15.x/ws/activemq-jms-pool/pom.xml> to org.apache.activemq/activemq-jms-pool/5.15.14-SNAPSHOT/activemq-jms-pool-5.15.14-SNAPSHOT.pom
[JENKINS] Archiving <https://builds.apache.org/job/ActiveMQ-Java8-5.15.x/ws/activemq-jms-pool/target/activemq-jms-pool-5.15.14-SNAPSHOT.jar> to org.apache.activemq/activemq-jms-pool/5.15.14-20200712.020215-51/activemq-jms-pool-5.15.14-20200712.020215-51.jar
[JENKINS] Archiving <https://builds.apache.org/job/ActiveMQ-Java8-5.15.x/ws/activemq-jms-pool/target/activemq-jms-pool-5.15.14-SNAPSHOT-sources.jar> to org.apache.activemq/activemq-jms-pool/5.15.14-20200712.020215-51/activemq-jms-pool-5.15.14-20200712.020215-51-sources.jar
[JENKINS] Archiving <https://builds.apache.org/job/ActiveMQ-Java8-5.15.x/ws/activemq-pool/pom.xml> to org.apache.activemq/activemq-pool/5.15.14-SNAPSHOT/activemq-pool-5.15.14-SNAPSHOT.pom
[JENKINS] Archiving <https://builds.apache.org/job/ActiveMQ-Java8-5.15.x/ws/activemq-pool/target/activemq-pool-5.15.14-SNAPSHOT.jar> to org.apache.activemq/activemq-pool/5.15.14-20200712.020233-51/activemq-pool-5.15.14-20200712.020233-51.jar
[JENKINS] Archiving <https://builds.apache.org/job/ActiveMQ-Java8-5.15.x/ws/activemq-pool/target/activemq-pool-5.15.14-SNAPSHOT-sources.jar> to org.apache.activemq/activemq-pool/5.15.14-20200712.020233-51/activemq-pool-5.15.14-20200712.020233-51-sources.jar
[JENKINS] Archiving <https://builds.apache.org/job/ActiveMQ-Java8-5.15.x/ws/activemq-jdbc-store/pom.xml> to org.apache.activemq/activemq-jdbc-store/5.15.14-SNAPSHOT/activemq-jdbc-store-5.15.14-SNAPSHOT.pom
[JENKINS] Archiving <https://builds.apache.org/job/ActiveMQ-Java8-5.15.x/ws/activemq-jdbc-store/target/activemq-jdbc-store-5.15.14-SNAPSHOT.jar> to org.apache.activemq/activemq-jdbc-store/5.15.14-20200712.015147-51/activemq-jdbc-store-5.15.14-20200712.015147-51.jar
[JENKINS] Archiving <https://builds.apache.org/job/ActiveMQ-Java8-5.15.x/ws/activemq-jdbc-store/target/activemq-jdbc-store-5.15.14-SNAPSHOT-sources.jar> to org.apache.activemq/activemq-jdbc-store/5.15.14-20200712.015147-51/activemq-jdbc-store-5.15.14-20200712.015147-51-sources.jar
[JENKINS] Archiving <https://builds.apache.org/job/ActiveMQ-Java8-5.15.x/ws/activemq-camel/pom.xml> to org.apache.activemq/activemq-camel/5.15.14-SNAPSHOT/activemq-camel-5.15.14-SNAPSHOT.pom
[JENKINS] Archiving <https://builds.apache.org/job/ActiveMQ-Java8-5.15.x/ws/activemq-runtime-config/pom.xml> to org.apache.activemq/activemq-runtime-config/5.15.14-SNAPSHOT/activemq-runtime-config-5.15.14-SNAPSHOT.pom
[JENKINS] Archiving <https://builds.apache.org/job/ActiveMQ-Java8-5.15.x/ws/pom.xml> to org.apache.activemq/activemq-parent/5.15.14-SNAPSHOT/activemq-parent-5.15.14-SNAPSHOT.pom
[Fast Archiver] Compressed 61.84 KB of artifacts by 51.7% relative to #557
[JENKINS] Archiving <https://builds.apache.org/job/ActiveMQ-Java8-5.15.x/ws/activemq-stomp/pom.xml> to org.apache.activemq/activemq-stomp/5.15.14-SNAPSHOT/activemq-stomp-5.15.14-SNAPSHOT.pom
[JENKINS] Archiving <https://builds.apache.org/job/ActiveMQ-Java8-5.15.x/ws/activemq-stomp/target/activemq-stomp-5.15.14-SNAPSHOT.jar> to org.apache.activemq/activemq-stomp/5.15.14-20200712.013111-51/activemq-stomp-5.15.14-20200712.013111-51.jar
[JENKINS] Archiving <https://builds.apache.org/job/ActiveMQ-Java8-5.15.x/ws/activemq-stomp/target/activemq-stomp-5.15.14-SNAPSHOT-sources.jar> to org.apache.activemq/activemq-stomp/5.15.14-20200712.013111-51/activemq-stomp-5.15.14-20200712.013111-51-sources.jar
[JENKINS] Archiving <https://builds.apache.org/job/ActiveMQ-Java8-5.15.x/ws/activemq-openwire-generator/pom.xml> to org.apache.activemq/activemq-openwire-generator/5.15.14-SNAPSHOT/activemq-openwire-generator-5.15.14-SNAPSHOT.pom
[JENKINS] Archiving <https://builds.apache.org/job/ActiveMQ-Java8-5.15.x/ws/activemq-openwire-generator/target/activemq-openwire-generator-5.15.14-SNAPSHOT.jar> to org.apache.activemq/activemq-openwire-generator/5.15.14-20200712.005156-52/activemq-openwire-generator-5.15.14-20200712.005156-52.jar
[JENKINS] Archiving <https://builds.apache.org/job/ActiveMQ-Java8-5.15.x/ws/activemq-openwire-generator/target/activemq-openwire-generator-5.15.14-SNAPSHOT-sources.jar> to org.apache.activemq/activemq-openwire-generator/5.15.14-20200712.005156-52/activemq-openwire-generator-5.15.14-20200712.005156-52-sources.jar
[JENKINS] Archiving <https://builds.apache.org/job/ActiveMQ-Java8-5.15.x/ws/activemq-broker/pom.xml> to org.apache.activemq/activemq-broker/5.15.14-SNAPSHOT/activemq-broker-5.15.14-SNAPSHOT.pom
[JENKINS] Archiving <https://builds.apache.org/job/ActiveMQ-Java8-5.15.x/ws/activemq-broker/target/activemq-broker-5.15.14-SNAPSHOT.jar> to org.apache.activemq/activemq-broker/5.15.14-20200712.005745-52/activemq-broker-5.15.14-20200712.005745-52.jar
[JENKINS] Archiving <https://builds.apache.org/job/ActiveMQ-Java8-5.15.x/ws/activemq-broker/target/activemq-broker-5.15.14-SNAPSHOT-tests.jar> to org.apache.activemq/activemq-broker/5.15.14-20200712.005745-52/activemq-broker-5.15.14-20200712.005745-52-tests.jar
[JENKINS] Archiving <https://builds.apache.org/job/ActiveMQ-Java8-5.15.x/ws/activemq-broker/target/activemq-broker-5.15.14-SNAPSHOT-sources.jar> to org.apache.activemq/activemq-broker/5.15.14-20200712.005745-52/activemq-broker-5.15.14-20200712.005745-52-sources.jar
[JENKINS] Archiving <https://builds.apache.org/job/ActiveMQ-Java8-5.15.x/ws/activemq-web-demo/pom.xml> to org.apache.activemq/activemq-web-demo/5.15.14-SNAPSHOT/activemq-web-demo-5.15.14-SNAPSHOT.pom
[JENKINS] Archiving <https://builds.apache.org/job/ActiveMQ-Java8-5.15.x/ws/activemq-mqtt/pom.xml> to org.apache.activemq/activemq-mqtt/5.15.14-SNAPSHOT/activemq-mqtt-5.15.14-SNAPSHOT.pom
[JENKINS] Archiving <https://builds.apache.org/job/ActiveMQ-Java8-5.15.x/ws/activemq-mqtt/target/activemq-mqtt-5.15.14-SNAPSHOT.jar> to org.apache.activemq/activemq-mqtt/5.15.14-20200712.015131-51/activemq-mqtt-5.15.14-20200712.015131-51.jar
[JENKINS] Archiving <https://builds.apache.org/job/ActiveMQ-Java8-5.15.x/ws/activemq-mqtt/target/activemq-mqtt-5.15.14-SNAPSHOT-sources.jar> to org.apache.activemq/activemq-mqtt/5.15.14-20200712.015131-51/activemq-mqtt-5.15.14-20200712.015131-51-sources.jar
[JENKINS] Archiving <https://builds.apache.org/job/ActiveMQ-Java8-5.15.x/ws/activemq-shiro/pom.xml> to org.apache.activemq/activemq-shiro/5.15.14-SNAPSHOT/activemq-shiro-5.15.14-SNAPSHOT.pom
[JENKINS] Archiving <https://builds.apache.org/job/ActiveMQ-Java8-5.15.x/ws/activemq-tooling/activemq-perf-maven-plugin/pom.xml> to org.apache.activemq.tooling/activemq-perf-maven-plugin/5.15.14-SNAPSHOT/activemq-perf-maven-plugin-5.15.14-SNAPSHOT.pom
[JENKINS] Archiving <https://builds.apache.org/job/ActiveMQ-Java8-5.15.x/ws/activemq-run/pom.xml> to org.apache.activemq/activemq-run/5.15.14-SNAPSHOT/activemq-run-5.15.14-SNAPSHOT.pom
[JENKINS] Archiving <https://builds.apache.org/job/ActiveMQ-Java8-5.15.x/ws/activemq-tooling/activemq-maven-plugin/pom.xml> to org.apache.activemq.tooling/activemq-maven-plugin/5.15.14-SNAPSHOT/activemq-maven-plugin-5.15.14-SNAPSHOT.pom
[JENKINS] Archiving <https://builds.apache.org/job/ActiveMQ-Java8-5.15.x/ws/activemq-karaf/pom.xml> to org.apache.activemq/activemq-karaf/5.15.14-SNAPSHOT/activemq-karaf-5.15.14-SNAPSHOT.pom
[JENKINS] Archiving <https://builds.apache.org/job/ActiveMQ-Java8-5.15.x/ws/activemq-web-console/pom.xml> to org.apache.activemq/activemq-web-console/5.15.14-SNAPSHOT/activemq-web-console-5.15.14-SNAPSHOT.pom
[JENKINS] Archiving <https://builds.apache.org/job/ActiveMQ-Java8-5.15.x/ws/activemq-jaas/pom.xml> to org.apache.activemq/activemq-jaas/5.15.14-SNAPSHOT/activemq-jaas-5.15.14-SNAPSHOT.pom
[JENKINS] Archiving <https://builds.apache.org/job/ActiveMQ-Java8-5.15.x/ws/activemq-jaas/target/activemq-jaas-5.15.14-SNAPSHOT.jar> to org.apache.activemq/activemq-jaas/5.15.14-20200712.005636-52/activemq-jaas-5.15.14-20200712.005636-52.jar
[JENKINS] Archiving <https://builds.apache.org/job/ActiveMQ-Java8-5.15.x/ws/activemq-jaas/target/activemq-jaas-5.15.14-SNAPSHOT-sources.jar> to org.apache.activemq/activemq-jaas/5.15.14-20200712.005636-52/activemq-jaas-5.15.14-20200712.005636-52-sources.jar
[JENKINS] Archiving <https://builds.apache.org/job/ActiveMQ-Java8-5.15.x/ws/activemq-itests-spring31/pom.xml> to org.apache.activemq/activemq-itests-spring31/5.15.14-SNAPSHOT/activemq-itests-spring31-5.15.14-SNAPSHOT.pom
[JENKINS] Archiving <https://builds.apache.org/job/ActiveMQ-Java8-5.15.x/ws/activemq-tooling/activemq-memtest-maven-plugin/pom.xml> to org.apache.activemq.tooling/activemq-memtest-maven-plugin/5.15.14-SNAPSHOT/activemq-memtest-maven-plugin-5.15.14-SNAPSHOT.pom
[JENKINS] Archiving <https://builds.apache.org/job/ActiveMQ-Java8-5.15.x/ws/activemq-ra/pom.xml> to org.apache.activemq/activemq-ra/5.15.14-SNAPSHOT/activemq-ra-5.15.14-SNAPSHOT.pom
[JENKINS] Archiving <https://builds.apache.org/job/ActiveMQ-Java8-5.15.x/ws/activemq-ra/target/activemq-ra-5.15.14-SNAPSHOT.jar> to org.apache.activemq/activemq-ra/5.15.14-20200712.020426-51/activemq-ra-5.15.14-20200712.020426-51.jar
[JENKINS] Archiving <https://builds.apache.org/job/ActiveMQ-Java8-5.15.x/ws/activemq-ra/target/xbean/activemq-ra.xsd> to org.apache.activemq/activemq-ra/5.15.14-20200712.020426-51/activemq-ra-5.15.14-20200712.020426-51.xsd
[JENKINS] Archiving <https://builds.apache.org/job/ActiveMQ-Java8-5.15.x/ws/activemq-ra/target/xbean/activemq-ra.xsd.html> to org.apache.activemq/activemq-ra/5.15.14-20200712.020426-51/activemq-ra-5.15.14-20200712.020426-51-schema.html
[JENKINS] Archiving <https://builds.apache.org/job/ActiveMQ-Java8-5.15.x/ws/activemq-ra/target/xbean/activemq-ra.xsd.html> to org.apache.activemq/activemq-ra/5.15.14-20200712.020426-51/activemq-ra-5.15.14-20200712.020426-51.xsd.html
[JENKINS] Archiving <https://builds.apache.org/job/ActiveMQ-Java8-5.15.x/ws/activemq-ra/target/activemq-ra-5.15.14-SNAPSHOT-sources.jar> to org.apache.activemq/activemq-ra/5.15.14-20200712.020426-51/activemq-ra-5.15.14-20200712.020426-51-sources.jar
[JENKINS] Archiving <https://builds.apache.org/job/ActiveMQ-Java8-5.15.x/ws/activemq-partition/pom.xml> to org.apache.activemq/activemq-partition/5.15.14-SNAPSHOT/activemq-partition-5.15.14-SNAPSHOT.pom
[JENKINS] Archiving <https://builds.apache.org/job/ActiveMQ-Java8-5.15.x/ws/activemq-partition/target/activemq-partition-5.15.14-SNAPSHOT.jar> to org.apache.activemq/activemq-partition/5.15.14-20200712.021312-49/activemq-partition-5.15.14-20200712.021312-49.jar
[JENKINS] Archiving <https://builds.apache.org/job/ActiveMQ-Java8-5.15.x/ws/activemq-partition/target/activemq-partition-5.15.14-SNAPSHOT-sources.jar> to org.apache.activemq/activemq-partition/5.15.14-20200712.021312-49/activemq-partition-5.15.14-20200712.021312-49-sources.jar
[JENKINS] Archiving <https://builds.apache.org/job/ActiveMQ-Java8-5.15.x/ws/activemq-all/pom.xml> to org.apache.activemq/activemq-all/5.15.14-SNAPSHOT/activemq-all-5.15.14-SNAPSHOT.pom
[JENKINS] Archiving <https://builds.apache.org/job/ActiveMQ-Java8-5.15.x/ws/assembly/pom.xml> to org.apache.activemq/apache-activemq/5.15.14-SNAPSHOT/apache-activemq-5.15.14-SNAPSHOT.pom
[JENKINS] Archiving <https://builds.apache.org/job/ActiveMQ-Java8-5.15.x/ws/activemq-console/pom.xml> to org.apache.activemq/activemq-console/5.15.14-SNAPSHOT/activemq-console-5.15.14-SNAPSHOT.pom
[JENKINS] Archiving <https://builds.apache.org/job/ActiveMQ-Java8-5.15.x/ws/activemq-console/target/activemq-console-5.15.14-SNAPSHOT.jar> to org.apache.activemq/activemq-console/5.15.14-SNAPSHOT/activemq-console-5.15.14-SNAPSHOT.jar
[JENKINS] Archiving <https://builds.apache.org/job/ActiveMQ-Java8-5.15.x/ws/activemq-spring/pom.xml> to org.apache.activemq/activemq-spring/5.15.14-SNAPSHOT/activemq-spring-5.15.14-SNAPSHOT.pom
[JENKINS] Archiving <https://builds.apache.org/job/ActiveMQ-Java8-5.15.x/ws/activemq-spring/target/activemq-spring-5.15.14-SNAPSHOT.jar> to org.apache.activemq/activemq-spring/5.15.14-SNAPSHOT/activemq-spring-5.15.14-SNAPSHOT.jar
[JENKINS] Archiving <https://builds.apache.org/job/ActiveMQ-Java8-5.15.x/ws/activemq-spring/target/classes/activemq.xsd> to org.apache.activemq/activemq-spring/5.15.14-SNAPSHOT/activemq-spring-5.15.14-SNAPSHOT.xsd
[JENKINS] Archiving <https://builds.apache.org/job/ActiveMQ-Java8-5.15.x/ws/activemq-spring/target/classes/activemq.xsd.html> to org.apache.activemq/activemq-spring/5.15.14-SNAPSHOT/activemq-spring-5.15.14-SNAPSHOT-schema.html
[Fast Archiver] Compressed 905.86 KB of artifacts by 77.7% relative to #557
[JENKINS] Archiving <https://builds.apache.org/job/ActiveMQ-Java8-5.15.x/ws/activemq-cf/pom.xml> to org.apache.activemq/activemq-cf/5.15.14-SNAPSHOT/activemq-cf-5.15.14-SNAPSHOT.pom
[JENKINS] Archiving <https://builds.apache.org/job/ActiveMQ-Java8-5.15.x/ws/activemq-cf/target/activemq-cf-5.15.14-SNAPSHOT.jar> to org.apache.activemq/activemq-cf/5.15.14-20200712.021358-49/activemq-cf-5.15.14-20200712.021358-49.jar
[JENKINS] Archiving <https://builds.apache.org/job/ActiveMQ-Java8-5.15.x/ws/activemq-cf/target/activemq-cf-5.15.14-SNAPSHOT-sources.jar> to org.apache.activemq/activemq-cf/5.15.14-20200712.021358-49/activemq-cf-5.15.14-20200712.021358-49-sources.jar
[JENKINS] Archiving <https://builds.apache.org/job/ActiveMQ-Java8-5.15.x/ws/activemq-leveldb-store/pom.xml> to org.apache.activemq/activemq-leveldb-store/5.15.14-SNAPSHOT/activemq-leveldb-store-5.15.14-SNAPSHOT.pom
[JENKINS] Archiving <https://builds.apache.org/job/ActiveMQ-Java8-5.15.x/ws/activemq-leveldb-store/target/activemq-leveldb-store-5.15.14-SNAPSHOT.jar> to org.apache.activemq/activemq-leveldb-store/5.15.14-20200712.020120-51/activemq-leveldb-store-5.15.14-20200712.020120-51.jar
[JENKINS] Archiving <https://builds.apache.org/job/ActiveMQ-Java8-5.15.x/ws/activemq-leveldb-store/target/activemq-leveldb-store-5.15.14-SNAPSHOT-sources.jar> to org.apache.activemq/activemq-leveldb-store/5.15.14-20200712.020120-51/activemq-leveldb-store-5.15.14-20200712.020120-51-sources.jar
[JENKINS] Archiving <https://builds.apache.org/job/ActiveMQ-Java8-5.15.x/ws/activemq-web/pom.xml> to org.apache.activemq/activemq-web/5.15.14-SNAPSHOT/activemq-web-5.15.14-SNAPSHOT.pom
[JENKINS] Archiving <https://builds.apache.org/job/ActiveMQ-Java8-5.15.x/ws/activemq-log4j-appender/pom.xml> to org.apache.activemq/activemq-log4j-appender/5.15.14-SNAPSHOT/activemq-log4j-appender-5.15.14-SNAPSHOT.pom
[JENKINS] Archiving <https://builds.apache.org/job/ActiveMQ-Java8-5.15.x/ws/activemq-log4j-appender/target/activemq-log4j-appender-5.15.14-SNAPSHOT.jar> to org.apache.activemq/activemq-log4j-appender/5.15.14-20200712.021343-49/activemq-log4j-appender-5.15.14-20200712.021343-49.jar
[JENKINS] Archiving <https://builds.apache.org/job/ActiveMQ-Java8-5.15.x/ws/activemq-log4j-appender/target/activemq-log4j-appender-5.15.14-SNAPSHOT-sources.jar> to org.apache.activemq/activemq-log4j-appender/5.15.14-20200712.021343-49/activemq-log4j-appender-5.15.14-20200712.021343-49-sources.jar
No mail will be sent out, as 'ActiveMQ-Java8-5.15.x » ActiveMQ :: KahaDB Store #558' does not have a result yet. Please make sure you set a proper result in case of pipeline/build scripts.
No mail will be sent out, as 'ActiveMQ-Java8-5.15.x » ActiveMQ :: OSGi bundle #558' does not have a result yet. Please make sure you set a proper result in case of pipeline/build scripts.
No mail will be sent out, as 'ActiveMQ-Java8-5.15.x » ActiveMQ :: Unit Tests #558' does not have a result yet. Please make sure you set a proper result in case of pipeline/build scripts.
No mail will be sent out, as 'ActiveMQ-Java8-5.15.x » ActiveMQ :: Openwire Legacy Support #558' does not have a result yet. Please make sure you set a proper result in case of pipeline/build scripts.
No mail will be sent out, as 'ActiveMQ-Java8-5.15.x » ActiveMQ :: Karaf Integration Tests #558' does not have a result yet. Please make sure you set a proper result in case of pipeline/build scripts.
No mail will be sent out, as 'ActiveMQ-Java8-5.15.x » ActiveMQ :: RAR #558' does not have a result yet. Please make sure you set a proper result in case of pipeline/build scripts.
No mail will be sent out, as 'ActiveMQ-Java8-5.15.x » ActiveMQ :: HTTP Protocol Support #558' does not have a result yet. Please make sure you set a proper result in case of pipeline/build scripts.
No mail will be sent out, as 'ActiveMQ-Java8-5.15.x » ActiveMQ :: AMQP #558' does not have a result yet. Please make sure you set a proper result in case of pipeline/build scripts.
No mail will be sent out, as 'ActiveMQ-Java8-5.15.x » ActiveMQ :: Client #558' does not have a result yet. Please make sure you set a proper result in case of pipeline/build scripts.
No mail will be sent out, as 'ActiveMQ-Java8-5.15.x » ActiveMQ :: Blueprint #558' does not have a result yet. Please make sure you set a proper result in case of pipeline/build scripts.
No mail will be sent out, as 'ActiveMQ-Java8-5.15.x » ActiveMQ :: JUnit Rule #558' does not have a result yet. Please make sure you set a proper result in case of pipeline/build scripts.
No mail will be sent out, as 'ActiveMQ-Java8-5.15.x » ActiveMQ :: Tooling #558' does not have a result yet. Please make sure you set a proper result in case of pipeline/build scripts.
No mail will be sent out, as 'ActiveMQ-Java8-5.15.x » ActiveMQ :: Generic JMS Pool #558' does not have a result yet. Please make sure you set a proper result in case of pipeline/build scripts.
No mail will be sent out, as 'ActiveMQ-Java8-5.15.x » ActiveMQ :: Pool #558' does not have a result yet. Please make sure you set a proper result in case of pipeline/build scripts.
No mail will be sent out, as 'ActiveMQ-Java8-5.15.x » ActiveMQ :: JDBC Store #558' does not have a result yet. Please make sure you set a proper result in case of pipeline/build scripts.
No mail will be sent out, as 'ActiveMQ-Java8-5.15.x » ActiveMQ :: Camel #558' does not have a result yet. Please make sure you set a proper result in case of pipeline/build scripts.
No mail will be sent out, as 'ActiveMQ-Java8-5.15.x » ActiveMQ :: Runtime Configuration #558' does not have a result yet. Please make sure you set a proper result in case of pipeline/build scripts.
No mail will be sent out, as 'ActiveMQ-Java8-5.15.x » ActiveMQ #558' does not have a result yet. Please make sure you set a proper result in case of pipeline/build scripts.
No mail will be sent out, as 'ActiveMQ-Java8-5.15.x » ActiveMQ :: STOMP Protocol #558' does not have a result yet. Please make sure you set a proper result in case of pipeline/build scripts.
No mail will be sent out, as 'ActiveMQ-Java8-5.15.x » ActiveMQ :: Openwire Generator #558' does not have a result yet. Please make sure you set a proper result in case of pipeline/build scripts.
No mail will be sent out, as 'ActiveMQ-Java8-5.15.x » ActiveMQ :: Broker #558' does not have a result yet. Please make sure you set a proper result in case of pipeline/build scripts.
No mail will be sent out, as 'ActiveMQ-Java8-5.15.x » ActiveMQ :: Web Demo #558' does not have a result yet. Please make sure you set a proper result in case of pipeline/build scripts.
No mail will be sent out, as 'ActiveMQ-Java8-5.15.x » ActiveMQ :: MQTT Protocol #558' does not have a result yet. Please make sure you set a proper result in case of pipeline/build scripts.
No mail will be sent out, as 'ActiveMQ-Java8-5.15.x » ActiveMQ :: Shiro #558' does not have a result yet. Please make sure you set a proper result in case of pipeline/build scripts.
No mail will be sent out, as 'ActiveMQ-Java8-5.15.x » ActiveMQ :: Performance Test Plugin #558' does not have a result yet. Please make sure you set a proper result in case of pipeline/build scripts.
No mail will be sent out, as 'ActiveMQ-Java8-5.15.x » ActiveMQ :: Run Jar #558' does not have a result yet. Please make sure you set a proper result in case of pipeline/build scripts.
No mail will be sent out, as 'ActiveMQ-Java8-5.15.x » ActiveMQ :: StartUp/Stop Plugin #558' does not have a result yet. Please make sure you set a proper result in case of pipeline/build scripts.
No mail will be sent out, as 'ActiveMQ-Java8-5.15.x » ActiveMQ :: Apache Karaf #558' does not have a result yet. Please make sure you set a proper result in case of pipeline/build scripts.
No mail will be sent out, as 'ActiveMQ-Java8-5.15.x » ActiveMQ :: Web Console #558' does not have a result yet. Please make sure you set a proper result in case of pipeline/build scripts.
No mail will be sent out, as 'ActiveMQ-Java8-5.15.x » ActiveMQ :: JAAS #558' does not have a result yet. Please make sure you set a proper result in case of pipeline/build scripts.
No mail will be sent out, as 'ActiveMQ-Java8-5.15.x » ActiveMQ :: Integration Test :: Spring 3.1 #558' does not have a result yet. Please make sure you set a proper result in case of pipeline/build scripts.
No mail will be sent out, as 'ActiveMQ-Java8-5.15.x » ActiveMQ :: Memory Usage Test Plugin #558' does not have a result yet. Please make sure you set a proper result in case of pipeline/build scripts.
No mail will be sent out, as 'ActiveMQ-Java8-5.15.x » ActiveMQ :: RA #558' does not have a result yet. Please make sure you set a proper result in case of pipeline/build scripts.
No mail will be sent out, as 'ActiveMQ-Java8-5.15.x » ActiveMQ :: Partition Management #558' does not have a result yet. Please make sure you set a proper result in case of pipeline/build scripts.
No mail will be sent out, as 'ActiveMQ-Java8-5.15.x » ActiveMQ :: All JAR bundle #558' does not have a result yet. Please make sure you set a proper result in case of pipeline/build scripts.
No mail will be sent out, as 'ActiveMQ-Java8-5.15.x » ActiveMQ :: Assembly #558' does not have a result yet. Please make sure you set a proper result in case of pipeline/build scripts.
Sending e-mails to: [hidden email]
Sending e-mails to: [hidden email]
No mail will be sent out, as 'ActiveMQ-Java8-5.15.x » ActiveMQ :: ConnectionFactory #558' does not have a result yet. Please make sure you set a proper result in case of pipeline/build scripts.
No mail will be sent out, as 'ActiveMQ-Java8-5.15.x » ActiveMQ :: LevelDB Store #558' does not have a result yet. Please make sure you set a proper result in case of pipeline/build scripts.
No mail will be sent out, as 'ActiveMQ-Java8-5.15.x » ActiveMQ :: Web #558' does not have a result yet. Please make sure you set a proper result in case of pipeline/build scripts.
No mail will be sent out, as 'ActiveMQ-Java8-5.15.x » ActiveMQ :: Log4j Appender #558' does not have a result yet. Please make sure you set a proper result in case of pipeline/build scripts.
[locks-and-latches] Releasing all the locks
[locks-and-latches] All the locks released
channel stopped
Reply | Threaded
Open this post in threaded view
|

Jenkins build is unstable: ActiveMQ-Java8-5.15.x #559

Apache Jenkins Server-2
Reply | Threaded
Open this post in threaded view
|

Jenkins build is still unstable: ActiveMQ-Java8-5.15.x #560

Apache Jenkins Server-2
Reply | Threaded
Open this post in threaded view
|

Jenkins build is still unstable: ActiveMQ-Java8-5.15.x #561

Apache Jenkins Server-2
Reply | Threaded
Open this post in threaded view
|

Jenkins build is still unstable: ActiveMQ-Java8-5.15.x #562

Apache Jenkins Server-2
Reply | Threaded
Open this post in threaded view
|

Jenkins build is still unstable: ActiveMQ-Java8-5.15.x #563

Apache Jenkins Server-2
Reply | Threaded
Open this post in threaded view
|

Jenkins build is still unstable: ActiveMQ-Java8-5.15.x #564

Apache Jenkins Server-2
Reply | Threaded
Open this post in threaded view
|

Jenkins build is still unstable: ActiveMQ-Java8-5.15.x #565

Apache Jenkins Server-2
Reply | Threaded
Open this post in threaded view
|

Jenkins build is still unstable: ActiveMQ-Java8-5.15.x #566

Apache Jenkins Server-2
123