Jenkins build is unstable: ActiveMQ-Java8-5.14.x #6

Previous Topic Next Topic
 
classic Classic list List threaded Threaded
77 messages Options
1234
Reply | Threaded
Open this post in threaded view
|

Jenkins build is still unstable: ActiveMQ-Java8-5.14.x #46

Apache Jenkins Server-2
Reply | Threaded
Open this post in threaded view
|

Build failed in Jenkins: ActiveMQ-Java8-5.14.x #47

Apache Jenkins Server-2
See <https://builds.apache.org/job/ActiveMQ-Java8-5.14.x/47/display/redirect?page=changes>

Changes:

[tabish121] https://issues.apache.org/jira/browse/AMQ-6638

------------------------------------------
[...truncated 852.88 KB...]
[INFO] Surefire report directory: <https://builds.apache.org/job/ActiveMQ-Java8-5.14.x/ws/activemq-itests-spring31/target/surefire-reports>

-------------------------------------------------------
 T E S T S
-------------------------------------------------------
Running org.apache.activemq.itest.spring31.ActiveMQSpringProfile31Test
Tests run: 1, Failures: 0, Errors: 0, Skipped: 1, Time elapsed: 0.016 sec - in org.apache.activemq.itest.spring31.ActiveMQSpringProfile31Test
Running org.apache.activemq.itest.spring31.ActiveMQSpring31Test
Tests run: 1, Failures: 0, Errors: 0, Skipped: 0, Time elapsed: 1.097 sec - in org.apache.activemq.itest.spring31.ActiveMQSpring31Test

Results :

Tests run: 2, Failures: 0, Errors: 0, Skipped: 1

[JENKINS] Recording test results
[INFO]
[INFO] --- maven-jar-plugin:2.4:jar (default-jar) @ activemq-itests-spring31 ---
[INFO] Building jar: <https://builds.apache.org/job/ActiveMQ-Java8-5.14.x/ws/activemq-itests-spring31/target/activemq-itests-spring31-5.14.5-SNAPSHOT.jar>
[INFO]
[INFO] --- maven-site-plugin:3.4:attach-descriptor (attach-descriptor) @ activemq-itests-spring31 ---
[INFO]
[INFO] --- ianal-maven-plugin:1.0-alpha-1:verify-legal-files (default) @ activemq-itests-spring31 ---
[INFO] Checking legal files in: activemq-itests-spring31-5.14.5-SNAPSHOT.jar
[INFO]
[INFO] --- maven-install-plugin:2.5.2:install (default-install) @ activemq-itests-spring31 ---
[INFO] Installing <https://builds.apache.org/job/ActiveMQ-Java8-5.14.x/ws/activemq-itests-spring31/target/activemq-itests-spring31-5.14.5-SNAPSHOT.jar> to /home/jenkins/jenkins-slave/maven-repositories/1/org/apache/activemq/activemq-itests-spring31/5.14.5-SNAPSHOT/activemq-itests-spring31-5.14.5-SNAPSHOT.jar
[INFO] Installing <https://builds.apache.org/job/ActiveMQ-Java8-5.14.x/ws/activemq-itests-spring31/pom.xml> to /home/jenkins/jenkins-slave/maven-repositories/1/org/apache/activemq/activemq-itests-spring31/5.14.5-SNAPSHOT/activemq-itests-spring31-5.14.5-SNAPSHOT.pom
[INFO]
[INFO] >>> maven-source-plugin:2.4:jar (default-cli) > generate-sources @ activemq-itests-spring31 >>>
[INFO]
[INFO] --- maven-enforcer-plugin:1.3.1:enforce (default) @ activemq-itests-spring31 ---
[INFO]
[INFO] --- maven-bundle-plugin:2.3.7:cleanVersions (cleanVersions) @ activemq-itests-spring31 ---
[WARNING] Failed to getClass for org.apache.maven.plugin.source.SourceJarMojo
[INFO]
[INFO] <<< maven-source-plugin:2.4:jar (default-cli) < generate-sources @ activemq-itests-spring31 <<<
[INFO]
[INFO] --- maven-source-plugin:2.4:jar (default-cli) @ activemq-itests-spring31 ---
[INFO] Building jar: <https://builds.apache.org/job/ActiveMQ-Java8-5.14.x/ws/activemq-itests-spring31/target/activemq-itests-spring31-5.14.5-SNAPSHOT-sources.jar>
[INFO]                                                                        
[INFO] ------------------------------------------------------------------------
[INFO] Building ActiveMQ :: Assembly 5.14.5-SNAPSHOT
[INFO] ------------------------------------------------------------------------
[INFO]
[INFO] --- maven-clean-plugin:2.5:clean (default-clean) @ apache-activemq ---
[INFO]
[INFO] --- maven-enforcer-plugin:1.3.1:enforce (default) @ apache-activemq ---
[INFO]
[INFO] --- maven-bundle-plugin:2.3.7:cleanVersions (cleanVersions) @ apache-activemq ---
[INFO]
[INFO] --- maven-remote-resources-plugin:1.5:process (default) @ apache-activemq ---
[INFO]
[INFO] --- maven-resources-plugin:2.7:copy-resources (copy-conf) @ apache-activemq ---
[INFO] Using 'UTF-8' encoding to copy filtered resources.
[INFO] Copying 18 resources
[INFO] Copying 20 resources
[INFO]
[INFO] --- maven-compiler-plugin:3.3:testCompile (validate-config) @ apache-activemq ---
[INFO] Changes detected - recompiling the module!
[INFO] Compiling 7 source files to <https://builds.apache.org/job/ActiveMQ-Java8-5.14.x/ws/assembly/target/test-classes>
[WARNING] bootstrap class path not set in conjunction with -source 1.7
[INFO]
[INFO] --- maven-surefire-plugin:2.16:test (validate-config) @ apache-activemq ---
[INFO] Surefire report directory: <https://builds.apache.org/job/ActiveMQ-Java8-5.14.x/ws/assembly/target/surefire-reports>

-------------------------------------------------------
 T E S T S
-------------------------------------------------------

-------------------------------------------------------
 T E S T S
-------------------------------------------------------
Running org.apache.activemq.config.ValidateXMLConfigTest
Tests run: 2, Failures: 0, Errors: 0, Skipped: 0, Time elapsed: 2.996 sec - in org.apache.activemq.config.ValidateXMLConfigTest
Running org.apache.activemq.config.BrokerXmlConfigStartTest
Tests run: 15, Failures: 0, Errors: 0, Skipped: 0, Time elapsed: 74.565 sec - in org.apache.activemq.config.BrokerXmlConfigStartTest

Results :

Tests run: 17, Failures: 0, Errors: 0, Skipped: 0

[JENKINS] Recording test results
[INFO]
[INFO] --- maven-site-plugin:3.4:attach-descriptor (attach-descriptor) @ apache-activemq ---
[INFO]
[INFO] --- maven-dependency-plugin:2.8:unpack-dependencies (unpack) @ apache-activemq ---
[INFO] Unpacking <https://builds.apache.org/job/ActiveMQ-Java8-5.14.x/ws/activemq-console/target/activemq-console-5.14.5-SNAPSHOT.jar> to <https://builds.apache.org/job/ActiveMQ-Java8-5.14.x/ws/assembly/target/classes> with includes "" and excludes ""
[INFO]
[INFO] --- maven-assembly-plugin:2.4:attached (unix-bin) @ apache-activemq ---
[INFO] Reading assembly descriptor: src/main/descriptors/unix-bin.xml
[WARNING] Cannot include project artifact: org.apache.activemq:apache-activemq:pom:5.14.5-SNAPSHOT; it doesn't have an associated file or directory.
[WARNING] Cannot include project artifact: org.apache.activemq:apache-activemq:pom:5.14.5-SNAPSHOT; it doesn't have an associated file or directory.
[WARNING] Cannot include project artifact: org.apache.activemq:apache-activemq:pom:5.14.5-SNAPSHOT; it doesn't have an associated file or directory.
[WARNING] Cannot include project artifact: org.apache.activemq:apache-activemq:pom:5.14.5-SNAPSHOT; it doesn't have an associated file or directory.
[WARNING] Cannot include project artifact: org.apache.activemq:apache-activemq:pom:5.14.5-SNAPSHOT; it doesn't have an associated file or directory.
[WARNING] The following patterns were never triggered in this artifact inclusion filter:
o  'org.apache.qpid:proton-jms'

[WARNING] Cannot include project artifact: org.apache.activemq:apache-activemq:pom:5.14.5-SNAPSHOT; it doesn't have an associated file or directory.
[WARNING] The following patterns were never triggered in this artifact inclusion filter:
o  'org.apache.activemq.tooling:activemq-junit'

[WARNING] Cannot include project artifact: org.apache.activemq:apache-activemq:pom:5.14.5-SNAPSHOT; it doesn't have an associated file or directory.
[INFO] Building tar: <https://builds.apache.org/job/ActiveMQ-Java8-5.14.x/ws/assembly/target/apache-activemq-5.14.5-SNAPSHOT-bin.tar.gz>
[INFO]
[INFO] --- maven-assembly-plugin:2.4:attached (windows-bin) @ apache-activemq ---
[INFO] Reading assembly descriptor: src/main/descriptors/windows-bin.xml
[WARNING] Cannot include project artifact: org.apache.activemq:apache-activemq:pom:5.14.5-SNAPSHOT; it doesn't have an associated file or directory.
[WARNING] Cannot include project artifact: org.apache.activemq:apache-activemq:pom:5.14.5-SNAPSHOT; it doesn't have an associated file or directory.
[WARNING] Cannot include project artifact: org.apache.activemq:apache-activemq:pom:5.14.5-SNAPSHOT; it doesn't have an associated file or directory.
[WARNING] Cannot include project artifact: org.apache.activemq:apache-activemq:pom:5.14.5-SNAPSHOT; it doesn't have an associated file or directory.
[WARNING] Cannot include project artifact: org.apache.activemq:apache-activemq:pom:5.14.5-SNAPSHOT; it doesn't have an associated file or directory.
[WARNING] The following patterns were never triggered in this artifact inclusion filter:
o  'org.apache.qpid:proton-jms'

[WARNING] Cannot include project artifact: org.apache.activemq:apache-activemq:pom:5.14.5-SNAPSHOT; it doesn't have an associated file or directory.
[WARNING] The following patterns were never triggered in this artifact inclusion filter:
o  'org.apache.activemq.tooling:activemq-junit'

[WARNING] Cannot include project artifact: org.apache.activemq:apache-activemq:pom:5.14.5-SNAPSHOT; it doesn't have an associated file or directory.
[INFO] Building zip: <https://builds.apache.org/job/ActiveMQ-Java8-5.14.x/ws/assembly/target/apache-activemq-5.14.5-SNAPSHOT-bin.zip>
[INFO]
[INFO] --- ianal-maven-plugin:1.0-alpha-1:verify-legal-files (default) @ apache-activemq ---
[INFO] Checking legal files in: apache-activemq-5.14.5-SNAPSHOT-bin.zip
[INFO]
[INFO] --- maven-install-plugin:2.5.2:install (default-install) @ apache-activemq ---
[INFO] Installing <https://builds.apache.org/job/ActiveMQ-Java8-5.14.x/ws/assembly/pom.xml> to /home/jenkins/jenkins-slave/maven-repositories/1/org/apache/activemq/apache-activemq/5.14.5-SNAPSHOT/apache-activemq-5.14.5-SNAPSHOT.pom
[INFO] Installing <https://builds.apache.org/job/ActiveMQ-Java8-5.14.x/ws/assembly/target/apache-activemq-5.14.5-SNAPSHOT-bin.tar.gz> to /home/jenkins/jenkins-slave/maven-repositories/1/org/apache/activemq/apache-activemq/5.14.5-SNAPSHOT/apache-activemq-5.14.5-SNAPSHOT-bin.tar.gz
[INFO] Installing <https://builds.apache.org/job/ActiveMQ-Java8-5.14.x/ws/assembly/target/apache-activemq-5.14.5-SNAPSHOT-bin.zip> to /home/jenkins/jenkins-slave/maven-repositories/1/org/apache/activemq/apache-activemq/5.14.5-SNAPSHOT/apache-activemq-5.14.5-SNAPSHOT-bin.zip
[INFO]
[INFO] >>> maven-source-plugin:2.4:jar (default-cli) > generate-sources @ apache-activemq >>>
[INFO]
[INFO] --- maven-enforcer-plugin:1.3.1:enforce (default) @ apache-activemq ---
[INFO]
[INFO] --- maven-bundle-plugin:2.3.7:cleanVersions (cleanVersions) @ apache-activemq ---
[WARNING] Failed to getClass for org.apache.maven.plugin.source.SourceJarMojo
[INFO]
[INFO] <<< maven-source-plugin:2.4:jar (default-cli) < generate-sources @ apache-activemq <<<
[INFO]
[INFO] --- maven-source-plugin:2.4:jar (default-cli) @ apache-activemq ---
[INFO] ------------------------------------------------------------------------
[INFO] Reactor Summary:
[INFO]
[INFO] ActiveMQ ........................................... SUCCESS [  2.856 s]
[INFO] ActiveMQ :: Openwire Generator ..................... SUCCESS [  4.095 s]
[INFO] ActiveMQ :: Client ................................. SUCCESS [01:39 min]
[INFO] ActiveMQ :: Openwire Legacy Support ................ SUCCESS [  3.241 s]
[INFO] ActiveMQ :: JAAS ................................... SUCCESS [ 31.302 s]
[INFO] ActiveMQ :: Broker ................................. SUCCESS [01:18 min]
[INFO] ActiveMQ :: KahaDB Store ........................... SUCCESS [02:09 min]
[INFO] ActiveMQ :: STOMP Protocol ......................... SUCCESS [11:40 min]
[INFO] ActiveMQ :: MQTT Protocol .......................... SUCCESS [21:03 min]
[INFO] ActiveMQ :: JDBC Store ............................. SUCCESS [  3.713 s]
[INFO] ActiveMQ :: LevelDB Store .......................... SUCCESS [04:56 min]
[INFO] ActiveMQ :: Generic JMS Pool ....................... SUCCESS [ 46.000 s]
[INFO] ActiveMQ :: Pool ................................... SUCCESS [  9.332 s]
[INFO] ActiveMQ :: RA ..................................... SUCCESS [02:28 min]
[INFO] ActiveMQ :: Spring ................................. SUCCESS [01:02 min]
[INFO] ActiveMQ :: Console ................................ SUCCESS [  5.166 s]
[INFO] ActiveMQ :: Partition Management ................... SUCCESS [ 18.282 s]
[INFO] ActiveMQ :: Runtime Configuration .................. SUCCESS [08:05 min]
[INFO] ActiveMQ :: Tooling ................................ SUCCESS [  0.921 s]
[INFO] ActiveMQ :: JUnit Rule ............................. SUCCESS [  4.933 s]
[INFO] ActiveMQ :: Unit Tests ............................. SUCCESS [  02:16 h]
[INFO] ActiveMQ :: HTTP Protocol Support .................. SUCCESS [09:38 min]
[INFO] ActiveMQ :: AMQP ................................... SUCCESS [09:45 min]
[INFO] ActiveMQ :: Camel .................................. SUCCESS [04:41 min]
[INFO] ActiveMQ :: All JAR bundle ......................... SUCCESS [  5.589 s]
[INFO] ActiveMQ :: Log4j Appender ......................... SUCCESS [  4.248 s]
[INFO] ActiveMQ :: Apache Karaf ........................... SUCCESS [  5.259 s]
[INFO] ActiveMQ :: ConnectionFactory ...................... SUCCESS [  6.137 s]
[INFO] ActiveMQ :: RAR .................................... SUCCESS [  4.783 s]
[INFO] ActiveMQ :: Run Jar ................................ SUCCESS [  1.422 s]
[INFO] ActiveMQ :: Shiro .................................. SUCCESS [  6.290 s]
[INFO] ActiveMQ :: Memory Usage Test Plugin ............... SUCCESS [  3.349 s]
[INFO] ActiveMQ :: Performance Test Plugin ................ SUCCESS [  7.599 s]
[INFO] ActiveMQ :: StartUp/Stop Plugin .................... SUCCESS [  5.742 s]
[INFO] ActiveMQ :: Web .................................... SUCCESS [ 15.278 s]
[INFO] ActiveMQ :: OSGi bundle ............................ SUCCESS [ 11.863 s]
[INFO] ActiveMQ :: Blueprint .............................. SUCCESS [  3.756 s]
[INFO] ActiveMQ :: Web Demo ............................... SUCCESS [ 26.725 s]
[INFO] ActiveMQ :: Web Console ............................ SUCCESS [  5.549 s]
[INFO] ActiveMQ :: Karaf Integration Tests ................ SUCCESS [06:03 min]
[INFO] ActiveMQ :: Integration Test :: Spring 3.1 ......... SUCCESS [  3.253 s]
[INFO] ActiveMQ :: Assembly ............................... SUCCESS [01:32 min]
[INFO] ------------------------------------------------------------------------
[INFO] BUILD SUCCESS
[INFO] ------------------------------------------------------------------------
[INFO] Total time: 03:47 h
[INFO] Finished at: 2017-04-06T17:00:39+00:00
[INFO] Final Memory: 193M/1844M
[INFO] ------------------------------------------------------------------------
Waiting for Jenkins to finish collecting data
[JENKINS] Archiving <https://builds.apache.org/job/ActiveMQ-Java8-5.14.x/ws/activemq-kahadb-store/pom.xml> to org.apache.activemq/activemq-kahadb-store/5.14.5-SNAPSHOT/activemq-kahadb-store-5.14.5-SNAPSHOT.pom
[JENKINS] Archiving <https://builds.apache.org/job/ActiveMQ-Java8-5.14.x/ws/activemq-kahadb-store/target/activemq-kahadb-store-5.14.5-SNAPSHOT.jar> to org.apache.activemq/activemq-kahadb-store/5.14.5-SNAPSHOT/activemq-kahadb-store-5.14.5-SNAPSHOT.jar
[JENKINS] Archiving <https://builds.apache.org/job/ActiveMQ-Java8-5.14.x/ws/activemq-kahadb-store/target/activemq-kahadb-store-5.14.5-SNAPSHOT-sources.jar> to org.apache.activemq/activemq-kahadb-store/5.14.5-SNAPSHOT/activemq-kahadb-store-5.14.5-SNAPSHOT-sources.jar
[JENKINS] Archiving <https://builds.apache.org/job/ActiveMQ-Java8-5.14.x/ws/activemq-osgi/pom.xml> to org.apache.activemq/activemq-osgi/5.14.5-SNAPSHOT/activemq-osgi-5.14.5-SNAPSHOT.pom
[JENKINS] Archiving <https://builds.apache.org/job/ActiveMQ-Java8-5.14.x/ws/activemq-osgi/target/activemq-osgi-5.14.5-SNAPSHOT.jar> to org.apache.activemq/activemq-osgi/5.14.5-SNAPSHOT/activemq-osgi-5.14.5-SNAPSHOT.jar
[JENKINS] Archiving <https://builds.apache.org/job/ActiveMQ-Java8-5.14.x/ws/activemq-osgi/target/activemq-osgi-5.14.5-SNAPSHOT-sources.jar> to org.apache.activemq/activemq-osgi/5.14.5-SNAPSHOT/activemq-osgi-5.14.5-SNAPSHOT-sources.jar
ERROR: Failed to archive {org.apache.activemq/activemq-osgi/5.14.5-SNAPSHOT/activemq-osgi-5.14.5-SNAPSHOT.pom=pom.xml, org.apache.activemq/activemq-osgi/5.14.5-SNAPSHOT/activemq-osgi-5.14.5-SNAPSHOT.jar=target/activemq-osgi-5.14.5-SNAPSHOT.jar, org.apache.activemq/activemq-osgi/5.14.5-SNAPSHOT/activemq-osgi-5.14.5-SNAPSHOT-sources.jar=target/activemq-osgi-5.14.5-SNAPSHOT-sources.jar} due to internal error; falling back to full archiving
java.lang.IllegalStateException: End of stream while reading number
        at jsync.protocol.BaseReader.readLong(BaseReader.java:40)
        at jsync.protocol.BaseReader.readInt(BaseReader.java:26)
        at jsync.protocol.ChangeStreamReader.next(ChangeStreamReader.java:54)
        at jsync.protocol.ChangeInputStream.next(ChangeInputStream.java:27)
        at jsync.protocol.ChangeInputStream.read(ChangeInputStream.java:71)
        at com.cloudbees.jenkins.plugins.jsync.archiver.MD5DigestingInputStream.read(MD5DigestingInputStream.java:39)
        at com.google.common.io.LimitInputStream.read(LimitInputStream.java:79)
        at java.io.FilterInputStream.read(FilterInputStream.java:107)
        at com.google.common.io.ByteStreams.copy(ByteStreams.java:193)
        at jsync.protocol.FileSequenceReader.read(FileSequenceReader.java:35)
        at com.cloudbees.jenkins.plugins.jsync.archiver.JSyncArtifactManager.remoteSync(JSyncArtifactManager.java:158)
        at com.cloudbees.jenkins.plugins.jsync.archiver.JSyncArtifactManager.archive(JSyncArtifactManager.java:76)
        at hudson.maven.MavenBuild$ProxyImpl.performArchiving(MavenBuild.java:486)
        at hudson.maven.MavenModuleSetBuild$MavenModuleSetBuildExecution.doRun(MavenModuleSetBuild.java:875)
        at hudson.model.AbstractBuild$AbstractBuildExecution.run(AbstractBuild.java:534)
        at hudson.model.Run.execute(Run.java:1728)
        at hudson.maven.MavenModuleSetBuild.run(MavenModuleSetBuild.java:544)
        at hudson.model.ResourceController.execute(ResourceController.java:98)
        at hudson.model.Executor.run(Executor.java:404)
Sending e-mails to: [hidden email]
Sending e-mails to: [hidden email]
Sending e-mails to: [hidden email]
[locks-and-latches] Releasing all the locks
[locks-and-latches] All the locks released
ERROR: Failed to parse POMs
java.io.IOException: Failed to extract <https://builds.apache.org/job/ActiveMQ-Java8-5.14.x/ws/activemq-osgi/transfer> of 3 files
        at hudson.FilePath.readFromTar(FilePath.java:2289)
        at hudson.FilePath.copyRecursiveTo(FilePath.java:2199)
        at jenkins.model.StandardArtifactManager.archive(StandardArtifactManager.java:61)
        at com.cloudbees.jenkins.plugins.jsync.archiver.JSyncArtifactManager.archive(JSyncArtifactManager.java:80)
        at hudson.maven.MavenBuild$ProxyImpl.performArchiving(MavenBuild.java:486)
        at hudson.maven.MavenModuleSetBuild$MavenModuleSetBuildExecution.doRun(MavenModuleSetBuild.java:875)
        at hudson.model.AbstractBuild$AbstractBuildExecution.run(AbstractBuild.java:534)
        at hudson.model.Run.execute(Run.java:1728)
        at hudson.maven.MavenModuleSetBuild.run(MavenModuleSetBuild.java:544)
        at hudson.model.ResourceController.execute(ResourceController.java:98)
        at hudson.model.Executor.run(Executor.java:404)
Caused by: java.io.EOFException: Unexpected end of ZLIB input stream
        at com.jcraft.jzlib.InflaterInputStream.fill(InflaterInputStream.java:186)
        at com.jcraft.jzlib.InflaterInputStream.read(InflaterInputStream.java:106)
        at org.apache.commons.compress.utils.IOUtils.readFully(IOUtils.java:160)
        at org.apache.commons.compress.utils.IOUtils.readFully(IOUtils.java:134)
        at org.apache.commons.compress.archivers.tar.TarArchiveInputStream.readRecord(TarArchiveInputStream.java:419)
        at org.apache.commons.compress.archivers.tar.TarArchiveInputStream.getRecord(TarArchiveInputStream.java:388)
        at org.apache.commons.compress.archivers.tar.TarArchiveInputStream.getNextTarEntry(TarArchiveInputStream.java:269)
        at hudson.FilePath.readFromTar(FilePath.java:2267)
        ... 10 more
channel stopped
Reply | Threaded
Open this post in threaded view
|

Jenkins build is unstable: ActiveMQ-Java8-5.14.x #48

Apache Jenkins Server-2
Reply | Threaded
Open this post in threaded view
|

Build failed in Jenkins: ActiveMQ-Java8-5.14.x #49

Apache Jenkins Server-2
See <https://builds.apache.org/job/ActiveMQ-Java8-5.14.x/49/display/redirect?page=changes>

Changes:

[tabish121] https://issues.apache.org/jira/browse/AMQ-6659

------------------------------------------
[...truncated 877.03 KB...]
[INFO] ActiveMQ :: Camel .................................. SUCCESS [06:25 min]
[INFO] ActiveMQ :: All JAR bundle ......................... SUCCESS [  9.290 s]
[INFO] ActiveMQ :: Log4j Appender ......................... SUCCESS [  8.392 s]
[INFO] ActiveMQ :: Apache Karaf ........................... SUCCESS [  7.517 s]
[INFO] ActiveMQ :: ConnectionFactory ...................... SUCCESS [  9.017 s]
[INFO] ActiveMQ :: RAR .................................... SUCCESS [ 10.988 s]
[INFO] ActiveMQ :: Run Jar ................................ SUCCESS [  4.603 s]
[INFO] ActiveMQ :: Shiro .................................. SUCCESS [ 13.482 s]
[INFO] ActiveMQ :: Memory Usage Test Plugin ............... SUCCESS [  9.056 s]
[INFO] ActiveMQ :: Performance Test Plugin ................ SUCCESS [ 13.889 s]
[INFO] ActiveMQ :: StartUp/Stop Plugin .................... SUCCESS [ 13.405 s]
[INFO] ActiveMQ :: Web .................................... SUCCESS [ 21.952 s]
[INFO] ActiveMQ :: OSGi bundle ............................ SUCCESS [ 20.583 s]
[INFO] ActiveMQ :: Blueprint .............................. SUCCESS [  4.607 s]
[INFO] ActiveMQ :: Web Demo ............................... SUCCESS [ 40.773 s]
[INFO] ActiveMQ :: Web Console ............................ SUCCESS [ 10.867 s]
[INFO] ActiveMQ :: Karaf Integration Tests ................ FAILURE [01:04 min]
[INFO] ActiveMQ :: Integration Test :: Spring 3.1 ......... SUCCESS [  8.166 s]
[INFO] ActiveMQ :: Assembly ............................... SUCCESS [02:02 min]
[INFO] ------------------------------------------------------------------------
[INFO] BUILD FAILURE
[INFO] ------------------------------------------------------------------------
[INFO] Total time: 04:39 h
[INFO] Finished at: 2017-04-22T06:13:28+00:00
[INFO] Final Memory: 188M/1951M
[INFO] ------------------------------------------------------------------------
Waiting for Jenkins to finish collecting data
[ERROR] Failed to execute goal on project activemq-karaf-itest: Could not resolve dependencies for project org.apache.activemq:activemq-karaf-itest:jar:5.14.6-SNAPSHOT: Could not transfer artifact org.apache.karaf.features:base:jar:4.0.3 from/to central (https://repo.maven.apache.org/maven2): Failed to transfer file: https://repo.maven.apache.org/maven2/org/apache/karaf/features/base/4.0.3/base-4.0.3.jar. Return code is: 503 , ReasonPhrase:first byte timeout. -> [Help 1]
org.apache.maven.lifecycle.LifecycleExecutionException: Failed to execute goal on project activemq-karaf-itest: Could not resolve dependencies for project org.apache.activemq:activemq-karaf-itest:jar:5.14.6-SNAPSHOT: Could not transfer artifact org.apache.karaf.features:base:jar:4.0.3 from/to central (https://repo.maven.apache.org/maven2): Failed to transfer file: https://repo.maven.apache.org/maven2/org/apache/karaf/features/base/4.0.3/base-4.0.3.jar. Return code is: 503 , ReasonPhrase:first byte timeout.
        at org.apache.maven.lifecycle.internal.LifecycleDependencyResolver.getDependencies(LifecycleDependencyResolver.java:221)
        at org.apache.maven.lifecycle.internal.LifecycleDependencyResolver.resolveProjectDependencies(LifecycleDependencyResolver.java:127)
        at org.apache.maven.lifecycle.internal.MojoExecutor.ensureDependenciesAreResolved(MojoExecutor.java:245)
        at org.apache.maven.lifecycle.internal.MojoExecutor.execute(MojoExecutor.java:199)
        at org.apache.maven.lifecycle.internal.MojoExecutor.execute(MojoExecutor.java:153)
        at org.apache.maven.lifecycle.internal.MojoExecutor.execute(MojoExecutor.java:145)
        at org.apache.maven.lifecycle.internal.LifecycleModuleBuilder.buildProject(LifecycleModuleBuilder.java:116)
        at org.apache.maven.lifecycle.internal.LifecycleModuleBuilder.buildProject(LifecycleModuleBuilder.java:80)
        at org.apache.maven.lifecycle.internal.builder.singlethreaded.SingleThreadedBuilder.build(SingleThreadedBuilder.java:51)
        at org.apache.maven.lifecycle.internal.LifecycleStarter.execute(LifecycleStarter.java:128)
        at org.apache.maven.DefaultMaven.doExecute(DefaultMaven.java:307)
        at org.apache.maven.DefaultMaven.doExecute(DefaultMaven.java:193)
        at org.apache.maven.DefaultMaven.execute(DefaultMaven.java:106)
        at org.jvnet.hudson.maven3.launcher.Maven33Launcher.main(Maven33Launcher.java:129)
        at sun.reflect.NativeMethodAccessorImpl.invoke0(Native Method)
        at sun.reflect.NativeMethodAccessorImpl.invoke(NativeMethodAccessorImpl.java:62)
        at sun.reflect.DelegatingMethodAccessorImpl.invoke(DelegatingMethodAccessorImpl.java:43)
        at java.lang.reflect.Method.invoke(Method.java:498)
        at org.codehaus.plexus.classworlds.launcher.Launcher.launchStandard(Launcher.java:330)
        at org.codehaus.plexus.classworlds.launcher.Launcher.launch(Launcher.java:238)
        at jenkins.maven3.agent.Maven33Main.launch(Maven33Main.java:176)
        at sun.reflect.NativeMethodAccessorImpl.invoke0(Native Method)
        at sun.reflect.NativeMethodAccessorImpl.invoke(NativeMethodAccessorImpl.java:62)
        at sun.reflect.DelegatingMethodAccessorImpl.invoke(DelegatingMethodAccessorImpl.java:43)
        at java.lang.reflect.Method.invoke(Method.java:498)
        at hudson.maven.Maven3Builder.call(Maven3Builder.java:139)
        at hudson.maven.Maven3Builder.call(Maven3Builder.java:70)
        at hudson.remoting.UserRequest.perform(UserRequest.java:153)
        at hudson.remoting.UserRequest.perform(UserRequest.java:50)
        at hudson.remoting.Request$2.run(Request.java:336)
        at hudson.remoting.InterceptingExecutorService$1.call(InterceptingExecutorService.java:68)
        at java.util.concurrent.FutureTask.run(FutureTask.java:266)
        at java.util.concurrent.ThreadPoolExecutor.runWorker(ThreadPoolExecutor.java:1142)
        at java.util.concurrent.ThreadPoolExecutor$Worker.run(ThreadPoolExecutor.java:617)
        at java.lang.Thread.run(Thread.java:745)
Caused by: org.apache.maven.project.DependencyResolutionException: Could not resolve dependencies for project org.apache.activemq:activemq-karaf-itest:jar:5.14.6-SNAPSHOT: Could not transfer artifact org.apache.karaf.features:base:jar:4.0.3 from/to central (https://repo.maven.apache.org/maven2): Failed to transfer file: https://repo.maven.apache.org/maven2/org/apache/karaf/features/base/4.0.3/base-4.0.3.jar. Return code is: 503 , ReasonPhrase:first byte timeout.
        at org.apache.maven.project.DefaultProjectDependenciesResolver.resolve(DefaultProjectDependenciesResolver.java:211)
        at org.apache.maven.lifecycle.internal.LifecycleDependencyResolver.getDependencies(LifecycleDependencyResolver.java:195)
        ... 34 more
Caused by: org.eclipse.aether.resolution.DependencyResolutionException: Could not transfer artifact org.apache.karaf.features:base:jar:4.0.3 from/to central (https://repo.maven.apache.org/maven2): Failed to transfer file: https://repo.maven.apache.org/maven2/org/apache/karaf/features/base/4.0.3/base-4.0.3.jar. Return code is: 503 , ReasonPhrase:first byte timeout.
        at org.eclipse.aether.internal.impl.DefaultRepositorySystem.resolveDependencies(DefaultRepositorySystem.java:384)
        at org.apache.maven.project.DefaultProjectDependenciesResolver.resolve(DefaultProjectDependenciesResolver.java:205)
        ... 35 more
Caused by: org.eclipse.aether.resolution.ArtifactResolutionException: Could not transfer artifact org.apache.karaf.features:base:jar:4.0.3 from/to central (https://repo.maven.apache.org/maven2): Failed to transfer file: https://repo.maven.apache.org/maven2/org/apache/karaf/features/base/4.0.3/base-4.0.3.jar. Return code is: 503 , ReasonPhrase:first byte timeout.
        at org.eclipse.aether.internal.impl.DefaultArtifactResolver.resolve(DefaultArtifactResolver.java:444)
        at org.eclipse.aether.internal.impl.DefaultArtifactResolver.resolveArtifacts(DefaultArtifactResolver.java:246)
        at org.eclipse.aether.internal.impl.DefaultRepositorySystem.resolveDependencies(DefaultRepositorySystem.java:367)
        ... 36 more
Caused by: org.eclipse.aether.transfer.ArtifactTransferException: Could not transfer artifact org.apache.karaf.features:base:jar:4.0.3 from/to central (https://repo.maven.apache.org/maven2): Failed to transfer file: https://repo.maven.apache.org/maven2/org/apache/karaf/features/base/4.0.3/base-4.0.3.jar. Return code is: 503 , ReasonPhrase:first byte timeout.
        at org.eclipse.aether.connector.basic.ArtifactTransportListener.transferFailed(ArtifactTransportListener.java:43)
        at org.eclipse.aether.connector.basic.BasicRepositoryConnector$TaskRunner.run(BasicRepositoryConnector.java:355)
        at org.eclipse.aether.util.concurrency.RunnableErrorForwarder$1.run(RunnableErrorForwarder.java:67)
        ... 3 more
Caused by: org.apache.maven.wagon.TransferFailedException: Failed to transfer file: https://repo.maven.apache.org/maven2/org/apache/karaf/features/base/4.0.3/base-4.0.3.jar. Return code is: 503 , ReasonPhrase:first byte timeout.
        at org.apache.maven.wagon.providers.http.AbstractHttpClientWagon.fillInputData(AbstractHttpClientWagon.java:1021)
        at org.apache.maven.wagon.providers.http.AbstractHttpClientWagon.fillInputData(AbstractHttpClientWagon.java:960)
        at org.apache.maven.wagon.StreamWagon.getInputStream(StreamWagon.java:116)
        at org.apache.maven.wagon.StreamWagon.getIfNewer(StreamWagon.java:88)
        at org.apache.maven.wagon.StreamWagon.get(StreamWagon.java:61)
        at org.eclipse.aether.transport.wagon.WagonTransporter$GetTaskRunner.run(WagonTransporter.java:560)
        at org.eclipse.aether.transport.wagon.WagonTransporter.execute(WagonTransporter.java:427)
        at org.eclipse.aether.transport.wagon.WagonTransporter.get(WagonTransporter.java:404)
        at org.eclipse.aether.connector.basic.BasicRepositoryConnector$GetTaskRunner.runTask(BasicRepositoryConnector.java:447)
        at org.eclipse.aether.connector.basic.BasicRepositoryConnector$TaskRunner.run(BasicRepositoryConnector.java:350)
        ... 4 more
[ERROR]
[ERROR] Re-run Maven using the -X switch to enable full debug logging.
[ERROR]
[ERROR] For more information about the errors and possible solutions, please read the following articles:
[ERROR] [Help 1] http://cwiki.apache.org/confluence/display/MAVEN/DependencyResolutionException
[ERROR]
[ERROR] After correcting the problems, you can resume the build with the command
[ERROR]   mvn <goals> -rf :activemq-karaf-itest
[JENKINS] Archiving <https://builds.apache.org/job/ActiveMQ-Java8-5.14.x/ws/activemq-kahadb-store/pom.xml> to org.apache.activemq/activemq-kahadb-store/5.14.6-SNAPSHOT/activemq-kahadb-store-5.14.6-SNAPSHOT.pom
[JENKINS] Archiving <https://builds.apache.org/job/ActiveMQ-Java8-5.14.x/ws/activemq-kahadb-store/target/activemq-kahadb-store-5.14.6-SNAPSHOT.jar> to org.apache.activemq/activemq-kahadb-store/5.14.6-SNAPSHOT/activemq-kahadb-store-5.14.6-SNAPSHOT.jar
[JENKINS] Archiving <https://builds.apache.org/job/ActiveMQ-Java8-5.14.x/ws/activemq-kahadb-store/target/activemq-kahadb-store-5.14.6-SNAPSHOT-sources.jar> to org.apache.activemq/activemq-kahadb-store/5.14.6-SNAPSHOT/activemq-kahadb-store-5.14.6-SNAPSHOT-sources.jar
[JENKINS] Archiving <https://builds.apache.org/job/ActiveMQ-Java8-5.14.x/ws/activemq-osgi/pom.xml> to org.apache.activemq/activemq-osgi/5.14.6-SNAPSHOT/activemq-osgi-5.14.6-SNAPSHOT.pom
[JENKINS] Archiving <https://builds.apache.org/job/ActiveMQ-Java8-5.14.x/ws/activemq-osgi/target/activemq-osgi-5.14.6-SNAPSHOT.jar> to org.apache.activemq/activemq-osgi/5.14.6-SNAPSHOT/activemq-osgi-5.14.6-SNAPSHOT.jar
[JENKINS] Archiving <https://builds.apache.org/job/ActiveMQ-Java8-5.14.x/ws/activemq-osgi/target/activemq-osgi-5.14.6-SNAPSHOT-sources.jar> to org.apache.activemq/activemq-osgi/5.14.6-SNAPSHOT/activemq-osgi-5.14.6-SNAPSHOT-sources.jar
Compressed 12.07 MB of artifacts by 16.6% relative to #48
[JENKINS] Archiving <https://builds.apache.org/job/ActiveMQ-Java8-5.14.x/ws/activemq-unit-tests/pom.xml> to org.apache.activemq/activemq-unit-tests/5.14.6-SNAPSHOT/activemq-unit-tests-5.14.6-SNAPSHOT.pom
[JENKINS] Archiving <https://builds.apache.org/job/ActiveMQ-Java8-5.14.x/ws/activemq-unit-tests/target/activemq-unit-tests-5.14.6-SNAPSHOT.jar> to org.apache.activemq/activemq-unit-tests/5.14.6-SNAPSHOT/activemq-unit-tests-5.14.6-SNAPSHOT.jar
[JENKINS] Archiving <https://builds.apache.org/job/ActiveMQ-Java8-5.14.x/ws/activemq-unit-tests/target/activemq-unit-tests-5.14.6-SNAPSHOT-tests.jar> to org.apache.activemq/activemq-unit-tests/5.14.6-SNAPSHOT/activemq-unit-tests-5.14.6-SNAPSHOT-tests.jar
[JENKINS] Archiving <https://builds.apache.org/job/ActiveMQ-Java8-5.14.x/ws/activemq-unit-tests/target/activemq-unit-tests-5.14.6-SNAPSHOT-sources.jar> to org.apache.activemq/activemq-unit-tests/5.14.6-SNAPSHOT/activemq-unit-tests-5.14.6-SNAPSHOT-sources.jar
[JENKINS] Archiving <https://builds.apache.org/job/ActiveMQ-Java8-5.14.x/ws/activemq-openwire-legacy/pom.xml> to org.apache.activemq/activemq-openwire-legacy/5.14.6-SNAPSHOT/activemq-openwire-legacy-5.14.6-SNAPSHOT.pom
[JENKINS] Archiving <https://builds.apache.org/job/ActiveMQ-Java8-5.14.x/ws/activemq-openwire-legacy/target/activemq-openwire-legacy-5.14.6-SNAPSHOT.jar> to org.apache.activemq/activemq-openwire-legacy/5.14.6-SNAPSHOT/activemq-openwire-legacy-5.14.6-SNAPSHOT.jar
[JENKINS] Archiving <https://builds.apache.org/job/ActiveMQ-Java8-5.14.x/ws/activemq-openwire-legacy/target/activemq-openwire-legacy-5.14.6-SNAPSHOT-sources.jar> to org.apache.activemq/activemq-openwire-legacy/5.14.6-SNAPSHOT/activemq-openwire-legacy-5.14.6-SNAPSHOT-sources.jar
[JENKINS] Archiving <https://builds.apache.org/job/ActiveMQ-Java8-5.14.x/ws/activemq-karaf-itest/pom.xml> to org.apache.activemq/activemq-karaf-itest/5.14.6-SNAPSHOT/activemq-karaf-itest-5.14.6-SNAPSHOT.pom
[JENKINS] Archiving <https://builds.apache.org/job/ActiveMQ-Java8-5.14.x/ws/activemq-rar/pom.xml> to org.apache.activemq/activemq-rar/5.14.6-SNAPSHOT/activemq-rar-5.14.6-SNAPSHOT.pom
[JENKINS] Archiving <https://builds.apache.org/job/ActiveMQ-Java8-5.14.x/ws/activemq-rar/target/activemq-rar-5.14.6-SNAPSHOT.rar> to org.apache.activemq/activemq-rar/5.14.6-SNAPSHOT/activemq-rar-5.14.6-SNAPSHOT.rar
[JENKINS] Archiving <https://builds.apache.org/job/ActiveMQ-Java8-5.14.x/ws/activemq-rar/target/activemq-rar-5.14.6-SNAPSHOT-sources.jar> to org.apache.activemq/activemq-rar/5.14.6-SNAPSHOT/activemq-rar-5.14.6-SNAPSHOT-sources.jar
Compressed 8.89 MB of artifacts by 49.6% relative to #48
[JENKINS] Archiving <https://builds.apache.org/job/ActiveMQ-Java8-5.14.x/ws/activemq-http/pom.xml> to org.apache.activemq/activemq-http/5.14.6-SNAPSHOT/activemq-http-5.14.6-SNAPSHOT.pom
[JENKINS] Archiving <https://builds.apache.org/job/ActiveMQ-Java8-5.14.x/ws/activemq-http/target/activemq-http-5.14.6-SNAPSHOT.jar> to org.apache.activemq/activemq-http/5.14.6-SNAPSHOT/activemq-http-5.14.6-SNAPSHOT.jar
[JENKINS] Archiving <https://builds.apache.org/job/ActiveMQ-Java8-5.14.x/ws/activemq-http/target/activemq-http-5.14.6-SNAPSHOT-sources.jar> to org.apache.activemq/activemq-http/5.14.6-SNAPSHOT/activemq-http-5.14.6-SNAPSHOT-sources.jar
[JENKINS] Archiving <https://builds.apache.org/job/ActiveMQ-Java8-5.14.x/ws/activemq-amqp/pom.xml> to org.apache.activemq/activemq-amqp/5.14.6-SNAPSHOT/activemq-amqp-5.14.6-SNAPSHOT.pom
[JENKINS] Archiving <https://builds.apache.org/job/ActiveMQ-Java8-5.14.x/ws/activemq-amqp/target/activemq-amqp-5.14.6-SNAPSHOT.jar> to org.apache.activemq/activemq-amqp/5.14.6-SNAPSHOT/activemq-amqp-5.14.6-SNAPSHOT.jar
[JENKINS] Archiving <https://builds.apache.org/job/ActiveMQ-Java8-5.14.x/ws/activemq-amqp/target/activemq-amqp-5.14.6-SNAPSHOT-sources.jar> to org.apache.activemq/activemq-amqp/5.14.6-SNAPSHOT/activemq-amqp-5.14.6-SNAPSHOT-sources.jar
[JENKINS] Archiving <https://builds.apache.org/job/ActiveMQ-Java8-5.14.x/ws/activemq-client/pom.xml> to org.apache.activemq/activemq-client/5.14.6-SNAPSHOT/activemq-client-5.14.6-SNAPSHOT.pom
[JENKINS] Archiving <https://builds.apache.org/job/ActiveMQ-Java8-5.14.x/ws/activemq-client/target/activemq-client-5.14.6-SNAPSHOT.jar> to org.apache.activemq/activemq-client/5.14.6-SNAPSHOT/activemq-client-5.14.6-SNAPSHOT.jar
[JENKINS] Archiving <https://builds.apache.org/job/ActiveMQ-Java8-5.14.x/ws/activemq-client/target/activemq-client-5.14.6-SNAPSHOT-sources.jar> to org.apache.activemq/activemq-client/5.14.6-SNAPSHOT/activemq-client-5.14.6-SNAPSHOT-sources.jar
[JENKINS] Archiving <https://builds.apache.org/job/ActiveMQ-Java8-5.14.x/ws/activemq-blueprint/pom.xml> to org.apache.activemq/activemq-blueprint/5.14.6-SNAPSHOT/activemq-blueprint-5.14.6-SNAPSHOT.pom
[JENKINS] Archiving <https://builds.apache.org/job/ActiveMQ-Java8-5.14.x/ws/activemq-blueprint/target/activemq-blueprint-5.14.6-SNAPSHOT.jar> to org.apache.activemq/activemq-blueprint/5.14.6-SNAPSHOT/activemq-blueprint-5.14.6-SNAPSHOT.jar
[JENKINS] Archiving <https://builds.apache.org/job/ActiveMQ-Java8-5.14.x/ws/activemq-blueprint/target/activemq-blueprint-5.14.6-SNAPSHOT-sources.jar> to org.apache.activemq/activemq-blueprint/5.14.6-SNAPSHOT/activemq-blueprint-5.14.6-SNAPSHOT-sources.jar
[JENKINS] Archiving <https://builds.apache.org/job/ActiveMQ-Java8-5.14.x/ws/activemq-tooling/activemq-junit/pom.xml> to org.apache.activemq.tooling/activemq-junit/5.14.6-SNAPSHOT/activemq-junit-5.14.6-SNAPSHOT.pom
[JENKINS] Archiving <https://builds.apache.org/job/ActiveMQ-Java8-5.14.x/ws/activemq-tooling/activemq-junit/target/activemq-junit-5.14.6-SNAPSHOT.jar> to org.apache.activemq.tooling/activemq-junit/5.14.6-SNAPSHOT/activemq-junit-5.14.6-SNAPSHOT.jar
[JENKINS] Archiving <https://builds.apache.org/job/ActiveMQ-Java8-5.14.x/ws/activemq-tooling/activemq-junit/target/activemq-junit-5.14.6-SNAPSHOT-sources.jar> to org.apache.activemq.tooling/activemq-junit/5.14.6-SNAPSHOT/activemq-junit-5.14.6-SNAPSHOT-sources.jar
[JENKINS] Archiving <https://builds.apache.org/job/ActiveMQ-Java8-5.14.x/ws/activemq-tooling/pom.xml> to org.apache.activemq.tooling/activemq-tooling/5.14.6-SNAPSHOT/activemq-tooling-5.14.6-SNAPSHOT.pom
[JENKINS] Archiving <https://builds.apache.org/job/ActiveMQ-Java8-5.14.x/ws/activemq-jms-pool/pom.xml> to org.apache.activemq/activemq-jms-pool/5.14.6-SNAPSHOT/activemq-jms-pool-5.14.6-SNAPSHOT.pom
[JENKINS] Archiving <https://builds.apache.org/job/ActiveMQ-Java8-5.14.x/ws/activemq-jms-pool/target/activemq-jms-pool-5.14.6-SNAPSHOT.jar> to org.apache.activemq/activemq-jms-pool/5.14.6-SNAPSHOT/activemq-jms-pool-5.14.6-SNAPSHOT.jar
[JENKINS] Archiving <https://builds.apache.org/job/ActiveMQ-Java8-5.14.x/ws/activemq-jms-pool/target/activemq-jms-pool-5.14.6-SNAPSHOT-sources.jar> to org.apache.activemq/activemq-jms-pool/5.14.6-SNAPSHOT/activemq-jms-pool-5.14.6-SNAPSHOT-sources.jar
[JENKINS] Archiving <https://builds.apache.org/job/ActiveMQ-Java8-5.14.x/ws/activemq-pool/pom.xml> to org.apache.activemq/activemq-pool/5.14.6-SNAPSHOT/activemq-pool-5.14.6-SNAPSHOT.pom
[JENKINS] Archiving <https://builds.apache.org/job/ActiveMQ-Java8-5.14.x/ws/activemq-pool/target/activemq-pool-5.14.6-SNAPSHOT.jar> to org.apache.activemq/activemq-pool/5.14.6-SNAPSHOT/activemq-pool-5.14.6-SNAPSHOT.jar
[JENKINS] Archiving <https://builds.apache.org/job/ActiveMQ-Java8-5.14.x/ws/activemq-pool/target/activemq-pool-5.14.6-SNAPSHOT-sources.jar> to org.apache.activemq/activemq-pool/5.14.6-SNAPSHOT/activemq-pool-5.14.6-SNAPSHOT-sources.jar
[JENKINS] Archiving <https://builds.apache.org/job/ActiveMQ-Java8-5.14.x/ws/activemq-jdbc-store/pom.xml> to org.apache.activemq/activemq-jdbc-store/5.14.6-SNAPSHOT/activemq-jdbc-store-5.14.6-SNAPSHOT.pom
[JENKINS] Archiving <https://builds.apache.org/job/ActiveMQ-Java8-5.14.x/ws/activemq-jdbc-store/target/activemq-jdbc-store-5.14.6-SNAPSHOT.jar> to org.apache.activemq/activemq-jdbc-store/5.14.6-SNAPSHOT/activemq-jdbc-store-5.14.6-SNAPSHOT.jar
[JENKINS] Archiving <https://builds.apache.org/job/ActiveMQ-Java8-5.14.x/ws/activemq-jdbc-store/target/activemq-jdbc-store-5.14.6-SNAPSHOT-sources.jar> to org.apache.activemq/activemq-jdbc-store/5.14.6-SNAPSHOT/activemq-jdbc-store-5.14.6-SNAPSHOT-sources.jar
[JENKINS] Archiving <https://builds.apache.org/job/ActiveMQ-Java8-5.14.x/ws/activemq-camel/pom.xml> to org.apache.activemq/activemq-camel/5.14.6-SNAPSHOT/activemq-camel-5.14.6-SNAPSHOT.pom
[JENKINS] Archiving <https://builds.apache.org/job/ActiveMQ-Java8-5.14.x/ws/activemq-camel/target/activemq-camel-5.14.6-SNAPSHOT.jar> to org.apache.activemq/activemq-camel/5.14.6-SNAPSHOT/activemq-camel-5.14.6-SNAPSHOT.jar
[JENKINS] Archiving <https://builds.apache.org/job/ActiveMQ-Java8-5.14.x/ws/activemq-camel/target/generated/camel/components/META-INF/services/org/apache/camel/component.properties> to org.apache.activemq/activemq-camel/5.14.6-SNAPSHOT/activemq-camel-5.14.6-SNAPSHOT-camelComponent.properties
[JENKINS] Archiving <https://builds.apache.org/job/ActiveMQ-Java8-5.14.x/ws/activemq-camel/target/activemq-camel-5.14.6-SNAPSHOT-sources.jar> to org.apache.activemq/activemq-camel/5.14.6-SNAPSHOT/activemq-camel-5.14.6-SNAPSHOT-sources.jar
[JENKINS] Archiving <https://builds.apache.org/job/ActiveMQ-Java8-5.14.x/ws/activemq-runtime-config/pom.xml> to org.apache.activemq/activemq-runtime-config/5.14.6-SNAPSHOT/activemq-runtime-config-5.14.6-SNAPSHOT.pom
[JENKINS] Archiving <https://builds.apache.org/job/ActiveMQ-Java8-5.14.x/ws/activemq-runtime-config/target/activemq-runtime-config-5.14.6-SNAPSHOT.jar> to org.apache.activemq/activemq-runtime-config/5.14.6-SNAPSHOT/activemq-runtime-config-5.14.6-SNAPSHOT.jar
[JENKINS] Archiving <https://builds.apache.org/job/ActiveMQ-Java8-5.14.x/ws/activemq-runtime-config/target/activemq-runtime-config-5.14.6-SNAPSHOT-sources.jar> to org.apache.activemq/activemq-runtime-config/5.14.6-SNAPSHOT/activemq-runtime-config-5.14.6-SNAPSHOT-sources.jar
[JENKINS] Archiving <https://builds.apache.org/job/ActiveMQ-Java8-5.14.x/ws/pom.xml> to org.apache.activemq/activemq-parent/5.14.6-SNAPSHOT/activemq-parent-5.14.6-SNAPSHOT.pom
Compressed 59.92 KB of artifacts by 53.4% relative to #48
[JENKINS] Archiving <https://builds.apache.org/job/ActiveMQ-Java8-5.14.x/ws/activemq-stomp/pom.xml> to org.apache.activemq/activemq-stomp/5.14.6-SNAPSHOT/activemq-stomp-5.14.6-SNAPSHOT.pom
[JENKINS] Archiving <https://builds.apache.org/job/ActiveMQ-Java8-5.14.x/ws/activemq-stomp/target/activemq-stomp-5.14.6-SNAPSHOT.jar> to org.apache.activemq/activemq-stomp/5.14.6-SNAPSHOT/activemq-stomp-5.14.6-SNAPSHOT.jar
[JENKINS] Archiving <https://builds.apache.org/job/ActiveMQ-Java8-5.14.x/ws/activemq-stomp/target/activemq-stomp-5.14.6-SNAPSHOT-sources.jar> to org.apache.activemq/activemq-stomp/5.14.6-SNAPSHOT/activemq-stomp-5.14.6-SNAPSHOT-sources.jar
[JENKINS] Archiving <https://builds.apache.org/job/ActiveMQ-Java8-5.14.x/ws/activemq-openwire-generator/pom.xml> to org.apache.activemq/activemq-openwire-generator/5.14.6-SNAPSHOT/activemq-openwire-generator-5.14.6-SNAPSHOT.pom
[JENKINS] Archiving <https://builds.apache.org/job/ActiveMQ-Java8-5.14.x/ws/activemq-openwire-generator/target/activemq-openwire-generator-5.14.6-SNAPSHOT.jar> to org.apache.activemq/activemq-openwire-generator/5.14.6-SNAPSHOT/activemq-openwire-generator-5.14.6-SNAPSHOT.jar
[JENKINS] Archiving <https://builds.apache.org/job/ActiveMQ-Java8-5.14.x/ws/activemq-openwire-generator/target/activemq-openwire-generator-5.14.6-SNAPSHOT-sources.jar> to org.apache.activemq/activemq-openwire-generator/5.14.6-SNAPSHOT/activemq-openwire-generator-5.14.6-SNAPSHOT-sources.jar
[JENKINS] Archiving <https://builds.apache.org/job/ActiveMQ-Java8-5.14.x/ws/activemq-broker/pom.xml> to org.apache.activemq/activemq-broker/5.14.6-SNAPSHOT/activemq-broker-5.14.6-SNAPSHOT.pom
[JENKINS] Archiving <https://builds.apache.org/job/ActiveMQ-Java8-5.14.x/ws/activemq-broker/target/activemq-broker-5.14.6-SNAPSHOT.jar> to org.apache.activemq/activemq-broker/5.14.6-SNAPSHOT/activemq-broker-5.14.6-SNAPSHOT.jar
[JENKINS] Archiving <https://builds.apache.org/job/ActiveMQ-Java8-5.14.x/ws/activemq-broker/target/activemq-broker-5.14.6-SNAPSHOT-tests.jar> to org.apache.activemq/activemq-broker/5.14.6-SNAPSHOT/activemq-broker-5.14.6-SNAPSHOT-tests.jar
[JENKINS] Archiving <https://builds.apache.org/job/ActiveMQ-Java8-5.14.x/ws/activemq-broker/target/activemq-broker-5.14.6-SNAPSHOT-sources.jar> to org.apache.activemq/activemq-broker/5.14.6-SNAPSHOT/activemq-broker-5.14.6-SNAPSHOT-sources.jar
[JENKINS] Archiving <https://builds.apache.org/job/ActiveMQ-Java8-5.14.x/ws/activemq-web-demo/pom.xml> to org.apache.activemq/activemq-web-demo/5.14.6-SNAPSHOT/activemq-web-demo-5.14.6-SNAPSHOT.pom
[JENKINS] Archiving <https://builds.apache.org/job/ActiveMQ-Java8-5.14.x/ws/activemq-web-demo/target/activemq-web-demo-5.14.6-SNAPSHOT.war> to org.apache.activemq/activemq-web-demo/5.14.6-SNAPSHOT/activemq-web-demo-5.14.6-SNAPSHOT.war
[JENKINS] Archiving <https://builds.apache.org/job/ActiveMQ-Java8-5.14.x/ws/activemq-web-demo/target/activemq-web-demo-5.14.6-SNAPSHOT-sources.jar> to org.apache.activemq/activemq-web-demo/5.14.6-SNAPSHOT/activemq-web-demo-5.14.6-SNAPSHOT-sources.jar
Compressed 30.71 MB of artifacts by 92.3% relative to #48
[JENKINS] Archiving <https://builds.apache.org/job/ActiveMQ-Java8-5.14.x/ws/activemq-mqtt/pom.xml> to org.apache.activemq/activemq-mqtt/5.14.6-SNAPSHOT/activemq-mqtt-5.14.6-SNAPSHOT.pom
[JENKINS] Archiving <https://builds.apache.org/job/ActiveMQ-Java8-5.14.x/ws/activemq-mqtt/target/activemq-mqtt-5.14.6-SNAPSHOT.jar> to org.apache.activemq/activemq-mqtt/5.14.6-SNAPSHOT/activemq-mqtt-5.14.6-SNAPSHOT.jar
[JENKINS] Archiving <https://builds.apache.org/job/ActiveMQ-Java8-5.14.x/ws/activemq-mqtt/target/activemq-mqtt-5.14.6-SNAPSHOT-sources.jar> to org.apache.activemq/activemq-mqtt/5.14.6-SNAPSHOT/activemq-mqtt-5.14.6-SNAPSHOT-sources.jar
[JENKINS] Archiving <https://builds.apache.org/job/ActiveMQ-Java8-5.14.x/ws/activemq-shiro/pom.xml> to org.apache.activemq/activemq-shiro/5.14.6-SNAPSHOT/activemq-shiro-5.14.6-SNAPSHOT.pom
[JENKINS] Archiving <https://builds.apache.org/job/ActiveMQ-Java8-5.14.x/ws/activemq-shiro/target/activemq-shiro-5.14.6-SNAPSHOT.jar> to org.apache.activemq/activemq-shiro/5.14.6-SNAPSHOT/activemq-shiro-5.14.6-SNAPSHOT.jar
[JENKINS] Archiving <https://builds.apache.org/job/ActiveMQ-Java8-5.14.x/ws/activemq-shiro/target/activemq-shiro-5.14.6-SNAPSHOT-sources.jar> to org.apache.activemq/activemq-shiro/5.14.6-SNAPSHOT/activemq-shiro-5.14.6-SNAPSHOT-sources.jar
[JENKINS] Archiving <https://builds.apache.org/job/ActiveMQ-Java8-5.14.x/ws/activemq-tooling/activemq-perf-maven-plugin/pom.xml> to org.apache.activemq.tooling/activemq-perf-maven-plugin/5.14.6-SNAPSHOT/activemq-perf-maven-plugin-5.14.6-SNAPSHOT.pom
[JENKINS] Archiving <https://builds.apache.org/job/ActiveMQ-Java8-5.14.x/ws/activemq-tooling/activemq-perf-maven-plugin/target/activemq-perf-maven-plugin-5.14.6-SNAPSHOT.jar> to org.apache.activemq.tooling/activemq-perf-maven-plugin/5.14.6-SNAPSHOT/activemq-perf-maven-plugin-5.14.6-SNAPSHOT.jar
[JENKINS] Archiving <https://builds.apache.org/job/ActiveMQ-Java8-5.14.x/ws/activemq-tooling/activemq-perf-maven-plugin/target/activemq-perf-maven-plugin-5.14.6-SNAPSHOT-sources.jar> to org.apache.activemq.tooling/activemq-perf-maven-plugin/5.14.6-SNAPSHOT/activemq-perf-maven-plugin-5.14.6-SNAPSHOT-sources.jar
[JENKINS] Archiving <https://builds.apache.org/job/ActiveMQ-Java8-5.14.x/ws/activemq-run/dependency-reduced-pom.xml> to org.apache.activemq/activemq-run/5.14.6-SNAPSHOT/activemq-run-5.14.6-SNAPSHOT.pom
[JENKINS] Archiving <https://builds.apache.org/job/ActiveMQ-Java8-5.14.x/ws/activemq-run/target/activemq-run-5.14.6-SNAPSHOT.jar> to org.apache.activemq/activemq-run/5.14.6-SNAPSHOT/activemq-run-5.14.6-SNAPSHOT.jar
[JENKINS] Archiving <https://builds.apache.org/job/ActiveMQ-Java8-5.14.x/ws/activemq-run/target/activemq-run-5.14.6-SNAPSHOT-sources.jar> to org.apache.activemq/activemq-run/5.14.6-SNAPSHOT/activemq-run-5.14.6-SNAPSHOT-sources.jar
[JENKINS] Archiving <https://builds.apache.org/job/ActiveMQ-Java8-5.14.x/ws/activemq-tooling/activemq-maven-plugin/pom.xml> to org.apache.activemq.tooling/activemq-maven-plugin/5.14.6-SNAPSHOT/activemq-maven-plugin-5.14.6-SNAPSHOT.pom
[JENKINS] Archiving <https://builds.apache.org/job/ActiveMQ-Java8-5.14.x/ws/activemq-tooling/activemq-maven-plugin/target/activemq-maven-plugin-5.14.6-SNAPSHOT.jar> to org.apache.activemq.tooling/activemq-maven-plugin/5.14.6-SNAPSHOT/activemq-maven-plugin-5.14.6-SNAPSHOT.jar
[JENKINS] Archiving <https://builds.apache.org/job/ActiveMQ-Java8-5.14.x/ws/activemq-tooling/activemq-maven-plugin/target/activemq-maven-plugin-5.14.6-SNAPSHOT-sources.jar> to org.apache.activemq.tooling/activemq-maven-plugin/5.14.6-SNAPSHOT/activemq-maven-plugin-5.14.6-SNAPSHOT-sources.jar
[JENKINS] Archiving <https://builds.apache.org/job/ActiveMQ-Java8-5.14.x/ws/activemq-karaf/pom.xml> to org.apache.activemq/activemq-karaf/5.14.6-SNAPSHOT/activemq-karaf-5.14.6-SNAPSHOT.pom
[JENKINS] Archiving <https://builds.apache.org/job/ActiveMQ-Java8-5.14.x/ws/activemq-karaf/target/activemq-karaf-5.14.6-SNAPSHOT.jar> to org.apache.activemq/activemq-karaf/5.14.6-SNAPSHOT/activemq-karaf-5.14.6-SNAPSHOT.jar
[JENKINS] Archiving <https://builds.apache.org/job/ActiveMQ-Java8-5.14.x/ws/activemq-karaf/target/classes/features.xml> to org.apache.activemq/activemq-karaf/5.14.6-SNAPSHOT/activemq-karaf-5.14.6-SNAPSHOT-features.xml
[JENKINS] Archiving <https://builds.apache.org/job/ActiveMQ-Java8-5.14.x/ws/activemq-karaf/target/classes/features-core.xml> to org.apache.activemq/activemq-karaf/5.14.6-SNAPSHOT/activemq-karaf-5.14.6-SNAPSHOT-features-core.xml
[JENKINS] Archiving <https://builds.apache.org/job/ActiveMQ-Java8-5.14.x/ws/activemq-karaf/target/classes/activemq.xml> to org.apache.activemq/activemq-karaf/5.14.6-SNAPSHOT/activemq-karaf-5.14.6-SNAPSHOT-activemq.xml
[JENKINS] Archiving <https://builds.apache.org/job/ActiveMQ-Java8-5.14.x/ws/activemq-karaf/target/classes/org.apache.activemq.server-default.cfg> to org.apache.activemq/activemq-karaf/5.14.6-SNAPSHOT/activemq-karaf-5.14.6-SNAPSHOT-activemq.cfg
[JENKINS] Archiving <https://builds.apache.org/job/ActiveMQ-Java8-5.14.x/ws/activemq-karaf/target/classes/org.apache.activemq.webconsole.cfg> to org.apache.activemq/activemq-karaf/5.14.6-SNAPSHOT/activemq-karaf-5.14.6-SNAPSHOT-activemq-webconsole.cfg
[JENKINS] Archiving <https://builds.apache.org/job/ActiveMQ-Java8-5.14.x/ws/activemq-karaf/target/activemq-karaf-5.14.6-SNAPSHOT-sources.jar> to org.apache.activemq/activemq-karaf/5.14.6-SNAPSHOT/activemq-karaf-5.14.6-SNAPSHOT-sources.jar
[JENKINS] Archiving <https://builds.apache.org/job/ActiveMQ-Java8-5.14.x/ws/activemq-web-console/pom.xml> to org.apache.activemq/activemq-web-console/5.14.6-SNAPSHOT/activemq-web-console-5.14.6-SNAPSHOT.pom
[JENKINS] Archiving <https://builds.apache.org/job/ActiveMQ-Java8-5.14.x/ws/activemq-web-console/target/activemq-web-console-5.14.6-SNAPSHOT.war> to org.apache.activemq/activemq-web-console/5.14.6-SNAPSHOT/activemq-web-console-5.14.6-SNAPSHOT.war
[JENKINS] Archiving <https://builds.apache.org/job/ActiveMQ-Java8-5.14.x/ws/activemq-web-console/target/activemq-web-console-5.14.6-SNAPSHOT-sources.jar> to org.apache.activemq/activemq-web-console/5.14.6-SNAPSHOT/activemq-web-console-5.14.6-SNAPSHOT-sources.jar
Compressed 13.46 MB of artifacts by 60.1% relative to #48
[JENKINS] Archiving <https://builds.apache.org/job/ActiveMQ-Java8-5.14.x/ws/activemq-jaas/pom.xml> to org.apache.activemq/activemq-jaas/5.14.6-SNAPSHOT/activemq-jaas-5.14.6-SNAPSHOT.pom
[JENKINS] Archiving <https://builds.apache.org/job/ActiveMQ-Java8-5.14.x/ws/activemq-jaas/target/activemq-jaas-5.14.6-SNAPSHOT.jar> to org.apache.activemq/activemq-jaas/5.14.6-SNAPSHOT/activemq-jaas-5.14.6-SNAPSHOT.jar
[JENKINS] Archiving <https://builds.apache.org/job/ActiveMQ-Java8-5.14.x/ws/activemq-jaas/target/activemq-jaas-5.14.6-SNAPSHOT-sources.jar> to org.apache.activemq/activemq-jaas/5.14.6-SNAPSHOT/activemq-jaas-5.14.6-SNAPSHOT-sources.jar
[JENKINS] Archiving <https://builds.apache.org/job/ActiveMQ-Java8-5.14.x/ws/activemq-itests-spring31/pom.xml> to org.apache.activemq/activemq-itests-spring31/5.14.6-SNAPSHOT/activemq-itests-spring31-5.14.6-SNAPSHOT.pom
[JENKINS] Archiving <https://builds.apache.org/job/ActiveMQ-Java8-5.14.x/ws/activemq-itests-spring31/target/activemq-itests-spring31-5.14.6-SNAPSHOT.jar> to org.apache.activemq/activemq-itests-spring31/5.14.6-SNAPSHOT/activemq-itests-spring31-5.14.6-SNAPSHOT.jar
[JENKINS] Archiving <https://builds.apache.org/job/ActiveMQ-Java8-5.14.x/ws/activemq-itests-spring31/target/activemq-itests-spring31-5.14.6-SNAPSHOT-sources.jar> to org.apache.activemq/activemq-itests-spring31/5.14.6-SNAPSHOT/activemq-itests-spring31-5.14.6-SNAPSHOT-sources.jar
[JENKINS] Archiving <https://builds.apache.org/job/ActiveMQ-Java8-5.14.x/ws/activemq-tooling/activemq-memtest-maven-plugin/pom.xml> to org.apache.activemq.tooling/activemq-memtest-maven-plugin/5.14.6-SNAPSHOT/activemq-memtest-maven-plugin-5.14.6-SNAPSHOT.pom
[JENKINS] Archiving <https://builds.apache.org/job/ActiveMQ-Java8-5.14.x/ws/activemq-tooling/activemq-memtest-maven-plugin/target/activemq-memtest-maven-plugin-5.14.6-SNAPSHOT.jar> to org.apache.activemq.tooling/activemq-memtest-maven-plugin/5.14.6-SNAPSHOT/activemq-memtest-maven-plugin-5.14.6-SNAPSHOT.jar
[JENKINS] Archiving <https://builds.apache.org/job/ActiveMQ-Java8-5.14.x/ws/activemq-tooling/activemq-memtest-maven-plugin/target/activemq-memtest-maven-plugin-5.14.6-SNAPSHOT-sources.jar> to org.apache.activemq.tooling/activemq-memtest-maven-plugin/5.14.6-SNAPSHOT/activemq-memtest-maven-plugin-5.14.6-SNAPSHOT-sources.jar
[JENKINS] Archiving <https://builds.apache.org/job/ActiveMQ-Java8-5.14.x/ws/activemq-ra/pom.xml> to org.apache.activemq/activemq-ra/5.14.6-SNAPSHOT/activemq-ra-5.14.6-SNAPSHOT.pom
[JENKINS] Archiving <https://builds.apache.org/job/ActiveMQ-Java8-5.14.x/ws/activemq-ra/target/activemq-ra-5.14.6-SNAPSHOT.jar> to org.apache.activemq/activemq-ra/5.14.6-SNAPSHOT/activemq-ra-5.14.6-SNAPSHOT.jar
[JENKINS] Archiving <https://builds.apache.org/job/ActiveMQ-Java8-5.14.x/ws/activemq-ra/target/xbean/activemq-ra.xsd> to org.apache.activemq/activemq-ra/5.14.6-SNAPSHOT/activemq-ra-5.14.6-SNAPSHOT.xsd
[JENKINS] Archiving <https://builds.apache.org/job/ActiveMQ-Java8-5.14.x/ws/activemq-ra/target/xbean/activemq-ra.xsd.html> to org.apache.activemq/activemq-ra/5.14.6-SNAPSHOT/activemq-ra-5.14.6-SNAPSHOT-schema.html
[JENKINS] Archiving <https://builds.apache.org/job/ActiveMQ-Java8-5.14.x/ws/activemq-ra/target/xbean/activemq-ra.xsd.html> to org.apache.activemq/activemq-ra/5.14.6-SNAPSHOT/activemq-ra-5.14.6-SNAPSHOT.xsd.html
[JENKINS] Archiving <https://builds.apache.org/job/ActiveMQ-Java8-5.14.x/ws/activemq-ra/target/activemq-ra-5.14.6-SNAPSHOT-sources.jar> to org.apache.activemq/activemq-ra/5.14.6-SNAPSHOT/activemq-ra-5.14.6-SNAPSHOT-sources.jar
[JENKINS] Archiving <https://builds.apache.org/job/ActiveMQ-Java8-5.14.x/ws/activemq-partition/pom.xml> to org.apache.activemq/activemq-partition/5.14.6-SNAPSHOT/activemq-partition-5.14.6-SNAPSHOT.pom
[JENKINS] Archiving <https://builds.apache.org/job/ActiveMQ-Java8-5.14.x/ws/activemq-partition/target/activemq-partition-5.14.6-SNAPSHOT.jar> to org.apache.activemq/activemq-partition/5.14.6-SNAPSHOT/activemq-partition-5.14.6-SNAPSHOT.jar
[JENKINS] Archiving <https://builds.apache.org/job/ActiveMQ-Java8-5.14.x/ws/activemq-partition/target/activemq-partition-5.14.6-SNAPSHOT-sources.jar> to org.apache.activemq/activemq-partition/5.14.6-SNAPSHOT/activemq-partition-5.14.6-SNAPSHOT-sources.jar
[JENKINS] Archiving <https://builds.apache.org/job/ActiveMQ-Java8-5.14.x/ws/activemq-all/dependency-reduced-pom.xml> to org.apache.activemq/activemq-all/5.14.6-SNAPSHOT/activemq-all-5.14.6-SNAPSHOT.pom
[JENKINS] Archiving <https://builds.apache.org/job/ActiveMQ-Java8-5.14.x/ws/activemq-all/target/activemq-all-5.14.6-SNAPSHOT.jar> to org.apache.activemq/activemq-all/5.14.6-SNAPSHOT/activemq-all-5.14.6-SNAPSHOT.jar
[JENKINS] Archiving <https://builds.apache.org/job/ActiveMQ-Java8-5.14.x/ws/activemq-all/target/activemq-all-5.14.6-SNAPSHOT-sources.jar> to org.apache.activemq/activemq-all/5.14.6-SNAPSHOT/activemq-all-5.14.6-SNAPSHOT-sources.jar
[JENKINS] Archiving <https://builds.apache.org/job/ActiveMQ-Java8-5.14.x/ws/assembly/pom.xml> to org.apache.activemq/apache-activemq/5.14.6-SNAPSHOT/apache-activemq-5.14.6-SNAPSHOT.pom
[JENKINS] Archiving <https://builds.apache.org/job/ActiveMQ-Java8-5.14.x/ws/assembly/target/apache-activemq-5.14.6-SNAPSHOT-bin.tar.gz> to org.apache.activemq/apache-activemq/5.14.6-SNAPSHOT/apache-activemq-5.14.6-SNAPSHOT-bin.tar.gz
[JENKINS] Archiving <https://builds.apache.org/job/ActiveMQ-Java8-5.14.x/ws/assembly/target/apache-activemq-5.14.6-SNAPSHOT-bin.zip> to org.apache.activemq/apache-activemq/5.14.6-SNAPSHOT/apache-activemq-5.14.6-SNAPSHOT-bin.zip
Compressed 109.64 MB of artifacts by 28.7% relative to #48
[JENKINS] Archiving <https://builds.apache.org/job/ActiveMQ-Java8-5.14.x/ws/activemq-console/pom.xml> to org.apache.activemq/activemq-console/5.14.6-SNAPSHOT/activemq-console-5.14.6-SNAPSHOT.pom
[JENKINS] Archiving <https://builds.apache.org/job/ActiveMQ-Java8-5.14.x/ws/activemq-console/target/activemq-console-5.14.6-SNAPSHOT.jar> to org.apache.activemq/activemq-console/5.14.6-SNAPSHOT/activemq-console-5.14.6-SNAPSHOT.jar
[JENKINS] Archiving <https://builds.apache.org/job/ActiveMQ-Java8-5.14.x/ws/activemq-console/target/activemq-console-5.14.6-SNAPSHOT-sources.jar> to org.apache.activemq/activemq-console/5.14.6-SNAPSHOT/activemq-console-5.14.6-SNAPSHOT-sources.jar
[JENKINS] Archiving <https://builds.apache.org/job/ActiveMQ-Java8-5.14.x/ws/activemq-spring/pom.xml> to org.apache.activemq/activemq-spring/5.14.6-SNAPSHOT/activemq-spring-5.14.6-SNAPSHOT.pom
[JENKINS] Archiving <https://builds.apache.org/job/ActiveMQ-Java8-5.14.x/ws/activemq-spring/target/activemq-spring-5.14.6-SNAPSHOT.jar> to org.apache.activemq/activemq-spring/5.14.6-SNAPSHOT/activemq-spring-5.14.6-SNAPSHOT.jar
[JENKINS] Archiving <https://builds.apache.org/job/ActiveMQ-Java8-5.14.x/ws/activemq-spring/target/classes/activemq.xsd> to org.apache.activemq/activemq-spring/5.14.6-SNAPSHOT/activemq-spring-5.14.6-SNAPSHOT.xsd
[JENKINS] Archiving <https://builds.apache.org/job/ActiveMQ-Java8-5.14.x/ws/activemq-spring/target/classes/activemq.xsd.html> to org.apache.activemq/activemq-spring/5.14.6-SNAPSHOT/activemq-spring-5.14.6-SNAPSHOT-schema.html
[JENKINS] Archiving <https://builds.apache.org/job/ActiveMQ-Java8-5.14.x/ws/activemq-spring/target/activemq-spring-5.14.6-SNAPSHOT-sources.jar> to org.apache.activemq/activemq-spring/5.14.6-SNAPSHOT/activemq-spring-5.14.6-SNAPSHOT-sources.jar
Compressed 1.06 MB of artifacts by 61.9% relative to #48
[JENKINS] Archiving <https://builds.apache.org/job/ActiveMQ-Java8-5.14.x/ws/activemq-cf/pom.xml> to org.apache.activemq/activemq-cf/5.14.6-SNAPSHOT/activemq-cf-5.14.6-SNAPSHOT.pom
[JENKINS] Archiving <https://builds.apache.org/job/ActiveMQ-Java8-5.14.x/ws/activemq-cf/target/activemq-cf-5.14.6-SNAPSHOT.jar> to org.apache.activemq/activemq-cf/5.14.6-SNAPSHOT/activemq-cf-5.14.6-SNAPSHOT.jar
[JENKINS] Archiving <https://builds.apache.org/job/ActiveMQ-Java8-5.14.x/ws/activemq-cf/target/activemq-cf-5.14.6-SNAPSHOT-sources.jar> to org.apache.activemq/activemq-cf/5.14.6-SNAPSHOT/activemq-cf-5.14.6-SNAPSHOT-sources.jar
[JENKINS] Archiving <https://builds.apache.org/job/ActiveMQ-Java8-5.14.x/ws/activemq-leveldb-store/pom.xml> to org.apache.activemq/activemq-leveldb-store/5.14.6-SNAPSHOT/activemq-leveldb-store-5.14.6-SNAPSHOT.pom
[JENKINS] Archiving <https://builds.apache.org/job/ActiveMQ-Java8-5.14.x/ws/activemq-leveldb-store/target/activemq-leveldb-store-5.14.6-SNAPSHOT.jar> to org.apache.activemq/activemq-leveldb-store/5.14.6-SNAPSHOT/activemq-leveldb-store-5.14.6-SNAPSHOT.jar
[JENKINS] Archiving <https://builds.apache.org/job/ActiveMQ-Java8-5.14.x/ws/activemq-leveldb-store/target/activemq-leveldb-store-5.14.6-SNAPSHOT-sources.jar> to org.apache.activemq/activemq-leveldb-store/5.14.6-SNAPSHOT/activemq-leveldb-store-5.14.6-SNAPSHOT-sources.jar
[JENKINS] Archiving <https://builds.apache.org/job/ActiveMQ-Java8-5.14.x/ws/activemq-web/pom.xml> to org.apache.activemq/activemq-web/5.14.6-SNAPSHOT/activemq-web-5.14.6-SNAPSHOT.pom
[JENKINS] Archiving <https://builds.apache.org/job/ActiveMQ-Java8-5.14.x/ws/activemq-web/target/activemq-web-5.14.6-SNAPSHOT.jar> to org.apache.activemq/activemq-web/5.14.6-SNAPSHOT/activemq-web-5.14.6-SNAPSHOT.jar
[JENKINS] Archiving <https://builds.apache.org/job/ActiveMQ-Java8-5.14.x/ws/activemq-web/target/activemq-web-5.14.6-SNAPSHOT-sources.jar> to org.apache.activemq/activemq-web/5.14.6-SNAPSHOT/activemq-web-5.14.6-SNAPSHOT-sources.jar
[JENKINS] Archiving <https://builds.apache.org/job/ActiveMQ-Java8-5.14.x/ws/activemq-log4j-appender/pom.xml> to org.apache.activemq/activemq-log4j-appender/5.14.6-SNAPSHOT/activemq-log4j-appender-5.14.6-SNAPSHOT.pom
[JENKINS] Archiving <https://builds.apache.org/job/ActiveMQ-Java8-5.14.x/ws/activemq-log4j-appender/target/activemq-log4j-appender-5.14.6-SNAPSHOT.jar> to org.apache.activemq/activemq-log4j-appender/5.14.6-SNAPSHOT/activemq-log4j-appender-5.14.6-SNAPSHOT.jar
[JENKINS] Archiving <https://builds.apache.org/job/ActiveMQ-Java8-5.14.x/ws/activemq-log4j-appender/target/activemq-log4j-appender-5.14.6-SNAPSHOT-sources.jar> to org.apache.activemq/activemq-log4j-appender/5.14.6-SNAPSHOT/activemq-log4j-appender-5.14.6-SNAPSHOT-sources.jar
Sending e-mails to: [hidden email]
Sending e-mails to: [hidden email]
Sending e-mails to: [hidden email]
Sending e-mails to: [hidden email]
[locks-and-latches] Releasing all the locks
[locks-and-latches] All the locks released
channel stopped
Reply | Threaded
Open this post in threaded view
|

Jenkins build is unstable: ActiveMQ-Java8-5.14.x #50

Apache Jenkins Server-2
Reply | Threaded
Open this post in threaded view
|

Jenkins build is still unstable: ActiveMQ-Java8-5.14.x #51

Apache Jenkins Server-2
Reply | Threaded
Open this post in threaded view
|

Jenkins build is still unstable: ActiveMQ-Java8-5.14.x #52

Apache Jenkins Server-2
Reply | Threaded
Open this post in threaded view
|

Jenkins build is still unstable: ActiveMQ-Java8-5.14.x #53

Apache Jenkins Server-2
Reply | Threaded
Open this post in threaded view
|

Build failed in Jenkins: ActiveMQ-Java8-5.14.x #54

Apache Jenkins Server-2
See <https://builds.apache.org/job/ActiveMQ-Java8-5.14.x/54/display/redirect?page=changes>

Changes:

[tabish121] AMQ-6697 Adds a test to show that the described case works

[tabish121] AMQ-6697 Preserve dispatched state on client-individual tx ack

[tabish121] AMQ-6697 Make the MBean explicitly final for java 7 support

------------------------------------------
Started by an SCM change
Started by an SCM change
Started by an SCM change
Started by an SCM change
Started by an SCM change
[EnvInject] - Loading node environment variables.
Building remotely on H22 (ubuntu xenial) in workspace <https://builds.apache.org/job/ActiveMQ-Java8-5.14.x/ws/>
Cloning the remote Git repository
Cloning repository https://git-wip-us.apache.org/repos/asf/activemq.git
 > git init <https://builds.apache.org/job/ActiveMQ-Java8-5.14.x/ws/> # timeout=10
Fetching upstream changes from https://git-wip-us.apache.org/repos/asf/activemq.git
 > git --version # timeout=10
 > git fetch --tags --progress https://git-wip-us.apache.org/repos/asf/activemq.git +refs/heads/*:refs/remotes/origin/*
 > git config remote.origin.url https://git-wip-us.apache.org/repos/asf/activemq.git # timeout=10
 > git config --add remote.origin.fetch +refs/heads/*:refs/remotes/origin/* # timeout=10
 > git config remote.origin.url https://git-wip-us.apache.org/repos/asf/activemq.git # timeout=10
Fetching upstream changes from https://git-wip-us.apache.org/repos/asf/activemq.git
 > git fetch --tags --progress https://git-wip-us.apache.org/repos/asf/activemq.git +refs/heads/*:refs/remotes/origin/*
 > git rev-parse origin/activemq-5.14.x^{commit} # timeout=10
Checking out Revision e38ac94a27347c89dddcd30c7a3e6063a69308dd (origin/activemq-5.14.x)
 > git config core.sparsecheckout # timeout=10
 > git checkout -f e38ac94a27347c89dddcd30c7a3e6063a69308dd
 > git rev-list 908ef647289a80a6fec500a6d37dd59059dccfbd # timeout=10
[locks-and-latches] Checking to see if we really have the locks
[locks-and-latches] Have all the locks, build can start
Parsing POMs
Established TCP socket on 36792
maven33-agent.jar already up to date
maven33-interceptor.jar already up to date
maven3-interceptor-commons.jar already up to date
[ActiveMQ-Java8-5.14.x] $ /home/jenkins/tools/java/latest1.8/bin/java -Xmx2048m -Xms1024m -cp /home/jenkins/jenkins-slave/maven33-agent.jar:/home/jenkins/tools/maven/latest3/boot/plexus-classworlds-2.5.2.jar:/home/jenkins/tools/maven/latest3/conf/logging jenkins.maven3.agent.Maven33Main /home/jenkins/tools/maven/latest3/ /home/jenkins/jenkins-slave/slave.jar /home/jenkins/jenkins-slave/maven33-interceptor.jar /home/jenkins/jenkins-slave/maven3-interceptor-commons.jar 36792
<===[JENKINS REMOTING CAPACITY]===>   channel started
Executing Maven:  -B -f <https://builds.apache.org/job/ActiveMQ-Java8-5.14.x/ws/pom.xml> -Dmaven.repo.local=/home/jenkins/jenkins-slave/maven-repositories/1 -fae -B -e -U clean install source:jar
[INFO] Error stacktraces are turned on.
java.lang.reflect.InvocationTargetException
        at sun.reflect.NativeMethodAccessorImpl.invoke0(Native Method)
        at sun.reflect.NativeMethodAccessorImpl.invoke(NativeMethodAccessorImpl.java:62)
        at sun.reflect.DelegatingMethodAccessorImpl.invoke(DelegatingMethodAccessorImpl.java:43)
        at java.lang.reflect.Method.invoke(Method.java:498)
        at org.codehaus.plexus.classworlds.launcher.Launcher.launchStandard(Launcher.java:330)
        at org.codehaus.plexus.classworlds.launcher.Launcher.launch(Launcher.java:238)
        at jenkins.maven3.agent.Maven33Main.launch(Maven33Main.java:176)
        at sun.reflect.NativeMethodAccessorImpl.invoke0(Native Method)
        at sun.reflect.NativeMethodAccessorImpl.invoke(NativeMethodAccessorImpl.java:62)
        at sun.reflect.DelegatingMethodAccessorImpl.invoke(DelegatingMethodAccessorImpl.java:43)
        at java.lang.reflect.Method.invoke(Method.java:498)
        at hudson.maven.Maven3Builder.call(Maven3Builder.java:139)
        at hudson.maven.Maven3Builder.call(Maven3Builder.java:70)
        at hudson.remoting.UserRequest.perform(UserRequest.java:153)
        at hudson.remoting.UserRequest.perform(UserRequest.java:50)
        at hudson.remoting.Request$2.run(Request.java:336)
        at hudson.remoting.InterceptingExecutorService$1.call(InterceptingExecutorService.java:68)
        at java.util.concurrent.FutureTask.run(FutureTask.java:266)
        at java.util.concurrent.ThreadPoolExecutor.runWorker(ThreadPoolExecutor.java:1142)
        at java.util.concurrent.ThreadPoolExecutor$Worker.run(ThreadPoolExecutor.java:617)
        at java.lang.Thread.run(Thread.java:745)
Caused by: java.lang.NoSuchFieldError: DEFAULT_USER_SETTINGS_FILE
        at org.apache.maven.cli.DefaultMavenExecutionRequestBuilder.settings(DefaultMavenExecutionRequestBuilder.java:658)
        at org.apache.maven.cli.DefaultMavenExecutionRequestBuilder.getMavenExecutionRequest(DefaultMavenExecutionRequestBuilder.java:149)
        at org.jvnet.hudson.maven3.launcher.Maven33Launcher.getMavenExecutionRequest(Maven33Launcher.java:150)
        at org.jvnet.hudson.maven3.launcher.Maven33Launcher.main(Maven33Launcher.java:127)
        ... 21 more
[locks-and-latches] Releasing all the locks
[locks-and-latches] All the locks released
ERROR: Failed to parse POMs
java.io.IOException: java.lang.reflect.InvocationTargetException
        at hudson.maven.Maven3Builder.call(Maven3Builder.java:179)
        at hudson.maven.Maven3Builder.call(Maven3Builder.java:70)
        at hudson.remoting.UserRequest.perform(UserRequest.java:153)
        at hudson.remoting.UserRequest.perform(UserRequest.java:50)
        at hudson.remoting.Request$2.run(Request.java:336)
        at hudson.remoting.InterceptingExecutorService$1.call(InterceptingExecutorService.java:68)
        at java.util.concurrent.FutureTask.run(FutureTask.java:266)
        at java.util.concurrent.ThreadPoolExecutor.runWorker(ThreadPoolExecutor.java:1142)
        at java.util.concurrent.ThreadPoolExecutor$Worker.run(ThreadPoolExecutor.java:617)
        at java.lang.Thread.run(Thread.java:745)
        at ......remote call to Channel to Maven [/home/jenkins/tools/java/latest1.8/bin/java, -Xmx2048m, -Xms1024m, -cp, /home/jenkins/jenkins-slave/maven33-agent.jar:/home/jenkins/tools/maven/latest3/boot/plexus-classworlds-2.5.2.jar:/home/jenkins/tools/maven/latest3/conf/logging, jenkins.maven3.agent.Maven33Main, /home/jenkins/tools/maven/latest3/, /home/jenkins/jenkins-slave/slave.jar, /home/jenkins/jenkins-slave/maven33-interceptor.jar, /home/jenkins/jenkins-slave/maven3-interceptor-commons.jar, 36792](Native Method)
        at hudson.remoting.Channel.attachCallSiteStackTrace(Channel.java:1545)
        at hudson.remoting.UserResponse.retrieve(UserRequest.java:253)
        at hudson.remoting.Channel.call(Channel.java:830)
        at hudson.maven.ProcessCache$MavenProcess.call(ProcessCache.java:161)
        at hudson.maven.MavenModuleSetBuild$MavenModuleSetBuildExecution.doRun(MavenModuleSetBuild.java:873)
        at hudson.model.AbstractBuild$AbstractBuildExecution.run(AbstractBuild.java:534)
        at hudson.model.Run.execute(Run.java:1728)
        at hudson.maven.MavenModuleSetBuild.run(MavenModuleSetBuild.java:544)
        at hudson.model.ResourceController.execute(ResourceController.java:98)
        at hudson.model.Executor.run(Executor.java:405)
Caused by: java.lang.reflect.InvocationTargetException
        at sun.reflect.NativeMethodAccessorImpl.invoke0(Native Method)
        at sun.reflect.NativeMethodAccessorImpl.invoke(NativeMethodAccessorImpl.java:62)
        at sun.reflect.DelegatingMethodAccessorImpl.invoke(DelegatingMethodAccessorImpl.java:43)
        at java.lang.reflect.Method.invoke(Method.java:498)
        at hudson.maven.Maven3Builder.call(Maven3Builder.java:139)
        at hudson.maven.Maven3Builder.call(Maven3Builder.java:70)
        at hudson.remoting.UserRequest.perform(UserRequest.java:153)
        at hudson.remoting.UserRequest.perform(UserRequest.java:50)
        at hudson.remoting.Request$2.run(Request.java:336)
        at hudson.remoting.InterceptingExecutorService$1.call(InterceptingExecutorService.java:68)
        at java.util.concurrent.FutureTask.run(FutureTask.java:266)
        at java.util.concurrent.ThreadPoolExecutor.runWorker(ThreadPoolExecutor.java:1142)
        at java.util.concurrent.ThreadPoolExecutor$Worker.run(ThreadPoolExecutor.java:617)
        at java.lang.Thread.run(Thread.java:745)
Caused by: java.lang.Exception: java.lang.reflect.InvocationTargetException
        at jenkins.maven3.agent.Maven33Main.launch(Maven33Main.java:179)
        ... 14 more
Caused by: java.lang.reflect.InvocationTargetException
        at sun.reflect.NativeMethodAccessorImpl.invoke0(Native Method)
        at sun.reflect.NativeMethodAccessorImpl.invoke(NativeMethodAccessorImpl.java:62)
        at sun.reflect.DelegatingMethodAccessorImpl.invoke(DelegatingMethodAccessorImpl.java:43)
        at java.lang.reflect.Method.invoke(Method.java:498)
        at org.codehaus.plexus.classworlds.launcher.Launcher.launchStandard(Launcher.java:330)
        at org.codehaus.plexus.classworlds.launcher.Launcher.launch(Launcher.java:238)
        at jenkins.maven3.agent.Maven33Main.launch(Maven33Main.java:176)
        ... 14 more
Caused by: java.lang.NoSuchFieldError: DEFAULT_USER_SETTINGS_FILE
        at org.apache.maven.cli.DefaultMavenExecutionRequestBuilder.settings(DefaultMavenExecutionRequestBuilder.java:658)
        at org.apache.maven.cli.DefaultMavenExecutionRequestBuilder.getMavenExecutionRequest(DefaultMavenExecutionRequestBuilder.java:149)
        at org.jvnet.hudson.maven3.launcher.Maven33Launcher.getMavenExecutionRequest(Maven33Launcher.java:150)
        at org.jvnet.hudson.maven3.launcher.Maven33Launcher.main(Maven33Launcher.java:127)
        ... 21 more
channel stopped
Reply | Threaded
Open this post in threaded view
|

Build failed in Jenkins: ActiveMQ-Java8-5.14.x #55

Apache Jenkins Server-2
See <https://builds.apache.org/job/ActiveMQ-Java8-5.14.x/55/display/redirect>

------------------------------------------
Started by user tabish
[EnvInject] - Loading node environment variables.
Building remotely on ubuntu-2 (ubuntu trusty) in workspace <https://builds.apache.org/job/ActiveMQ-Java8-5.14.x/ws/>
Cloning the remote Git repository
Cloning repository https://git-wip-us.apache.org/repos/asf/activemq.git
 > git init <https://builds.apache.org/job/ActiveMQ-Java8-5.14.x/ws/> # timeout=10
Fetching upstream changes from https://git-wip-us.apache.org/repos/asf/activemq.git
 > git --version # timeout=10
 > git fetch --tags --progress https://git-wip-us.apache.org/repos/asf/activemq.git +refs/heads/*:refs/remotes/origin/*
 > git config remote.origin.url https://git-wip-us.apache.org/repos/asf/activemq.git # timeout=10
 > git config --add remote.origin.fetch +refs/heads/*:refs/remotes/origin/* # timeout=10
 > git config remote.origin.url https://git-wip-us.apache.org/repos/asf/activemq.git # timeout=10
Fetching upstream changes from https://git-wip-us.apache.org/repos/asf/activemq.git
 > git fetch --tags --progress https://git-wip-us.apache.org/repos/asf/activemq.git +refs/heads/*:refs/remotes/origin/*
 > git rev-parse origin/activemq-5.14.x^{commit} # timeout=10
Checking out Revision e38ac94a27347c89dddcd30c7a3e6063a69308dd (origin/activemq-5.14.x)
 > git config core.sparsecheckout # timeout=10
 > git checkout -f e38ac94a27347c89dddcd30c7a3e6063a69308dd
 > git rev-list e38ac94a27347c89dddcd30c7a3e6063a69308dd # timeout=10
[locks-and-latches] Checking to see if we really have the locks
[locks-and-latches] Have all the locks, build can start
Parsing POMs
Established TCP socket on 44024
maven33-agent.jar already up to date
maven33-interceptor.jar already up to date
maven3-interceptor-commons.jar already up to date
[ActiveMQ-Java8-5.14.x] $ /home/jenkins/tools/java/latest1.8/bin/java -Xmx2048m -Xms1024m -cp /home/jenkins/jenkins-slave/maven33-agent.jar:/home/jenkins/tools/maven/latest3/boot/plexus-classworlds-2.5.2.jar:/home/jenkins/tools/maven/latest3/conf/logging jenkins.maven3.agent.Maven33Main /home/jenkins/tools/maven/latest3/ /home/jenkins/jenkins-slave/slave.jar /home/jenkins/jenkins-slave/maven33-interceptor.jar /home/jenkins/jenkins-slave/maven3-interceptor-commons.jar 44024
<===[JENKINS REMOTING CAPACITY]===>   channel started
Executing Maven:  -B -f <https://builds.apache.org/job/ActiveMQ-Java8-5.14.x/ws/pom.xml> -Dmaven.repo.local=/home/jenkins/jenkins-slave/maven-repositories/1 -fae -B -e -U clean install source:jar
[INFO] Error stacktraces are turned on.
java.lang.reflect.InvocationTargetException
        at sun.reflect.NativeMethodAccessorImpl.invoke0(Native Method)
        at sun.reflect.NativeMethodAccessorImpl.invoke(NativeMethodAccessorImpl.java:62)
        at sun.reflect.DelegatingMethodAccessorImpl.invoke(DelegatingMethodAccessorImpl.java:43)
        at java.lang.reflect.Method.invoke(Method.java:498)
        at org.codehaus.plexus.classworlds.launcher.Launcher.launchStandard(Launcher.java:330)
        at org.codehaus.plexus.classworlds.launcher.Launcher.launch(Launcher.java:238)
        at jenkins.maven3.agent.Maven33Main.launch(Maven33Main.java:176)
        at sun.reflect.NativeMethodAccessorImpl.invoke0(Native Method)
        at sun.reflect.NativeMethodAccessorImpl.invoke(NativeMethodAccessorImpl.java:62)
        at sun.reflect.DelegatingMethodAccessorImpl.invoke(DelegatingMethodAccessorImpl.java:43)
        at java.lang.reflect.Method.invoke(Method.java:498)
        at hudson.maven.Maven3Builder.call(Maven3Builder.java:139)
        at hudson.maven.Maven3Builder.call(Maven3Builder.java:70)
        at hudson.remoting.UserRequest.perform(UserRequest.java:153)
        at hudson.remoting.UserRequest.perform(UserRequest.java:50)
        at hudson.remoting.Request$2.run(Request.java:336)
        at hudson.remoting.InterceptingExecutorService$1.call(InterceptingExecutorService.java:68)
        at java.util.concurrent.FutureTask.run(FutureTask.java:266)
        at java.util.concurrent.ThreadPoolExecutor.runWorker(ThreadPoolExecutor.java:1142)
        at java.util.concurrent.ThreadPoolExecutor$Worker.run(ThreadPoolExecutor.java:617)
        at java.lang.Thread.run(Thread.java:745)
Caused by: java.lang.NoSuchFieldError: DEFAULT_USER_SETTINGS_FILE
        at org.apache.maven.cli.DefaultMavenExecutionRequestBuilder.settings(DefaultMavenExecutionRequestBuilder.java:658)
        at org.apache.maven.cli.DefaultMavenExecutionRequestBuilder.getMavenExecutionRequest(DefaultMavenExecutionRequestBuilder.java:149)
        at org.jvnet.hudson.maven3.launcher.Maven33Launcher.getMavenExecutionRequest(Maven33Launcher.java:150)
        at org.jvnet.hudson.maven3.launcher.Maven33Launcher.main(Maven33Launcher.java:127)
        ... 21 more
[locks-and-latches] Releasing all the locks
[locks-and-latches] All the locks released
ERROR: Failed to parse POMs
java.io.IOException: java.lang.reflect.InvocationTargetException
        at hudson.maven.Maven3Builder.call(Maven3Builder.java:179)
        at hudson.maven.Maven3Builder.call(Maven3Builder.java:70)
        at hudson.remoting.UserRequest.perform(UserRequest.java:153)
        at hudson.remoting.UserRequest.perform(UserRequest.java:50)
        at hudson.remoting.Request$2.run(Request.java:336)
        at hudson.remoting.InterceptingExecutorService$1.call(InterceptingExecutorService.java:68)
        at java.util.concurrent.FutureTask.run(FutureTask.java:266)
        at java.util.concurrent.ThreadPoolExecutor.runWorker(ThreadPoolExecutor.java:1142)
        at java.util.concurrent.ThreadPoolExecutor$Worker.run(ThreadPoolExecutor.java:617)
        at java.lang.Thread.run(Thread.java:745)
        at ......remote call to Channel to Maven [/home/jenkins/tools/java/latest1.8/bin/java, -Xmx2048m, -Xms1024m, -cp, /home/jenkins/jenkins-slave/maven33-agent.jar:/home/jenkins/tools/maven/latest3/boot/plexus-classworlds-2.5.2.jar:/home/jenkins/tools/maven/latest3/conf/logging, jenkins.maven3.agent.Maven33Main, /home/jenkins/tools/maven/latest3/, /home/jenkins/jenkins-slave/slave.jar, /home/jenkins/jenkins-slave/maven33-interceptor.jar, /home/jenkins/jenkins-slave/maven3-interceptor-commons.jar, 44024](Native Method)
        at hudson.remoting.Channel.attachCallSiteStackTrace(Channel.java:1545)
        at hudson.remoting.UserResponse.retrieve(UserRequest.java:253)
        at hudson.remoting.Channel.call(Channel.java:830)
        at hudson.maven.ProcessCache$MavenProcess.call(ProcessCache.java:161)
        at hudson.maven.MavenModuleSetBuild$MavenModuleSetBuildExecution.doRun(MavenModuleSetBuild.java:873)
        at hudson.model.AbstractBuild$AbstractBuildExecution.run(AbstractBuild.java:534)
        at hudson.model.Run.execute(Run.java:1728)
        at hudson.maven.MavenModuleSetBuild.run(MavenModuleSetBuild.java:544)
        at hudson.model.ResourceController.execute(ResourceController.java:98)
        at hudson.model.Executor.run(Executor.java:405)
Caused by: java.lang.reflect.InvocationTargetException
        at sun.reflect.NativeMethodAccessorImpl.invoke0(Native Method)
        at sun.reflect.NativeMethodAccessorImpl.invoke(NativeMethodAccessorImpl.java:62)
        at sun.reflect.DelegatingMethodAccessorImpl.invoke(DelegatingMethodAccessorImpl.java:43)
        at java.lang.reflect.Method.invoke(Method.java:498)
        at hudson.maven.Maven3Builder.call(Maven3Builder.java:139)
        at hudson.maven.Maven3Builder.call(Maven3Builder.java:70)
        at hudson.remoting.UserRequest.perform(UserRequest.java:153)
        at hudson.remoting.UserRequest.perform(UserRequest.java:50)
        at hudson.remoting.Request$2.run(Request.java:336)
        at hudson.remoting.InterceptingExecutorService$1.call(InterceptingExecutorService.java:68)
        at java.util.concurrent.FutureTask.run(FutureTask.java:266)
        at java.util.concurrent.ThreadPoolExecutor.runWorker(ThreadPoolExecutor.java:1142)
        at java.util.concurrent.ThreadPoolExecutor$Worker.run(ThreadPoolExecutor.java:617)
        at java.lang.Thread.run(Thread.java:745)
Caused by: java.lang.Exception: java.lang.reflect.InvocationTargetException
        at jenkins.maven3.agent.Maven33Main.launch(Maven33Main.java:179)
        ... 14 more
Caused by: java.lang.reflect.InvocationTargetException
        at sun.reflect.NativeMethodAccessorImpl.invoke0(Native Method)
        at sun.reflect.NativeMethodAccessorImpl.invoke(NativeMethodAccessorImpl.java:62)
        at sun.reflect.DelegatingMethodAccessorImpl.invoke(DelegatingMethodAccessorImpl.java:43)
        at java.lang.reflect.Method.invoke(Method.java:498)
        at org.codehaus.plexus.classworlds.launcher.Launcher.launchStandard(Launcher.java:330)
        at org.codehaus.plexus.classworlds.launcher.Launcher.launch(Launcher.java:238)
        at jenkins.maven3.agent.Maven33Main.launch(Maven33Main.java:176)
        ... 14 more
Caused by: java.lang.NoSuchFieldError: DEFAULT_USER_SETTINGS_FILE
        at org.apache.maven.cli.DefaultMavenExecutionRequestBuilder.settings(DefaultMavenExecutionRequestBuilder.java:658)
        at org.apache.maven.cli.DefaultMavenExecutionRequestBuilder.getMavenExecutionRequest(DefaultMavenExecutionRequestBuilder.java:149)
        at org.jvnet.hudson.maven3.launcher.Maven33Launcher.getMavenExecutionRequest(Maven33Launcher.java:150)
        at org.jvnet.hudson.maven3.launcher.Maven33Launcher.main(Maven33Launcher.java:127)
        ... 21 more
channel stopped
Reply | Threaded
Open this post in threaded view
|

Jenkins build is unstable: ActiveMQ-Java8-5.14.x #56

Apache Jenkins Server-2
Reply | Threaded
Open this post in threaded view
|

Build failed in Jenkins: ActiveMQ-Java8-5.14.x #57

Apache Jenkins Server-2
See <https://builds.apache.org/job/ActiveMQ-Java8-5.14.x/57/display/redirect?page=changes>

Changes:

[tabish121] AMQ-6699 Fix STOMP over WS not encoding header values

------------------------------------------
[...truncated 430.16 KB...]
[INFO]                                                                        
[INFO] ------------------------------------------------------------------------
[INFO] Skipping ActiveMQ :: Karaf Integration Tests
[INFO] This project has been banned from the build due to previous failures.
[INFO] ------------------------------------------------------------------------
[INFO]                                                                        
[INFO] ------------------------------------------------------------------------
[INFO] Skipping ActiveMQ :: Integration Test :: Spring 3.1
[INFO] This project has been banned from the build due to previous failures.
[INFO] ------------------------------------------------------------------------
[INFO]                                                                        
[INFO] ------------------------------------------------------------------------
[INFO] Skipping ActiveMQ :: Assembly
[INFO] This project has been banned from the build due to previous failures.
[INFO] ------------------------------------------------------------------------
[INFO] ------------------------------------------------------------------------
[INFO] Reactor Summary:
[INFO]
[INFO] ActiveMQ ........................................... SUCCESS [  9.301 s]
[INFO] ActiveMQ :: Openwire Generator ..................... SUCCESS [ 11.470 s]
[INFO] ActiveMQ :: Client ................................. SUCCESS [02:58 min]
[INFO] ActiveMQ :: Openwire Legacy Support ................ SUCCESS [ 12.833 s]
[INFO] ActiveMQ :: JAAS ................................... SUCCESS [ 27.996 s]
[INFO] ActiveMQ :: Broker ................................. SUCCESS [01:32 min]
[INFO] ActiveMQ :: KahaDB Store ........................... SUCCESS [03:50 min]
[INFO] ActiveMQ :: STOMP Protocol ......................... SUCCESS [12:41 min]
[INFO] ActiveMQ :: MQTT Protocol .......................... SUCCESS [22:10 min]
[INFO] ActiveMQ :: JDBC Store ............................. SUCCESS [  9.973 s]
[INFO] ActiveMQ :: LevelDB Store .......................... SUCCESS [05:36 min]
[INFO] ActiveMQ :: Generic JMS Pool ....................... SUCCESS [ 47.844 s]
[INFO] ActiveMQ :: Pool ................................... SUCCESS [ 10.151 s]
[INFO] ActiveMQ :: RA ..................................... SUCCESS [01:48 min]
[INFO] ActiveMQ :: Spring ................................. SUCCESS [01:01 min]
[INFO] ActiveMQ :: Console ................................ SUCCESS [ 13.078 s]
[INFO] ActiveMQ :: Partition Management ................... SUCCESS [ 22.522 s]
[INFO] ActiveMQ :: Runtime Configuration .................. SUCCESS [08:06 min]
[INFO] ActiveMQ :: Tooling ................................ SUCCESS [  2.822 s]
[INFO] ActiveMQ :: JUnit Rule ............................. SUCCESS [  6.848 s]
[INFO] ActiveMQ :: Unit Tests ............................. FAILURE [  02:16 h]
[INFO] ActiveMQ :: HTTP Protocol Support .................. SKIPPED
[INFO] ActiveMQ :: AMQP ................................... SKIPPED
[INFO] ActiveMQ :: Camel .................................. SKIPPED
[INFO] ActiveMQ :: All JAR bundle ......................... SKIPPED
[INFO] ActiveMQ :: Log4j Appender ......................... SUCCESS [ 11.252 s]
[INFO] ActiveMQ :: Apache Karaf ........................... SKIPPED
[INFO] ActiveMQ :: ConnectionFactory ...................... SUCCESS [  9.919 s]
[INFO] ActiveMQ :: RAR .................................... SKIPPED
[INFO] ActiveMQ :: Run Jar ................................ SUCCESS [  8.618 s]
[INFO] ActiveMQ :: Shiro .................................. SKIPPED
[INFO] ActiveMQ :: Memory Usage Test Plugin ............... SUCCESS [  6.596 s]
[INFO] ActiveMQ :: Performance Test Plugin ................ SUCCESS [ 12.391 s]
[INFO] ActiveMQ :: StartUp/Stop Plugin .................... SKIPPED
[INFO] ActiveMQ :: Web .................................... SKIPPED
[INFO] ActiveMQ :: OSGi bundle ............................ SKIPPED
[INFO] ActiveMQ :: Blueprint .............................. SUCCESS [  5.216 s]
[INFO] ActiveMQ :: Web Demo ............................... SKIPPED
[INFO] ActiveMQ :: Web Console ............................ SKIPPED
[INFO] ActiveMQ :: Karaf Integration Tests ................ SKIPPED
[INFO] ActiveMQ :: Integration Test :: Spring 3.1 ......... SKIPPED
[INFO] ActiveMQ :: Assembly ............................... SKIPPED
[INFO] ------------------------------------------------------------------------
[INFO] BUILD FAILURE
[INFO] ------------------------------------------------------------------------
[INFO] Total time: 03:23 h
[INFO] Finished at: 2017-06-15T13:05:02+00:00
[INFO] Final Memory: 145M/1404M
[INFO] ------------------------------------------------------------------------
Waiting for Jenkins to finish collecting data
[ERROR] Failed to execute goal org.apache.maven.plugins:maven-surefire-plugin:2.16:test (default-test) on project activemq-unit-tests: ExecutionException; nested exception is java.util.concurrent.ExecutionException: java.lang.RuntimeException: The forked VM terminated without saying properly goodbye. VM crash or System.exit called ?
[ERROR] Command was/bin/sh -c cd <https://builds.apache.org/job/ActiveMQ-Java8-5.14.x/ws/activemq-unit-tests> && /usr/local/asfpackages/java/jdk1.8.0_131/jre/bin/java -Xmx512m -jar <https://builds.apache.org/job/ActiveMQ-Java8-5.14.x/ws/activemq-unit-tests/target/surefire/surefirebooter6392812301721426437.jar> <https://builds.apache.org/job/ActiveMQ-Java8-5.14.x/ws/activemq-unit-tests/target/surefire/surefire4432921407234783292tmp> <https://builds.apache.org/job/ActiveMQ-Java8-5.14.x/ws/activemq-unit-tests/target/surefire/surefire_4053730388934390152433tmp>
[ERROR] -> [Help 1]
org.apache.maven.lifecycle.LifecycleExecutionException: Failed to execute goal org.apache.maven.plugins:maven-surefire-plugin:2.16:test (default-test) on project activemq-unit-tests: ExecutionException; nested exception is java.util.concurrent.ExecutionException: java.lang.RuntimeException: The forked VM terminated without saying properly goodbye. VM crash or System.exit called ?
Command was/bin/sh -c cd <https://builds.apache.org/job/ActiveMQ-Java8-5.14.x/ws/activemq-unit-tests> && /usr/local/asfpackages/java/jdk1.8.0_131/jre/bin/java -Xmx512m -jar <https://builds.apache.org/job/ActiveMQ-Java8-5.14.x/ws/activemq-unit-tests/target/surefire/surefirebooter6392812301721426437.jar> <https://builds.apache.org/job/ActiveMQ-Java8-5.14.x/ws/activemq-unit-tests/target/surefire/surefire4432921407234783292tmp> <https://builds.apache.org/job/ActiveMQ-Java8-5.14.x/ws/activemq-unit-tests/target/surefire/surefire_4053730388934390152433tmp>
        at org.apache.maven.lifecycle.internal.MojoExecutor.execute(MojoExecutor.java:212)
        at org.apache.maven.lifecycle.internal.MojoExecutor.execute(MojoExecutor.java:153)
        at org.apache.maven.lifecycle.internal.MojoExecutor.execute(MojoExecutor.java:145)
        at org.apache.maven.lifecycle.internal.LifecycleModuleBuilder.buildProject(LifecycleModuleBuilder.java:116)
        at org.apache.maven.lifecycle.internal.LifecycleModuleBuilder.buildProject(LifecycleModuleBuilder.java:80)
        at org.apache.maven.lifecycle.internal.builder.singlethreaded.SingleThreadedBuilder.build(SingleThreadedBuilder.java:51)
        at org.apache.maven.lifecycle.internal.LifecycleStarter.execute(LifecycleStarter.java:128)
        at org.apache.maven.DefaultMaven.doExecute(DefaultMaven.java:307)
        at org.apache.maven.DefaultMaven.doExecute(DefaultMaven.java:193)
        at org.apache.maven.DefaultMaven.execute(DefaultMaven.java:106)
        at org.jvnet.hudson.maven3.launcher.Maven33Launcher.main(Maven33Launcher.java:129)
        at sun.reflect.NativeMethodAccessorImpl.invoke0(Native Method)
        at sun.reflect.NativeMethodAccessorImpl.invoke(NativeMethodAccessorImpl.java:62)
        at sun.reflect.DelegatingMethodAccessorImpl.invoke(DelegatingMethodAccessorImpl.java:43)
        at java.lang.reflect.Method.invoke(Method.java:498)
        at org.codehaus.plexus.classworlds.launcher.Launcher.launchStandard(Launcher.java:330)
        at org.codehaus.plexus.classworlds.launcher.Launcher.launch(Launcher.java:238)
        at jenkins.maven3.agent.Maven33Main.launch(Maven33Main.java:176)
        at sun.reflect.NativeMethodAccessorImpl.invoke0(Native Method)
        at sun.reflect.NativeMethodAccessorImpl.invoke(NativeMethodAccessorImpl.java:62)
        at sun.reflect.DelegatingMethodAccessorImpl.invoke(DelegatingMethodAccessorImpl.java:43)
        at java.lang.reflect.Method.invoke(Method.java:498)
        at hudson.maven.Maven3Builder.call(Maven3Builder.java:139)
        at hudson.maven.Maven3Builder.call(Maven3Builder.java:70)
        at hudson.remoting.UserRequest.perform(UserRequest.java:153)
        at hudson.remoting.UserRequest.perform(UserRequest.java:50)
        at hudson.remoting.Request$2.run(Request.java:336)
        at hudson.remoting.InterceptingExecutorService$1.call(InterceptingExecutorService.java:68)
        at java.util.concurrent.FutureTask.run(FutureTask.java:266)
        at java.util.concurrent.ThreadPoolExecutor.runWorker(ThreadPoolExecutor.java:1142)
        at java.util.concurrent.ThreadPoolExecutor$Worker.run(ThreadPoolExecutor.java:617)
        at java.lang.Thread.run(Thread.java:748)
Caused by: org.apache.maven.plugin.MojoFailureException: ExecutionException; nested exception is java.util.concurrent.ExecutionException: java.lang.RuntimeException: The forked VM terminated without saying properly goodbye. VM crash or System.exit called ?
Command was/bin/sh -c cd <https://builds.apache.org/job/ActiveMQ-Java8-5.14.x/ws/activemq-unit-tests> && /usr/local/asfpackages/java/jdk1.8.0_131/jre/bin/java -Xmx512m -jar <https://builds.apache.org/job/ActiveMQ-Java8-5.14.x/ws/activemq-unit-tests/target/surefire/surefirebooter6392812301721426437.jar> <https://builds.apache.org/job/ActiveMQ-Java8-5.14.x/ws/activemq-unit-tests/target/surefire/surefire4432921407234783292tmp> <https://builds.apache.org/job/ActiveMQ-Java8-5.14.x/ws/activemq-unit-tests/target/surefire/surefire_4053730388934390152433tmp>
        at org.apache.maven.plugin.surefire.SurefirePlugin.assertNoException(SurefirePlugin.java:198)
        at org.apache.maven.plugin.surefire.SurefirePlugin.handleSummary(SurefirePlugin.java:188)
        at org.apache.maven.plugin.surefire.AbstractSurefireMojo.executeAfterPreconditionsChecked(AbstractSurefireMojo.java:852)
        at org.apache.maven.plugin.surefire.AbstractSurefireMojo.execute(AbstractSurefireMojo.java:720)
        at org.apache.maven.plugin.DefaultBuildPluginManager.executeMojo(DefaultBuildPluginManager.java:134)
        at org.apache.maven.lifecycle.internal.MojoExecutor.execute(MojoExecutor.java:207)
        ... 31 more
Caused by: org.apache.maven.surefire.booter.SurefireBooterForkException: ExecutionException; nested exception is java.util.concurrent.ExecutionException: java.lang.RuntimeException: The forked VM terminated without saying properly goodbye. VM crash or System.exit called ?
Command was/bin/sh -c cd <https://builds.apache.org/job/ActiveMQ-Java8-5.14.x/ws/activemq-unit-tests> && /usr/local/asfpackages/java/jdk1.8.0_131/jre/bin/java -Xmx512m -jar <https://builds.apache.org/job/ActiveMQ-Java8-5.14.x/ws/activemq-unit-tests/target/surefire/surefirebooter6392812301721426437.jar> <https://builds.apache.org/job/ActiveMQ-Java8-5.14.x/ws/activemq-unit-tests/target/surefire/surefire4432921407234783292tmp> <https://builds.apache.org/job/ActiveMQ-Java8-5.14.x/ws/activemq-unit-tests/target/surefire/surefire_4053730388934390152433tmp>
        at org.apache.maven.plugin.surefire.booterclient.ForkStarter.runSuitesForkPerTestSet(ForkStarter.java:316)
        at org.apache.maven.plugin.surefire.booterclient.ForkStarter.run(ForkStarter.java:169)
        at org.apache.maven.plugin.surefire.AbstractSurefireMojo.executeProvider(AbstractSurefireMojo.java:958)
        at org.apache.maven.plugin.surefire.AbstractSurefireMojo.executeAfterPreconditionsChecked(AbstractSurefireMojo.java:822)
        ... 34 more
Caused by: java.util.concurrent.ExecutionException: java.lang.RuntimeException: The forked VM terminated without saying properly goodbye. VM crash or System.exit called ?
Command was/bin/sh -c cd <https://builds.apache.org/job/ActiveMQ-Java8-5.14.x/ws/activemq-unit-tests> && /usr/local/asfpackages/java/jdk1.8.0_131/jre/bin/java -Xmx512m -jar <https://builds.apache.org/job/ActiveMQ-Java8-5.14.x/ws/activemq-unit-tests/target/surefire/surefirebooter6392812301721426437.jar> <https://builds.apache.org/job/ActiveMQ-Java8-5.14.x/ws/activemq-unit-tests/target/surefire/surefire4432921407234783292tmp> <https://builds.apache.org/job/ActiveMQ-Java8-5.14.x/ws/activemq-unit-tests/target/surefire/surefire_4053730388934390152433tmp>
        at java.util.concurrent.FutureTask.report(FutureTask.java:122)
        at java.util.concurrent.FutureTask.get(FutureTask.java:192)
        at org.apache.maven.plugin.surefire.booterclient.ForkStarter.runSuitesForkPerTestSet(ForkStarter.java:300)
        ... 37 more
Caused by: java.lang.RuntimeException: The forked VM terminated without saying properly goodbye. VM crash or System.exit called ?
Command was/bin/sh -c cd <https://builds.apache.org/job/ActiveMQ-Java8-5.14.x/ws/activemq-unit-tests> && /usr/local/asfpackages/java/jdk1.8.0_131/jre/bin/java -Xmx512m -jar <https://builds.apache.org/job/ActiveMQ-Java8-5.14.x/ws/activemq-unit-tests/target/surefire/surefirebooter6392812301721426437.jar> <https://builds.apache.org/job/ActiveMQ-Java8-5.14.x/ws/activemq-unit-tests/target/surefire/surefire4432921407234783292tmp> <https://builds.apache.org/job/ActiveMQ-Java8-5.14.x/ws/activemq-unit-tests/target/surefire/surefire_4053730388934390152433tmp>
        at org.apache.maven.plugin.surefire.booterclient.ForkStarter.fork(ForkStarter.java:485)
        at org.apache.maven.plugin.surefire.booterclient.ForkStarter.fork(ForkStarter.java:352)
        at org.apache.maven.plugin.surefire.booterclient.ForkStarter.access$300(ForkStarter.java:85)
        at org.apache.maven.plugin.surefire.booterclient.ForkStarter$2.call(ForkStarter.java:288)
        at org.apache.maven.plugin.surefire.booterclient.ForkStarter$2.call(ForkStarter.java:283)
        ... 4 more
[ERROR]
[ERROR] Re-run Maven using the -X switch to enable full debug logging.
[ERROR]
[ERROR] For more information about the errors and possible solutions, please read the following articles:
[ERROR] [Help 1] http://cwiki.apache.org/confluence/display/MAVEN/MojoFailureException
[ERROR]
[ERROR] After correcting the problems, you can resume the build with the command
[ERROR]   mvn <goals> -rf :activemq-unit-tests
[JENKINS] Archiving <https://builds.apache.org/job/ActiveMQ-Java8-5.14.x/ws/activemq-kahadb-store/pom.xml> to org.apache.activemq/activemq-kahadb-store/5.14.6-SNAPSHOT/activemq-kahadb-store-5.14.6-SNAPSHOT.pom
[JENKINS] Archiving <https://builds.apache.org/job/ActiveMQ-Java8-5.14.x/ws/activemq-kahadb-store/target/activemq-kahadb-store-5.14.6-SNAPSHOT.jar> to org.apache.activemq/activemq-kahadb-store/5.14.6-SNAPSHOT/activemq-kahadb-store-5.14.6-SNAPSHOT.jar
[JENKINS] Archiving <https://builds.apache.org/job/ActiveMQ-Java8-5.14.x/ws/activemq-kahadb-store/target/activemq-kahadb-store-5.14.6-SNAPSHOT-sources.jar> to org.apache.activemq/activemq-kahadb-store/5.14.6-SNAPSHOT/activemq-kahadb-store-5.14.6-SNAPSHOT-sources.jar
[JENKINS] Archiving <https://builds.apache.org/job/ActiveMQ-Java8-5.14.x/ws/activemq-osgi/pom.xml> to org.apache.activemq/activemq-osgi/5.14.6-SNAPSHOT/activemq-osgi-5.14.6-SNAPSHOT.pom
[JENKINS] Archiving <https://builds.apache.org/job/ActiveMQ-Java8-5.14.x/ws/activemq-unit-tests/pom.xml> to org.apache.activemq/activemq-unit-tests/5.14.6-SNAPSHOT/activemq-unit-tests-5.14.6-SNAPSHOT.pom
Compressed 71.40 KB of artifacts by 44.8% relative to #56
[JENKINS] Archiving <https://builds.apache.org/job/ActiveMQ-Java8-5.14.x/ws/activemq-openwire-legacy/pom.xml> to org.apache.activemq/activemq-openwire-legacy/5.14.6-SNAPSHOT/activemq-openwire-legacy-5.14.6-SNAPSHOT.pom
[JENKINS] Archiving <https://builds.apache.org/job/ActiveMQ-Java8-5.14.x/ws/activemq-openwire-legacy/target/activemq-openwire-legacy-5.14.6-SNAPSHOT.jar> to org.apache.activemq/activemq-openwire-legacy/5.14.6-SNAPSHOT/activemq-openwire-legacy-5.14.6-SNAPSHOT.jar
[JENKINS] Archiving <https://builds.apache.org/job/ActiveMQ-Java8-5.14.x/ws/activemq-openwire-legacy/target/activemq-openwire-legacy-5.14.6-SNAPSHOT-sources.jar> to org.apache.activemq/activemq-openwire-legacy/5.14.6-SNAPSHOT/activemq-openwire-legacy-5.14.6-SNAPSHOT-sources.jar
[JENKINS] Archiving <https://builds.apache.org/job/ActiveMQ-Java8-5.14.x/ws/activemq-karaf-itest/pom.xml> to org.apache.activemq/activemq-karaf-itest/5.14.6-SNAPSHOT/activemq-karaf-itest-5.14.6-SNAPSHOT.pom
[JENKINS] Archiving <https://builds.apache.org/job/ActiveMQ-Java8-5.14.x/ws/activemq-rar/pom.xml> to org.apache.activemq/activemq-rar/5.14.6-SNAPSHOT/activemq-rar-5.14.6-SNAPSHOT.pom
[JENKINS] Archiving <https://builds.apache.org/job/ActiveMQ-Java8-5.14.x/ws/activemq-http/pom.xml> to org.apache.activemq/activemq-http/5.14.6-SNAPSHOT/activemq-http-5.14.6-SNAPSHOT.pom
[JENKINS] Archiving <https://builds.apache.org/job/ActiveMQ-Java8-5.14.x/ws/activemq-amqp/pom.xml> to org.apache.activemq/activemq-amqp/5.14.6-SNAPSHOT/activemq-amqp-5.14.6-SNAPSHOT.pom
[JENKINS] Archiving <https://builds.apache.org/job/ActiveMQ-Java8-5.14.x/ws/activemq-client/pom.xml> to org.apache.activemq/activemq-client/5.14.6-SNAPSHOT/activemq-client-5.14.6-SNAPSHOT.pom
[JENKINS] Archiving <https://builds.apache.org/job/ActiveMQ-Java8-5.14.x/ws/activemq-client/target/activemq-client-5.14.6-SNAPSHOT.jar> to org.apache.activemq/activemq-client/5.14.6-SNAPSHOT/activemq-client-5.14.6-SNAPSHOT.jar
[JENKINS] Archiving <https://builds.apache.org/job/ActiveMQ-Java8-5.14.x/ws/activemq-client/target/activemq-client-5.14.6-SNAPSHOT-sources.jar> to org.apache.activemq/activemq-client/5.14.6-SNAPSHOT/activemq-client-5.14.6-SNAPSHOT-sources.jar
[JENKINS] Archiving <https://builds.apache.org/job/ActiveMQ-Java8-5.14.x/ws/activemq-blueprint/pom.xml> to org.apache.activemq/activemq-blueprint/5.14.6-SNAPSHOT/activemq-blueprint-5.14.6-SNAPSHOT.pom
[JENKINS] Archiving <https://builds.apache.org/job/ActiveMQ-Java8-5.14.x/ws/activemq-blueprint/target/activemq-blueprint-5.14.6-SNAPSHOT.jar> to org.apache.activemq/activemq-blueprint/5.14.6-SNAPSHOT/activemq-blueprint-5.14.6-SNAPSHOT.jar
[JENKINS] Archiving <https://builds.apache.org/job/ActiveMQ-Java8-5.14.x/ws/activemq-blueprint/target/activemq-blueprint-5.14.6-SNAPSHOT-sources.jar> to org.apache.activemq/activemq-blueprint/5.14.6-SNAPSHOT/activemq-blueprint-5.14.6-SNAPSHOT-sources.jar
[JENKINS] Archiving <https://builds.apache.org/job/ActiveMQ-Java8-5.14.x/ws/activemq-tooling/activemq-junit/pom.xml> to org.apache.activemq.tooling/activemq-junit/5.14.6-SNAPSHOT/activemq-junit-5.14.6-SNAPSHOT.pom
[JENKINS] Archiving <https://builds.apache.org/job/ActiveMQ-Java8-5.14.x/ws/activemq-tooling/activemq-junit/target/activemq-junit-5.14.6-SNAPSHOT.jar> to org.apache.activemq.tooling/activemq-junit/5.14.6-SNAPSHOT/activemq-junit-5.14.6-SNAPSHOT.jar
[JENKINS] Archiving <https://builds.apache.org/job/ActiveMQ-Java8-5.14.x/ws/activemq-tooling/activemq-junit/target/activemq-junit-5.14.6-SNAPSHOT-sources.jar> to org.apache.activemq.tooling/activemq-junit/5.14.6-SNAPSHOT/activemq-junit-5.14.6-SNAPSHOT-sources.jar
[JENKINS] Archiving <https://builds.apache.org/job/ActiveMQ-Java8-5.14.x/ws/activemq-tooling/pom.xml> to org.apache.activemq.tooling/activemq-tooling/5.14.6-SNAPSHOT/activemq-tooling-5.14.6-SNAPSHOT.pom
[JENKINS] Archiving <https://builds.apache.org/job/ActiveMQ-Java8-5.14.x/ws/activemq-jms-pool/pom.xml> to org.apache.activemq/activemq-jms-pool/5.14.6-SNAPSHOT/activemq-jms-pool-5.14.6-SNAPSHOT.pom
[JENKINS] Archiving <https://builds.apache.org/job/ActiveMQ-Java8-5.14.x/ws/activemq-jms-pool/target/activemq-jms-pool-5.14.6-SNAPSHOT.jar> to org.apache.activemq/activemq-jms-pool/5.14.6-SNAPSHOT/activemq-jms-pool-5.14.6-SNAPSHOT.jar
[JENKINS] Archiving <https://builds.apache.org/job/ActiveMQ-Java8-5.14.x/ws/activemq-jms-pool/target/activemq-jms-pool-5.14.6-SNAPSHOT-sources.jar> to org.apache.activemq/activemq-jms-pool/5.14.6-SNAPSHOT/activemq-jms-pool-5.14.6-SNAPSHOT-sources.jar
[JENKINS] Archiving <https://builds.apache.org/job/ActiveMQ-Java8-5.14.x/ws/activemq-pool/pom.xml> to org.apache.activemq/activemq-pool/5.14.6-SNAPSHOT/activemq-pool-5.14.6-SNAPSHOT.pom
[JENKINS] Archiving <https://builds.apache.org/job/ActiveMQ-Java8-5.14.x/ws/activemq-pool/target/activemq-pool-5.14.6-SNAPSHOT.jar> to org.apache.activemq/activemq-pool/5.14.6-SNAPSHOT/activemq-pool-5.14.6-SNAPSHOT.jar
[JENKINS] Archiving <https://builds.apache.org/job/ActiveMQ-Java8-5.14.x/ws/activemq-pool/target/activemq-pool-5.14.6-SNAPSHOT-sources.jar> to org.apache.activemq/activemq-pool/5.14.6-SNAPSHOT/activemq-pool-5.14.6-SNAPSHOT-sources.jar
[JENKINS] Archiving <https://builds.apache.org/job/ActiveMQ-Java8-5.14.x/ws/activemq-jdbc-store/pom.xml> to org.apache.activemq/activemq-jdbc-store/5.14.6-SNAPSHOT/activemq-jdbc-store-5.14.6-SNAPSHOT.pom
[JENKINS] Archiving <https://builds.apache.org/job/ActiveMQ-Java8-5.14.x/ws/activemq-jdbc-store/target/activemq-jdbc-store-5.14.6-SNAPSHOT.jar> to org.apache.activemq/activemq-jdbc-store/5.14.6-SNAPSHOT/activemq-jdbc-store-5.14.6-SNAPSHOT.jar
[JENKINS] Archiving <https://builds.apache.org/job/ActiveMQ-Java8-5.14.x/ws/activemq-jdbc-store/target/activemq-jdbc-store-5.14.6-SNAPSHOT-sources.jar> to org.apache.activemq/activemq-jdbc-store/5.14.6-SNAPSHOT/activemq-jdbc-store-5.14.6-SNAPSHOT-sources.jar
[JENKINS] Archiving <https://builds.apache.org/job/ActiveMQ-Java8-5.14.x/ws/activemq-camel/pom.xml> to org.apache.activemq/activemq-camel/5.14.6-SNAPSHOT/activemq-camel-5.14.6-SNAPSHOT.pom
[JENKINS] Archiving <https://builds.apache.org/job/ActiveMQ-Java8-5.14.x/ws/activemq-runtime-config/pom.xml> to org.apache.activemq/activemq-runtime-config/5.14.6-SNAPSHOT/activemq-runtime-config-5.14.6-SNAPSHOT.pom
[JENKINS] Archiving <https://builds.apache.org/job/ActiveMQ-Java8-5.14.x/ws/activemq-runtime-config/target/activemq-runtime-config-5.14.6-SNAPSHOT.jar> to org.apache.activemq/activemq-runtime-config/5.14.6-SNAPSHOT/activemq-runtime-config-5.14.6-SNAPSHOT.jar
[JENKINS] Archiving <https://builds.apache.org/job/ActiveMQ-Java8-5.14.x/ws/activemq-runtime-config/target/activemq-runtime-config-5.14.6-SNAPSHOT-sources.jar> to org.apache.activemq/activemq-runtime-config/5.14.6-SNAPSHOT/activemq-runtime-config-5.14.6-SNAPSHOT-sources.jar
[JENKINS] Archiving <https://builds.apache.org/job/ActiveMQ-Java8-5.14.x/ws/pom.xml> to org.apache.activemq/activemq-parent/5.14.6-SNAPSHOT/activemq-parent-5.14.6-SNAPSHOT.pom
Compressed 59.92 KB of artifacts by 53.4% relative to #56
[JENKINS] Archiving <https://builds.apache.org/job/ActiveMQ-Java8-5.14.x/ws/activemq-stomp/pom.xml> to org.apache.activemq/activemq-stomp/5.14.6-SNAPSHOT/activemq-stomp-5.14.6-SNAPSHOT.pom
[JENKINS] Archiving <https://builds.apache.org/job/ActiveMQ-Java8-5.14.x/ws/activemq-stomp/target/activemq-stomp-5.14.6-SNAPSHOT.jar> to org.apache.activemq/activemq-stomp/5.14.6-SNAPSHOT/activemq-stomp-5.14.6-SNAPSHOT.jar
[JENKINS] Archiving <https://builds.apache.org/job/ActiveMQ-Java8-5.14.x/ws/activemq-stomp/target/activemq-stomp-5.14.6-SNAPSHOT-sources.jar> to org.apache.activemq/activemq-stomp/5.14.6-SNAPSHOT/activemq-stomp-5.14.6-SNAPSHOT-sources.jar
[JENKINS] Archiving <https://builds.apache.org/job/ActiveMQ-Java8-5.14.x/ws/activemq-openwire-generator/pom.xml> to org.apache.activemq/activemq-openwire-generator/5.14.6-SNAPSHOT/activemq-openwire-generator-5.14.6-SNAPSHOT.pom
[JENKINS] Archiving <https://builds.apache.org/job/ActiveMQ-Java8-5.14.x/ws/activemq-openwire-generator/target/activemq-openwire-generator-5.14.6-SNAPSHOT.jar> to org.apache.activemq/activemq-openwire-generator/5.14.6-SNAPSHOT/activemq-openwire-generator-5.14.6-SNAPSHOT.jar
[JENKINS] Archiving <https://builds.apache.org/job/ActiveMQ-Java8-5.14.x/ws/activemq-openwire-generator/target/activemq-openwire-generator-5.14.6-SNAPSHOT-sources.jar> to org.apache.activemq/activemq-openwire-generator/5.14.6-SNAPSHOT/activemq-openwire-generator-5.14.6-SNAPSHOT-sources.jar
[JENKINS] Archiving <https://builds.apache.org/job/ActiveMQ-Java8-5.14.x/ws/activemq-broker/pom.xml> to org.apache.activemq/activemq-broker/5.14.6-SNAPSHOT/activemq-broker-5.14.6-SNAPSHOT.pom
[JENKINS] Archiving <https://builds.apache.org/job/ActiveMQ-Java8-5.14.x/ws/activemq-broker/target/activemq-broker-5.14.6-SNAPSHOT.jar> to org.apache.activemq/activemq-broker/5.14.6-SNAPSHOT/activemq-broker-5.14.6-SNAPSHOT.jar
[JENKINS] Archiving <https://builds.apache.org/job/ActiveMQ-Java8-5.14.x/ws/activemq-broker/target/activemq-broker-5.14.6-SNAPSHOT-tests.jar> to org.apache.activemq/activemq-broker/5.14.6-SNAPSHOT/activemq-broker-5.14.6-SNAPSHOT-tests.jar
[JENKINS] Archiving <https://builds.apache.org/job/ActiveMQ-Java8-5.14.x/ws/activemq-broker/target/activemq-broker-5.14.6-SNAPSHOT-sources.jar> to org.apache.activemq/activemq-broker/5.14.6-SNAPSHOT/activemq-broker-5.14.6-SNAPSHOT-sources.jar
[JENKINS] Archiving <https://builds.apache.org/job/ActiveMQ-Java8-5.14.x/ws/activemq-web-demo/pom.xml> to org.apache.activemq/activemq-web-demo/5.14.6-SNAPSHOT/activemq-web-demo-5.14.6-SNAPSHOT.pom
[JENKINS] Archiving <https://builds.apache.org/job/ActiveMQ-Java8-5.14.x/ws/activemq-mqtt/pom.xml> to org.apache.activemq/activemq-mqtt/5.14.6-SNAPSHOT/activemq-mqtt-5.14.6-SNAPSHOT.pom
[JENKINS] Archiving <https://builds.apache.org/job/ActiveMQ-Java8-5.14.x/ws/activemq-mqtt/target/activemq-mqtt-5.14.6-SNAPSHOT.jar> to org.apache.activemq/activemq-mqtt/5.14.6-SNAPSHOT/activemq-mqtt-5.14.6-SNAPSHOT.jar
[JENKINS] Archiving <https://builds.apache.org/job/ActiveMQ-Java8-5.14.x/ws/activemq-mqtt/target/activemq-mqtt-5.14.6-SNAPSHOT-sources.jar> to org.apache.activemq/activemq-mqtt/5.14.6-SNAPSHOT/activemq-mqtt-5.14.6-SNAPSHOT-sources.jar
[JENKINS] Archiving <https://builds.apache.org/job/ActiveMQ-Java8-5.14.x/ws/activemq-shiro/pom.xml> to org.apache.activemq/activemq-shiro/5.14.6-SNAPSHOT/activemq-shiro-5.14.6-SNAPSHOT.pom
[JENKINS] Archiving <https://builds.apache.org/job/ActiveMQ-Java8-5.14.x/ws/activemq-tooling/activemq-perf-maven-plugin/pom.xml> to org.apache.activemq.tooling/activemq-perf-maven-plugin/5.14.6-SNAPSHOT/activemq-perf-maven-plugin-5.14.6-SNAPSHOT.pom
[JENKINS] Archiving <https://builds.apache.org/job/ActiveMQ-Java8-5.14.x/ws/activemq-tooling/activemq-perf-maven-plugin/target/activemq-perf-maven-plugin-5.14.6-SNAPSHOT.jar> to org.apache.activemq.tooling/activemq-perf-maven-plugin/5.14.6-SNAPSHOT/activemq-perf-maven-plugin-5.14.6-SNAPSHOT.jar
[JENKINS] Archiving <https://builds.apache.org/job/ActiveMQ-Java8-5.14.x/ws/activemq-tooling/activemq-perf-maven-plugin/target/activemq-perf-maven-plugin-5.14.6-SNAPSHOT-sources.jar> to org.apache.activemq.tooling/activemq-perf-maven-plugin/5.14.6-SNAPSHOT/activemq-perf-maven-plugin-5.14.6-SNAPSHOT-sources.jar
[JENKINS] Archiving <https://builds.apache.org/job/ActiveMQ-Java8-5.14.x/ws/activemq-run/dependency-reduced-pom.xml> to org.apache.activemq/activemq-run/5.14.6-SNAPSHOT/activemq-run-5.14.6-SNAPSHOT.pom
[JENKINS] Archiving <https://builds.apache.org/job/ActiveMQ-Java8-5.14.x/ws/activemq-run/target/activemq-run-5.14.6-SNAPSHOT.jar> to org.apache.activemq/activemq-run/5.14.6-SNAPSHOT/activemq-run-5.14.6-SNAPSHOT.jar
[JENKINS] Archiving <https://builds.apache.org/job/ActiveMQ-Java8-5.14.x/ws/activemq-run/target/activemq-run-5.14.6-SNAPSHOT-sources.jar> to org.apache.activemq/activemq-run/5.14.6-SNAPSHOT/activemq-run-5.14.6-SNAPSHOT-sources.jar
[JENKINS] Archiving <https://builds.apache.org/job/ActiveMQ-Java8-5.14.x/ws/activemq-tooling/activemq-maven-plugin/pom.xml> to org.apache.activemq.tooling/activemq-maven-plugin/5.14.6-SNAPSHOT/activemq-maven-plugin-5.14.6-SNAPSHOT.pom
[JENKINS] Archiving <https://builds.apache.org/job/ActiveMQ-Java8-5.14.x/ws/activemq-karaf/pom.xml> to org.apache.activemq/activemq-karaf/5.14.6-SNAPSHOT/activemq-karaf-5.14.6-SNAPSHOT.pom
[JENKINS] Archiving <https://builds.apache.org/job/ActiveMQ-Java8-5.14.x/ws/activemq-web-console/pom.xml> to org.apache.activemq/activemq-web-console/5.14.6-SNAPSHOT/activemq-web-console-5.14.6-SNAPSHOT.pom
[JENKINS] Archiving <https://builds.apache.org/job/ActiveMQ-Java8-5.14.x/ws/activemq-jaas/pom.xml> to org.apache.activemq/activemq-jaas/5.14.6-SNAPSHOT/activemq-jaas-5.14.6-SNAPSHOT.pom
[JENKINS] Archiving <https://builds.apache.org/job/ActiveMQ-Java8-5.14.x/ws/activemq-jaas/target/activemq-jaas-5.14.6-SNAPSHOT.jar> to org.apache.activemq/activemq-jaas/5.14.6-SNAPSHOT/activemq-jaas-5.14.6-SNAPSHOT.jar
[JENKINS] Archiving <https://builds.apache.org/job/ActiveMQ-Java8-5.14.x/ws/activemq-jaas/target/activemq-jaas-5.14.6-SNAPSHOT-sources.jar> to org.apache.activemq/activemq-jaas/5.14.6-SNAPSHOT/activemq-jaas-5.14.6-SNAPSHOT-sources.jar
[JENKINS] Archiving <https://builds.apache.org/job/ActiveMQ-Java8-5.14.x/ws/activemq-itests-spring31/pom.xml> to org.apache.activemq/activemq-itests-spring31/5.14.6-SNAPSHOT/activemq-itests-spring31-5.14.6-SNAPSHOT.pom
[JENKINS] Archiving <https://builds.apache.org/job/ActiveMQ-Java8-5.14.x/ws/activemq-tooling/activemq-memtest-maven-plugin/pom.xml> to org.apache.activemq.tooling/activemq-memtest-maven-plugin/5.14.6-SNAPSHOT/activemq-memtest-maven-plugin-5.14.6-SNAPSHOT.pom
[JENKINS] Archiving <https://builds.apache.org/job/ActiveMQ-Java8-5.14.x/ws/activemq-tooling/activemq-memtest-maven-plugin/target/activemq-memtest-maven-plugin-5.14.6-SNAPSHOT.jar> to org.apache.activemq.tooling/activemq-memtest-maven-plugin/5.14.6-SNAPSHOT/activemq-memtest-maven-plugin-5.14.6-SNAPSHOT.jar
[JENKINS] Archiving <https://builds.apache.org/job/ActiveMQ-Java8-5.14.x/ws/activemq-tooling/activemq-memtest-maven-plugin/target/activemq-memtest-maven-plugin-5.14.6-SNAPSHOT-sources.jar> to org.apache.activemq.tooling/activemq-memtest-maven-plugin/5.14.6-SNAPSHOT/activemq-memtest-maven-plugin-5.14.6-SNAPSHOT-sources.jar
[JENKINS] Archiving <https://builds.apache.org/job/ActiveMQ-Java8-5.14.x/ws/activemq-ra/pom.xml> to org.apache.activemq/activemq-ra/5.14.6-SNAPSHOT/activemq-ra-5.14.6-SNAPSHOT.pom
[JENKINS] Archiving <https://builds.apache.org/job/ActiveMQ-Java8-5.14.x/ws/activemq-ra/target/activemq-ra-5.14.6-SNAPSHOT.jar> to org.apache.activemq/activemq-ra/5.14.6-SNAPSHOT/activemq-ra-5.14.6-SNAPSHOT.jar
[JENKINS] Archiving <https://builds.apache.org/job/ActiveMQ-Java8-5.14.x/ws/activemq-ra/target/xbean/activemq-ra.xsd> to org.apache.activemq/activemq-ra/5.14.6-SNAPSHOT/activemq-ra-5.14.6-SNAPSHOT.xsd
[JENKINS] Archiving <https://builds.apache.org/job/ActiveMQ-Java8-5.14.x/ws/activemq-ra/target/xbean/activemq-ra.xsd.html> to org.apache.activemq/activemq-ra/5.14.6-SNAPSHOT/activemq-ra-5.14.6-SNAPSHOT-schema.html
[JENKINS] Archiving <https://builds.apache.org/job/ActiveMQ-Java8-5.14.x/ws/activemq-ra/target/xbean/activemq-ra.xsd.html> to org.apache.activemq/activemq-ra/5.14.6-SNAPSHOT/activemq-ra-5.14.6-SNAPSHOT.xsd.html
[JENKINS] Archiving <https://builds.apache.org/job/ActiveMQ-Java8-5.14.x/ws/activemq-ra/target/activemq-ra-5.14.6-SNAPSHOT-sources.jar> to org.apache.activemq/activemq-ra/5.14.6-SNAPSHOT/activemq-ra-5.14.6-SNAPSHOT-sources.jar
[JENKINS] Archiving <https://builds.apache.org/job/ActiveMQ-Java8-5.14.x/ws/activemq-partition/pom.xml> to org.apache.activemq/activemq-partition/5.14.6-SNAPSHOT/activemq-partition-5.14.6-SNAPSHOT.pom
[JENKINS] Archiving <https://builds.apache.org/job/ActiveMQ-Java8-5.14.x/ws/activemq-partition/target/activemq-partition-5.14.6-SNAPSHOT.jar> to org.apache.activemq/activemq-partition/5.14.6-SNAPSHOT/activemq-partition-5.14.6-SNAPSHOT.jar
[JENKINS] Archiving <https://builds.apache.org/job/ActiveMQ-Java8-5.14.x/ws/activemq-partition/target/activemq-partition-5.14.6-SNAPSHOT-sources.jar> to org.apache.activemq/activemq-partition/5.14.6-SNAPSHOT/activemq-partition-5.14.6-SNAPSHOT-sources.jar
[JENKINS] Archiving <https://builds.apache.org/job/ActiveMQ-Java8-5.14.x/ws/activemq-all/pom.xml> to org.apache.activemq/activemq-all/5.14.6-SNAPSHOT/activemq-all-5.14.6-SNAPSHOT.pom
[JENKINS] Archiving <https://builds.apache.org/job/ActiveMQ-Java8-5.14.x/ws/assembly/pom.xml> to org.apache.activemq/apache-activemq/5.14.6-SNAPSHOT/apache-activemq-5.14.6-SNAPSHOT.pom
[JENKINS] Archiving <https://builds.apache.org/job/ActiveMQ-Java8-5.14.x/ws/activemq-console/pom.xml> to org.apache.activemq/activemq-console/5.14.6-SNAPSHOT/activemq-console-5.14.6-SNAPSHOT.pom
[JENKINS] Archiving <https://builds.apache.org/job/ActiveMQ-Java8-5.14.x/ws/activemq-console/target/activemq-console-5.14.6-SNAPSHOT.jar> to org.apache.activemq/activemq-console/5.14.6-SNAPSHOT/activemq-console-5.14.6-SNAPSHOT.jar
[JENKINS] Archiving <https://builds.apache.org/job/ActiveMQ-Java8-5.14.x/ws/activemq-console/target/activemq-console-5.14.6-SNAPSHOT-sources.jar> to org.apache.activemq/activemq-console/5.14.6-SNAPSHOT/activemq-console-5.14.6-SNAPSHOT-sources.jar
[JENKINS] Archiving <https://builds.apache.org/job/ActiveMQ-Java8-5.14.x/ws/activemq-spring/pom.xml> to org.apache.activemq/activemq-spring/5.14.6-SNAPSHOT/activemq-spring-5.14.6-SNAPSHOT.pom
[JENKINS] Archiving <https://builds.apache.org/job/ActiveMQ-Java8-5.14.x/ws/activemq-spring/target/activemq-spring-5.14.6-SNAPSHOT.jar> to org.apache.activemq/activemq-spring/5.14.6-SNAPSHOT/activemq-spring-5.14.6-SNAPSHOT.jar
[JENKINS] Archiving <https://builds.apache.org/job/ActiveMQ-Java8-5.14.x/ws/activemq-spring/target/classes/activemq.xsd> to org.apache.activemq/activemq-spring/5.14.6-SNAPSHOT/activemq-spring-5.14.6-SNAPSHOT.xsd
[JENKINS] Archiving <https://builds.apache.org/job/ActiveMQ-Java8-5.14.x/ws/activemq-spring/target/classes/activemq.xsd.html> to org.apache.activemq/activemq-spring/5.14.6-SNAPSHOT/activemq-spring-5.14.6-SNAPSHOT-schema.html
[JENKINS] Archiving <https://builds.apache.org/job/ActiveMQ-Java8-5.14.x/ws/activemq-spring/target/activemq-spring-5.14.6-SNAPSHOT-sources.jar> to org.apache.activemq/activemq-spring/5.14.6-SNAPSHOT/activemq-spring-5.14.6-SNAPSHOT-sources.jar
Compressed 1.06 MB of artifacts by 61.9% relative to #56
[JENKINS] Archiving <https://builds.apache.org/job/ActiveMQ-Java8-5.14.x/ws/activemq-cf/pom.xml> to org.apache.activemq/activemq-cf/5.14.6-SNAPSHOT/activemq-cf-5.14.6-SNAPSHOT.pom
[JENKINS] Archiving <https://builds.apache.org/job/ActiveMQ-Java8-5.14.x/ws/activemq-cf/target/activemq-cf-5.14.6-SNAPSHOT.jar> to org.apache.activemq/activemq-cf/5.14.6-SNAPSHOT/activemq-cf-5.14.6-SNAPSHOT.jar
[JENKINS] Archiving <https://builds.apache.org/job/ActiveMQ-Java8-5.14.x/ws/activemq-cf/target/activemq-cf-5.14.6-SNAPSHOT-sources.jar> to org.apache.activemq/activemq-cf/5.14.6-SNAPSHOT/activemq-cf-5.14.6-SNAPSHOT-sources.jar
[JENKINS] Archiving <https://builds.apache.org/job/ActiveMQ-Java8-5.14.x/ws/activemq-leveldb-store/pom.xml> to org.apache.activemq/activemq-leveldb-store/5.14.6-SNAPSHOT/activemq-leveldb-store-5.14.6-SNAPSHOT.pom
[JENKINS] Archiving <https://builds.apache.org/job/ActiveMQ-Java8-5.14.x/ws/activemq-leveldb-store/target/activemq-leveldb-store-5.14.6-SNAPSHOT.jar> to org.apache.activemq/activemq-leveldb-store/5.14.6-SNAPSHOT/activemq-leveldb-store-5.14.6-SNAPSHOT.jar
[JENKINS] Archiving <https://builds.apache.org/job/ActiveMQ-Java8-5.14.x/ws/activemq-leveldb-store/target/activemq-leveldb-store-5.14.6-SNAPSHOT-sources.jar> to org.apache.activemq/activemq-leveldb-store/5.14.6-SNAPSHOT/activemq-leveldb-store-5.14.6-SNAPSHOT-sources.jar
[JENKINS] Archiving <https://builds.apache.org/job/ActiveMQ-Java8-5.14.x/ws/activemq-web/pom.xml> to org.apache.activemq/activemq-web/5.14.6-SNAPSHOT/activemq-web-5.14.6-SNAPSHOT.pom
[JENKINS] Archiving <https://builds.apache.org/job/ActiveMQ-Java8-5.14.x/ws/activemq-log4j-appender/pom.xml> to org.apache.activemq/activemq-log4j-appender/5.14.6-SNAPSHOT/activemq-log4j-appender-5.14.6-SNAPSHOT.pom
[JENKINS] Archiving <https://builds.apache.org/job/ActiveMQ-Java8-5.14.x/ws/activemq-log4j-appender/target/activemq-log4j-appender-5.14.6-SNAPSHOT.jar> to org.apache.activemq/activemq-log4j-appender/5.14.6-SNAPSHOT/activemq-log4j-appender-5.14.6-SNAPSHOT.jar
[JENKINS] Archiving <https://builds.apache.org/job/ActiveMQ-Java8-5.14.x/ws/activemq-log4j-appender/target/activemq-log4j-appender-5.14.6-SNAPSHOT-sources.jar> to org.apache.activemq/activemq-log4j-appender/5.14.6-SNAPSHOT/activemq-log4j-appender-5.14.6-SNAPSHOT-sources.jar
Sending e-mails to: [hidden email]
Sending e-mails to: [hidden email]
Sending e-mails to: [hidden email]
Sending e-mails to: [hidden email]
[locks-and-latches] Releasing all the locks
[locks-and-latches] All the locks released
channel stopped
Reply | Threaded
Open this post in threaded view
|

Jenkins build is unstable: ActiveMQ-Java8-5.14.x #58

Apache Jenkins Server-2
Reply | Threaded
Open this post in threaded view
|

Jenkins build is still unstable: ActiveMQ-Java8-5.14.x #59

Apache Jenkins Server-2
Reply | Threaded
Open this post in threaded view
|

Jenkins build is still unstable: ActiveMQ-Java8-5.15.x #60

Apache Jenkins Server-2
Reply | Threaded
Open this post in threaded view
|

Jenkins build is still unstable: ActiveMQ-Java8-5.15.x #61

Apache Jenkins Server-2
Reply | Threaded
Open this post in threaded view
|

Jenkins build is still unstable: ActiveMQ-Java8-5.15.x #62

Apache Jenkins Server-2
Reply | Threaded
Open this post in threaded view
|

Jenkins build is still unstable: ActiveMQ-Java8-5.15.x #63

Apache Jenkins Server-2
Reply | Threaded
Open this post in threaded view
|

Jenkins build is still unstable: ActiveMQ-Java8-5.15.x #64

Apache Jenkins Server-2
Reply | Threaded
Open this post in threaded view
|

Jenkins build is still unstable: ActiveMQ-Java8-5.15.x #65

Apache Jenkins Server-2
1234