Jenkins build is unstable: ActiveMQ-Java8-5.14.x #6

Previous Topic Next Topic
 
classic Classic list List threaded Threaded
78 messages Options
1234
Reply | Threaded
Open this post in threaded view
|

Jenkins build is still unstable: ActiveMQ-Java8-5.14.x #26

Apache Jenkins Server-2
Reply | Threaded
Open this post in threaded view
|

Jenkins build is still unstable: ActiveMQ-Java8-5.14.x #27

Apache Jenkins Server-2
Reply | Threaded
Open this post in threaded view
|

Jenkins build is still unstable: ActiveMQ-Java8-5.14.x #28

Apache Jenkins Server-2
Reply | Threaded
Open this post in threaded view
|

Jenkins build is still unstable: ActiveMQ-Java8-5.14.x #29

Apache Jenkins Server-2
Reply | Threaded
Open this post in threaded view
|

Jenkins build is still unstable: ActiveMQ-Java8-5.14.x #30

Apache Jenkins Server-2
Reply | Threaded
Open this post in threaded view
|

Jenkins build is still unstable: ActiveMQ-Java8-5.14.x #31

Apache Jenkins Server-2
Reply | Threaded
Open this post in threaded view
|

Jenkins build is still unstable: ActiveMQ-Java8-5.14.x #32

Apache Jenkins Server-2
Reply | Threaded
Open this post in threaded view
|

Build failed in Jenkins: ActiveMQ-Java8-5.14.x #33

Apache Jenkins Server-2
See <https://builds.apache.org/job/ActiveMQ-Java8-5.14.x/33/display/redirect?page=changes>

Changes:

[christopher.l.shannon] AMQ-6602: Fix race condition in TaskRunnerFactory

[christopher.l.shannon] AMQ-6606 - fix typo

------------------------------------------
[...truncated 53.96 KB...]
[INFO] ------------------------------------------------------------------------
[INFO]
[INFO] --- maven-clean-plugin:2.5:clean (default-clean) @ activemq-blueprint ---
[INFO] Deleting <https://builds.apache.org/job/ActiveMQ-Java8-5.14.x/ws/activemq-blueprint/target>
[INFO]
[INFO] --- maven-enforcer-plugin:1.3.1:enforce (default) @ activemq-blueprint ---
[INFO]
[INFO] --- maven-bundle-plugin:2.3.7:cleanVersions (cleanVersions) @ activemq-blueprint ---
[INFO]
[INFO] --- maven-remote-resources-plugin:1.5:process (default) @ activemq-blueprint ---
[INFO]
[INFO] --- maven-resources-plugin:2.7:resources (default-resources) @ activemq-blueprint ---
[INFO] Using 'UTF-8' encoding to copy filtered resources.
[INFO] Copying 1 resource
[INFO] Copying 3 resources
[INFO]
[INFO] --- maven-compiler-plugin:3.3:compile (default-compile) @ activemq-blueprint ---
[INFO] No sources to compile
[INFO]
[INFO] --- maven-resources-plugin:2.7:testResources (default-testResources) @ activemq-blueprint ---
[INFO] Using 'UTF-8' encoding to copy filtered resources.
[INFO] skip non existing resourceDirectory <https://builds.apache.org/job/ActiveMQ-Java8-5.14.x/ws/activemq-blueprint/src/test/resources>
[INFO] Copying 3 resources
[INFO]
[INFO] --- maven-compiler-plugin:3.3:testCompile (default-testCompile) @ activemq-blueprint ---
[INFO] No sources to compile
[INFO]
[INFO] --- maven-surefire-plugin:2.16:test (default-test) @ activemq-blueprint ---
[JENKINS] Recording test results[INFO]
[INFO] --- maven-bundle-plugin:2.3.7:bundle (default-bundle) @ activemq-blueprint ---

[WARNING] Bundle org.apache.activemq:activemq-blueprint:bundle:5.14.4-SNAPSHOT : Instructions in Export-Package that are never used: org\.apache\.activemq.*.*
Classpath: Jar:.,Jar:org.apache.aries.blueprint,Jar:xbean-blueprint,Jar:commons-jexl,Jar:pax-logging-api

[WARNING] Bundle org.apache.activemq:activemq-blueprint:bundle:5.14.4-SNAPSHOT : Superfluous export-package instructions: [org.apache.activemq**]
[INFO]
[INFO] --- maven-site-plugin:3.4:attach-descriptor (attach-descriptor) @ activemq-blueprint ---
[INFO]
[INFO] --- ianal-maven-plugin:1.0-alpha-1:verify-legal-files (default) @ activemq-blueprint ---
[INFO] Checking legal files in: activemq-blueprint-5.14.4-SNAPSHOT.jar
[INFO]
[INFO] --- maven-install-plugin:2.5.2:install (default-install) @ activemq-blueprint ---
[INFO] Installing <https://builds.apache.org/job/ActiveMQ-Java8-5.14.x/ws/activemq-blueprint/target/activemq-blueprint-5.14.4-SNAPSHOT.jar> to /home/jenkins/jenkins-slave/maven-repositories/1/org/apache/activemq/activemq-blueprint/5.14.4-SNAPSHOT/activemq-blueprint-5.14.4-SNAPSHOT.jar
[INFO] Installing <https://builds.apache.org/job/ActiveMQ-Java8-5.14.x/ws/activemq-blueprint/pom.xml> to /home/jenkins/jenkins-slave/maven-repositories/1/org/apache/activemq/activemq-blueprint/5.14.4-SNAPSHOT/activemq-blueprint-5.14.4-SNAPSHOT.pom
[INFO]
[INFO] --- maven-bundle-plugin:2.3.7:install (default-install) @ activemq-blueprint ---
[INFO] Installing org/apache/activemq/activemq-blueprint/5.14.4-SNAPSHOT/activemq-blueprint-5.14.4-SNAPSHOT.jar
[INFO] Writing OBR metadata
[INFO]
[INFO] >>> maven-source-plugin:2.4:jar (default-cli) > generate-sources @ activemq-blueprint >>>
[INFO]
[INFO] --- maven-enforcer-plugin:1.3.1:enforce (default) @ activemq-blueprint ---
[INFO]
[INFO] --- maven-bundle-plugin:2.3.7:cleanVersions (cleanVersions) @ activemq-blueprint ---
[WARNING] Failed to getClass for org.apache.maven.plugin.source.SourceJarMojo
[INFO]
[INFO] <<< maven-source-plugin:2.4:jar (default-cli) < generate-sources @ activemq-blueprint <<<
[INFO]
[INFO] --- maven-source-plugin:2.4:jar (default-cli) @ activemq-blueprint ---
[INFO] Building jar: <https://builds.apache.org/job/ActiveMQ-Java8-5.14.x/ws/activemq-blueprint/target/activemq-blueprint-5.14.4-SNAPSHOT-sources.jar>
[INFO]                                                                        
[INFO] ------------------------------------------------------------------------
[INFO] Skipping ActiveMQ :: Web Demo
[INFO] This project has been banned from the build due to previous failures.
[INFO] ------------------------------------------------------------------------
[INFO]                                                                        
[INFO] ------------------------------------------------------------------------
[INFO] Skipping ActiveMQ :: Web Console
[INFO] This project has been banned from the build due to previous failures.
[INFO] ------------------------------------------------------------------------
[INFO]                                                                        
[INFO] ------------------------------------------------------------------------
[INFO] Skipping ActiveMQ :: Karaf Integration Tests
[INFO] This project has been banned from the build due to previous failures.
[INFO] ------------------------------------------------------------------------
[INFO]                                                                        
[INFO] ------------------------------------------------------------------------
[INFO] Skipping ActiveMQ :: Integration Test :: Spring 3.1
[INFO] This project has been banned from the build due to previous failures.
[INFO] ------------------------------------------------------------------------
[INFO]                                                                        
[INFO] ------------------------------------------------------------------------
[INFO] Skipping ActiveMQ :: Assembly
[INFO] This project has been banned from the build due to previous failures.
[INFO] ------------------------------------------------------------------------
[INFO] ------------------------------------------------------------------------
[INFO] Reactor Summary:
[INFO]
[INFO] ActiveMQ ........................................... SUCCESS [  4.705 s]
[INFO] ActiveMQ :: Openwire Generator ..................... SUCCESS [  5.607 s]
[INFO] ActiveMQ :: Client ................................. FAILURE [  9.885 s]
[INFO] ActiveMQ :: Openwire Legacy Support ................ SKIPPED
[INFO] ActiveMQ :: JAAS ................................... SUCCESS [ 40.684 s]
[INFO] ActiveMQ :: Broker ................................. SKIPPED
[INFO] ActiveMQ :: KahaDB Store ........................... SKIPPED
[INFO] ActiveMQ :: STOMP Protocol ......................... SKIPPED
[INFO] ActiveMQ :: MQTT Protocol .......................... SKIPPED
[INFO] ActiveMQ :: JDBC Store ............................. SKIPPED
[INFO] ActiveMQ :: LevelDB Store .......................... SKIPPED
[INFO] ActiveMQ :: Generic JMS Pool ....................... SKIPPED
[INFO] ActiveMQ :: Pool ................................... SKIPPED
[INFO] ActiveMQ :: RA ..................................... SKIPPED
[INFO] ActiveMQ :: Spring ................................. SKIPPED
[INFO] ActiveMQ :: Console ................................ SKIPPED
[INFO] ActiveMQ :: Partition Management ................... SKIPPED
[INFO] ActiveMQ :: Runtime Configuration .................. SKIPPED
[INFO] ActiveMQ :: Tooling ................................ SUCCESS [  3.394 s]
[INFO] ActiveMQ :: JUnit Rule ............................. SKIPPED
[INFO] ActiveMQ :: Unit Tests ............................. SKIPPED
[INFO] ActiveMQ :: HTTP Protocol Support .................. SKIPPED
[INFO] ActiveMQ :: AMQP ................................... SKIPPED
[INFO] ActiveMQ :: Camel .................................. SKIPPED
[INFO] ActiveMQ :: All JAR bundle ......................... SKIPPED
[INFO] ActiveMQ :: Log4j Appender ......................... SKIPPED
[INFO] ActiveMQ :: Apache Karaf ........................... SKIPPED
[INFO] ActiveMQ :: ConnectionFactory ...................... SKIPPED
[INFO] ActiveMQ :: RAR .................................... SKIPPED
[INFO] ActiveMQ :: Run Jar ................................ SKIPPED
[INFO] ActiveMQ :: Shiro .................................. SKIPPED
[INFO] ActiveMQ :: Memory Usage Test Plugin ............... SKIPPED
[INFO] ActiveMQ :: Performance Test Plugin ................ SKIPPED
[INFO] ActiveMQ :: StartUp/Stop Plugin .................... SKIPPED
[INFO] ActiveMQ :: Web .................................... SKIPPED
[INFO] ActiveMQ :: OSGi bundle ............................ SKIPPED
[INFO] ActiveMQ :: Blueprint .............................. SUCCESS [  6.451 s]
[INFO] ActiveMQ :: Web Demo ............................... SKIPPED
[INFO] ActiveMQ :: Web Console ............................ SKIPPED
[INFO] ActiveMQ :: Karaf Integration Tests ................ SKIPPED
[INFO] ActiveMQ :: Integration Test :: Spring 3.1 ......... SKIPPED
[INFO] ActiveMQ :: Assembly ............................... SKIPPED
[INFO] ------------------------------------------------------------------------
[INFO] BUILD FAILURE
[INFO] ------------------------------------------------------------------------
[INFO] Total time: 01:35 min
[INFO] Finished at: 2017-02-23T15:46:49+00:00
[INFO] Final Memory: 76M/1302M
[INFO] ------------------------------------------------------------------------
Waiting for Jenkins to finish collecting data
[ERROR] Failed to execute goal org.apache.maven.plugins:maven-compiler-plugin:3.3:testCompile (default-testCompile) on project activemq-client: Compilation failure
[ERROR] <https://builds.apache.org/job/ActiveMQ-Java8-5.14.x/ws/activemq-client/src/test/java/org/apache/activemq/thread/TaskRunnerFactoryTest.java>:[49,32] lambda expressions are not supported in -source 1.7
[ERROR] (use -source 8 or higher to enable lambda expressions)
[ERROR] -> [Help 1]
org.apache.maven.lifecycle.LifecycleExecutionException: Failed to execute goal org.apache.maven.plugins:maven-compiler-plugin:3.3:testCompile (default-testCompile) on project activemq-client: Compilation failure
<https://builds.apache.org/job/ActiveMQ-Java8-5.14.x/ws/activemq-client/src/test/java/org/apache/activemq/thread/TaskRunnerFactoryTest.java>:[49,32] lambda expressions are not supported in -source 1.7
  (use -source 8 or higher to enable lambda expressions)

        at org.apache.maven.lifecycle.internal.MojoExecutor.execute(MojoExecutor.java:212)
        at org.apache.maven.lifecycle.internal.MojoExecutor.execute(MojoExecutor.java:153)
        at org.apache.maven.lifecycle.internal.MojoExecutor.execute(MojoExecutor.java:145)
        at org.apache.maven.lifecycle.internal.LifecycleModuleBuilder.buildProject(LifecycleModuleBuilder.java:116)
        at org.apache.maven.lifecycle.internal.LifecycleModuleBuilder.buildProject(LifecycleModuleBuilder.java:80)
        at org.apache.maven.lifecycle.internal.builder.singlethreaded.SingleThreadedBuilder.build(SingleThreadedBuilder.java:51)
        at org.apache.maven.lifecycle.internal.LifecycleStarter.execute(LifecycleStarter.java:128)
        at org.apache.maven.DefaultMaven.doExecute(DefaultMaven.java:307)
        at org.apache.maven.DefaultMaven.doExecute(DefaultMaven.java:193)
        at org.apache.maven.DefaultMaven.execute(DefaultMaven.java:106)
        at org.jvnet.hudson.maven3.launcher.Maven33Launcher.main(Maven33Launcher.java:129)
        at sun.reflect.NativeMethodAccessorImpl.invoke0(Native Method)
        at sun.reflect.NativeMethodAccessorImpl.invoke(NativeMethodAccessorImpl.java:62)
        at sun.reflect.DelegatingMethodAccessorImpl.invoke(DelegatingMethodAccessorImpl.java:43)
        at java.lang.reflect.Method.invoke(Method.java:498)
        at org.codehaus.plexus.classworlds.launcher.Launcher.launchStandard(Launcher.java:330)
        at org.codehaus.plexus.classworlds.launcher.Launcher.launch(Launcher.java:238)
        at jenkins.maven3.agent.Maven33Main.launch(Maven33Main.java:176)
        at sun.reflect.NativeMethodAccessorImpl.invoke0(Native Method)
        at sun.reflect.NativeMethodAccessorImpl.invoke(NativeMethodAccessorImpl.java:62)
        at sun.reflect.DelegatingMethodAccessorImpl.invoke(DelegatingMethodAccessorImpl.java:43)
        at java.lang.reflect.Method.invoke(Method.java:498)
        at hudson.maven.Maven3Builder.call(Maven3Builder.java:139)
        at hudson.maven.Maven3Builder.call(Maven3Builder.java:70)
        at hudson.remoting.UserRequest.perform(UserRequest.java:153)
        at hudson.remoting.UserRequest.perform(UserRequest.java:50)
        at hudson.remoting.Request$2.run(Request.java:336)
        at hudson.remoting.InterceptingExecutorService$1.call(InterceptingExecutorService.java:68)
        at java.util.concurrent.FutureTask.run(FutureTask.java:266)
        at java.util.concurrent.ThreadPoolExecutor.runWorker(ThreadPoolExecutor.java:1142)
        at java.util.concurrent.ThreadPoolExecutor$Worker.run(ThreadPoolExecutor.java:617)
        at java.lang.Thread.run(Thread.java:745)
Caused by: org.apache.maven.plugin.compiler.CompilationFailureException: Compilation failure
<https://builds.apache.org/job/ActiveMQ-Java8-5.14.x/ws/activemq-client/src/test/java/org/apache/activemq/thread/TaskRunnerFactoryTest.java>:[49,32] lambda expressions are not supported in -source 1.7
  (use -source 8 or higher to enable lambda expressions)

        at org.apache.maven.plugin.compiler.AbstractCompilerMojo.execute(AbstractCompilerMojo.java:911)
        at org.apache.maven.plugin.compiler.TestCompilerMojo.execute(TestCompilerMojo.java:153)
        at org.apache.maven.plugin.DefaultBuildPluginManager.executeMojo(DefaultBuildPluginManager.java:134)
        at org.apache.maven.lifecycle.internal.MojoExecutor.execute(MojoExecutor.java:207)
        ... 31 more
[ERROR]
[ERROR] Re-run Maven using the -X switch to enable full debug logging.
[ERROR]
[ERROR] For more information about the errors and possible solutions, please read the following articles:
[ERROR] [Help 1] http://cwiki.apache.org/confluence/display/MAVEN/MojoFailureException
[ERROR]
[ERROR] After correcting the problems, you can resume the build with the command
[ERROR]   mvn <goals> -rf :activemq-client
[JENKINS] Archiving <https://builds.apache.org/job/ActiveMQ-Java8-5.14.x/ws/activemq-kahadb-store/pom.xml> to org.apache.activemq/activemq-kahadb-store/5.14.4-SNAPSHOT/activemq-kahadb-store-5.14.4-SNAPSHOT.pom
[JENKINS] Archiving <https://builds.apache.org/job/ActiveMQ-Java8-5.14.x/ws/activemq-osgi/pom.xml> to org.apache.activemq/activemq-osgi/5.14.4-SNAPSHOT/activemq-osgi-5.14.4-SNAPSHOT.pom
[JENKINS] Archiving <https://builds.apache.org/job/ActiveMQ-Java8-5.14.x/ws/activemq-unit-tests/pom.xml> to org.apache.activemq/activemq-unit-tests/5.14.4-SNAPSHOT/activemq-unit-tests-5.14.4-SNAPSHOT.pom
Compressed 71.40 KB of artifacts by 44.8% relative to #32
[JENKINS] Archiving <https://builds.apache.org/job/ActiveMQ-Java8-5.14.x/ws/activemq-openwire-legacy/pom.xml> to org.apache.activemq/activemq-openwire-legacy/5.14.4-SNAPSHOT/activemq-openwire-legacy-5.14.4-SNAPSHOT.pom
[JENKINS] Archiving <https://builds.apache.org/job/ActiveMQ-Java8-5.14.x/ws/activemq-karaf-itest/pom.xml> to org.apache.activemq/activemq-karaf-itest/5.14.4-SNAPSHOT/activemq-karaf-itest-5.14.4-SNAPSHOT.pom
[JENKINS] Archiving <https://builds.apache.org/job/ActiveMQ-Java8-5.14.x/ws/activemq-rar/pom.xml> to org.apache.activemq/activemq-rar/5.14.4-SNAPSHOT/activemq-rar-5.14.4-SNAPSHOT.pom
[JENKINS] Archiving <https://builds.apache.org/job/ActiveMQ-Java8-5.14.x/ws/activemq-http/pom.xml> to org.apache.activemq/activemq-http/5.14.4-SNAPSHOT/activemq-http-5.14.4-SNAPSHOT.pom
[JENKINS] Archiving <https://builds.apache.org/job/ActiveMQ-Java8-5.14.x/ws/activemq-amqp/pom.xml> to org.apache.activemq/activemq-amqp/5.14.4-SNAPSHOT/activemq-amqp-5.14.4-SNAPSHOT.pom
[JENKINS] Archiving <https://builds.apache.org/job/ActiveMQ-Java8-5.14.x/ws/activemq-client/pom.xml> to org.apache.activemq/activemq-client/5.14.4-SNAPSHOT/activemq-client-5.14.4-SNAPSHOT.pom
[JENKINS] Archiving <https://builds.apache.org/job/ActiveMQ-Java8-5.14.x/ws/activemq-blueprint/pom.xml> to org.apache.activemq/activemq-blueprint/5.14.4-SNAPSHOT/activemq-blueprint-5.14.4-SNAPSHOT.pom
[JENKINS] Archiving <https://builds.apache.org/job/ActiveMQ-Java8-5.14.x/ws/activemq-blueprint/target/activemq-blueprint-5.14.4-SNAPSHOT.jar> to org.apache.activemq/activemq-blueprint/5.14.4-SNAPSHOT/activemq-blueprint-5.14.4-SNAPSHOT.jar
[JENKINS] Archiving <https://builds.apache.org/job/ActiveMQ-Java8-5.14.x/ws/activemq-blueprint/target/activemq-blueprint-5.14.4-SNAPSHOT-sources.jar> to org.apache.activemq/activemq-blueprint/5.14.4-SNAPSHOT/activemq-blueprint-5.14.4-SNAPSHOT-sources.jar
[JENKINS] Archiving <https://builds.apache.org/job/ActiveMQ-Java8-5.14.x/ws/activemq-tooling/activemq-junit/pom.xml> to org.apache.activemq.tooling/activemq-junit/5.14.4-SNAPSHOT/activemq-junit-5.14.4-SNAPSHOT.pom
[JENKINS] Archiving <https://builds.apache.org/job/ActiveMQ-Java8-5.14.x/ws/activemq-tooling/pom.xml> to org.apache.activemq.tooling/activemq-tooling/5.14.4-SNAPSHOT/activemq-tooling-5.14.4-SNAPSHOT.pom
[JENKINS] Archiving <https://builds.apache.org/job/ActiveMQ-Java8-5.14.x/ws/activemq-jms-pool/pom.xml> to org.apache.activemq/activemq-jms-pool/5.14.4-SNAPSHOT/activemq-jms-pool-5.14.4-SNAPSHOT.pom
[JENKINS] Archiving <https://builds.apache.org/job/ActiveMQ-Java8-5.14.x/ws/activemq-pool/pom.xml> to org.apache.activemq/activemq-pool/5.14.4-SNAPSHOT/activemq-pool-5.14.4-SNAPSHOT.pom
[JENKINS] Archiving <https://builds.apache.org/job/ActiveMQ-Java8-5.14.x/ws/activemq-jdbc-store/pom.xml> to org.apache.activemq/activemq-jdbc-store/5.14.4-SNAPSHOT/activemq-jdbc-store-5.14.4-SNAPSHOT.pom
[JENKINS] Archiving <https://builds.apache.org/job/ActiveMQ-Java8-5.14.x/ws/activemq-camel/pom.xml> to org.apache.activemq/activemq-camel/5.14.4-SNAPSHOT/activemq-camel-5.14.4-SNAPSHOT.pom
[JENKINS] Archiving <https://builds.apache.org/job/ActiveMQ-Java8-5.14.x/ws/activemq-runtime-config/pom.xml> to org.apache.activemq/activemq-runtime-config/5.14.4-SNAPSHOT/activemq-runtime-config-5.14.4-SNAPSHOT.pom
[JENKINS] Archiving <https://builds.apache.org/job/ActiveMQ-Java8-5.14.x/ws/pom.xml> to org.apache.activemq/activemq-parent/5.14.4-SNAPSHOT/activemq-parent-5.14.4-SNAPSHOT.pom
Compressed 59.92 KB of artifacts by 53.4% relative to #32
[JENKINS] Archiving <https://builds.apache.org/job/ActiveMQ-Java8-5.14.x/ws/activemq-stomp/pom.xml> to org.apache.activemq/activemq-stomp/5.14.4-SNAPSHOT/activemq-stomp-5.14.4-SNAPSHOT.pom
[JENKINS] Archiving <https://builds.apache.org/job/ActiveMQ-Java8-5.14.x/ws/activemq-openwire-generator/pom.xml> to org.apache.activemq/activemq-openwire-generator/5.14.4-SNAPSHOT/activemq-openwire-generator-5.14.4-SNAPSHOT.pom
[JENKINS] Archiving <https://builds.apache.org/job/ActiveMQ-Java8-5.14.x/ws/activemq-openwire-generator/target/activemq-openwire-generator-5.14.4-SNAPSHOT.jar> to org.apache.activemq/activemq-openwire-generator/5.14.4-SNAPSHOT/activemq-openwire-generator-5.14.4-SNAPSHOT.jar
[JENKINS] Archiving <https://builds.apache.org/job/ActiveMQ-Java8-5.14.x/ws/activemq-openwire-generator/target/activemq-openwire-generator-5.14.4-SNAPSHOT-sources.jar> to org.apache.activemq/activemq-openwire-generator/5.14.4-SNAPSHOT/activemq-openwire-generator-5.14.4-SNAPSHOT-sources.jar
[JENKINS] Archiving <https://builds.apache.org/job/ActiveMQ-Java8-5.14.x/ws/activemq-broker/pom.xml> to org.apache.activemq/activemq-broker/5.14.4-SNAPSHOT/activemq-broker-5.14.4-SNAPSHOT.pom
[JENKINS] Archiving <https://builds.apache.org/job/ActiveMQ-Java8-5.14.x/ws/activemq-web-demo/pom.xml> to org.apache.activemq/activemq-web-demo/5.14.4-SNAPSHOT/activemq-web-demo-5.14.4-SNAPSHOT.pom
[JENKINS] Archiving <https://builds.apache.org/job/ActiveMQ-Java8-5.14.x/ws/activemq-mqtt/pom.xml> to org.apache.activemq/activemq-mqtt/5.14.4-SNAPSHOT/activemq-mqtt-5.14.4-SNAPSHOT.pom
[JENKINS] Archiving <https://builds.apache.org/job/ActiveMQ-Java8-5.14.x/ws/activemq-shiro/pom.xml> to org.apache.activemq/activemq-shiro/5.14.4-SNAPSHOT/activemq-shiro-5.14.4-SNAPSHOT.pom
[JENKINS] Archiving <https://builds.apache.org/job/ActiveMQ-Java8-5.14.x/ws/activemq-tooling/activemq-perf-maven-plugin/pom.xml> to org.apache.activemq.tooling/activemq-perf-maven-plugin/5.14.4-SNAPSHOT/activemq-perf-maven-plugin-5.14.4-SNAPSHOT.pom
[JENKINS] Archiving <https://builds.apache.org/job/ActiveMQ-Java8-5.14.x/ws/activemq-run/pom.xml> to org.apache.activemq/activemq-run/5.14.4-SNAPSHOT/activemq-run-5.14.4-SNAPSHOT.pom
[JENKINS] Archiving <https://builds.apache.org/job/ActiveMQ-Java8-5.14.x/ws/activemq-tooling/activemq-maven-plugin/pom.xml> to org.apache.activemq.tooling/activemq-maven-plugin/5.14.4-SNAPSHOT/activemq-maven-plugin-5.14.4-SNAPSHOT.pom
[JENKINS] Archiving <https://builds.apache.org/job/ActiveMQ-Java8-5.14.x/ws/activemq-karaf/pom.xml> to org.apache.activemq/activemq-karaf/5.14.4-SNAPSHOT/activemq-karaf-5.14.4-SNAPSHOT.pom
[JENKINS] Archiving <https://builds.apache.org/job/ActiveMQ-Java8-5.14.x/ws/activemq-web-console/pom.xml> to org.apache.activemq/activemq-web-console/5.14.4-SNAPSHOT/activemq-web-console-5.14.4-SNAPSHOT.pom
[JENKINS] Archiving <https://builds.apache.org/job/ActiveMQ-Java8-5.14.x/ws/activemq-jaas/pom.xml> to org.apache.activemq/activemq-jaas/5.14.4-SNAPSHOT/activemq-jaas-5.14.4-SNAPSHOT.pom
[JENKINS] Archiving <https://builds.apache.org/job/ActiveMQ-Java8-5.14.x/ws/activemq-jaas/target/activemq-jaas-5.14.4-SNAPSHOT.jar> to org.apache.activemq/activemq-jaas/5.14.4-SNAPSHOT/activemq-jaas-5.14.4-SNAPSHOT.jar
[JENKINS] Archiving <https://builds.apache.org/job/ActiveMQ-Java8-5.14.x/ws/activemq-jaas/target/activemq-jaas-5.14.4-SNAPSHOT-sources.jar> to org.apache.activemq/activemq-jaas/5.14.4-SNAPSHOT/activemq-jaas-5.14.4-SNAPSHOT-sources.jar
[JENKINS] Archiving <https://builds.apache.org/job/ActiveMQ-Java8-5.14.x/ws/activemq-itests-spring31/pom.xml> to org.apache.activemq/activemq-itests-spring31/5.14.4-SNAPSHOT/activemq-itests-spring31-5.14.4-SNAPSHOT.pom
[JENKINS] Archiving <https://builds.apache.org/job/ActiveMQ-Java8-5.14.x/ws/activemq-tooling/activemq-memtest-maven-plugin/pom.xml> to org.apache.activemq.tooling/activemq-memtest-maven-plugin/5.14.4-SNAPSHOT/activemq-memtest-maven-plugin-5.14.4-SNAPSHOT.pom
[JENKINS] Archiving <https://builds.apache.org/job/ActiveMQ-Java8-5.14.x/ws/activemq-ra/pom.xml> to org.apache.activemq/activemq-ra/5.14.4-SNAPSHOT/activemq-ra-5.14.4-SNAPSHOT.pom
[JENKINS] Archiving <https://builds.apache.org/job/ActiveMQ-Java8-5.14.x/ws/activemq-partition/pom.xml> to org.apache.activemq/activemq-partition/5.14.4-SNAPSHOT/activemq-partition-5.14.4-SNAPSHOT.pom
[JENKINS] Archiving <https://builds.apache.org/job/ActiveMQ-Java8-5.14.x/ws/activemq-all/pom.xml> to org.apache.activemq/activemq-all/5.14.4-SNAPSHOT/activemq-all-5.14.4-SNAPSHOT.pom
[JENKINS] Archiving <https://builds.apache.org/job/ActiveMQ-Java8-5.14.x/ws/assembly/pom.xml> to org.apache.activemq/apache-activemq/5.14.4-SNAPSHOT/apache-activemq-5.14.4-SNAPSHOT.pom
[JENKINS] Archiving <https://builds.apache.org/job/ActiveMQ-Java8-5.14.x/ws/activemq-console/pom.xml> to org.apache.activemq/activemq-console/5.14.4-SNAPSHOT/activemq-console-5.14.4-SNAPSHOT.pom
[JENKINS] Archiving <https://builds.apache.org/job/ActiveMQ-Java8-5.14.x/ws/activemq-spring/pom.xml> to org.apache.activemq/activemq-spring/5.14.4-SNAPSHOT/activemq-spring-5.14.4-SNAPSHOT.pom
[JENKINS] Archiving <https://builds.apache.org/job/ActiveMQ-Java8-5.14.x/ws/activemq-cf/pom.xml> to org.apache.activemq/activemq-cf/5.14.4-SNAPSHOT/activemq-cf-5.14.4-SNAPSHOT.pom
[JENKINS] Archiving <https://builds.apache.org/job/ActiveMQ-Java8-5.14.x/ws/activemq-leveldb-store/pom.xml> to org.apache.activemq/activemq-leveldb-store/5.14.4-SNAPSHOT/activemq-leveldb-store-5.14.4-SNAPSHOT.pom
[JENKINS] Archiving <https://builds.apache.org/job/ActiveMQ-Java8-5.14.x/ws/activemq-web/pom.xml> to org.apache.activemq/activemq-web/5.14.4-SNAPSHOT/activemq-web-5.14.4-SNAPSHOT.pom
[JENKINS] Archiving <https://builds.apache.org/job/ActiveMQ-Java8-5.14.x/ws/activemq-log4j-appender/pom.xml> to org.apache.activemq/activemq-log4j-appender/5.14.4-SNAPSHOT/activemq-log4j-appender-5.14.4-SNAPSHOT.pom
Sending e-mails to: [hidden email]
[locks-and-latches] Releasing all the locks
[locks-and-latches] All the locks released
channel stopped
Reply | Threaded
Open this post in threaded view
|

Build failed in Jenkins: ActiveMQ-Java8-5.14.x #34

Apache Jenkins Server-2
See <https://builds.apache.org/job/ActiveMQ-Java8-5.14.x/34/display/redirect?page=changes>

Changes:

[christopher.l.shannon] AMQ-6602 - Removing lambdas for java 7 compatibility

------------------------------------------
[...truncated 61.91 KB...]
[INFO] Downloading: https://repo.maven.apache.org/maven2/org/apache/commons/commons-jexl/2.0/commons-jexl-2.0.jar
[INFO] Downloading: https://repo.maven.apache.org/maven2/org/ops4j/pax/logging/pax-logging-api/1.5.0/pax-logging-api-1.5.0.jar
[INFO] Downloaded: https://repo.maven.apache.org/maven2/org/apache/xbean/xbean-blueprint/4.2/xbean-blueprint-4.2.jar (140 KB at 3683.1 KB/sec)
[INFO] Downloaded: https://repo.maven.apache.org/maven2/org/apache/commons/commons-jexl/2.0/commons-jexl-2.0.jar (206 KB at 4898.0 KB/sec)
[INFO] Downloaded: https://repo.maven.apache.org/maven2/org/apache/aries/blueprint/org.apache.aries.blueprint/1.1.0/org.apache.aries.blueprint-1.1.0.jar (442 KB at 9000.7 KB/sec)
[INFO] Downloaded: https://repo.maven.apache.org/maven2/org/ops4j/pax/logging/pax-logging-api/1.5.0/pax-logging-api-1.5.0.jar (90 KB at 17.5 KB/sec)
[INFO]
[INFO] --- maven-clean-plugin:2.5:clean (default-clean) @ activemq-blueprint ---
[INFO]
[INFO] --- maven-enforcer-plugin:1.3.1:enforce (default) @ activemq-blueprint ---
[INFO]
[INFO] --- maven-bundle-plugin:2.3.7:cleanVersions (cleanVersions) @ activemq-blueprint ---
[INFO]
[INFO] --- maven-remote-resources-plugin:1.5:process (default) @ activemq-blueprint ---
[INFO]
[INFO] --- maven-resources-plugin:2.7:resources (default-resources) @ activemq-blueprint ---
[INFO] Using 'UTF-8' encoding to copy filtered resources.
[INFO] Copying 1 resource
[INFO] Copying 3 resources
[INFO]
[INFO] --- maven-compiler-plugin:3.3:compile (default-compile) @ activemq-blueprint ---
[INFO] No sources to compile
[INFO]
[INFO] --- maven-resources-plugin:2.7:testResources (default-testResources) @ activemq-blueprint ---
[INFO] Using 'UTF-8' encoding to copy filtered resources.
[INFO] skip non existing resourceDirectory <https://builds.apache.org/job/ActiveMQ-Java8-5.14.x/ws/activemq-blueprint/src/test/resources>
[INFO] Copying 3 resources
[INFO]
[INFO] --- maven-compiler-plugin:3.3:testCompile (default-testCompile) @ activemq-blueprint ---
[INFO] No sources to compile
[INFO]
[INFO] --- maven-surefire-plugin:2.16:test (default-test) @ activemq-blueprint ---
[JENKINS] Recording test results[INFO]
[INFO] --- maven-bundle-plugin:2.3.7:bundle (default-bundle) @ activemq-blueprint ---

[WARNING] Bundle org.apache.activemq:activemq-blueprint:bundle:5.14.4-SNAPSHOT : Instructions in Export-Package that are never used: org\.apache\.activemq.*.*
Classpath: Jar:.,Jar:org.apache.aries.blueprint,Jar:xbean-blueprint,Jar:commons-jexl,Jar:pax-logging-api

[WARNING] Bundle org.apache.activemq:activemq-blueprint:bundle:5.14.4-SNAPSHOT : Superfluous export-package instructions: [org.apache.activemq**]
[INFO]
[INFO] --- maven-site-plugin:3.4:attach-descriptor (attach-descriptor) @ activemq-blueprint ---
[INFO]
[INFO] --- ianal-maven-plugin:1.0-alpha-1:verify-legal-files (default) @ activemq-blueprint ---
[INFO] Checking legal files in: activemq-blueprint-5.14.4-SNAPSHOT.jar
[INFO]
[INFO] --- maven-install-plugin:2.5.2:install (default-install) @ activemq-blueprint ---
[INFO] Installing <https://builds.apache.org/job/ActiveMQ-Java8-5.14.x/ws/activemq-blueprint/target/activemq-blueprint-5.14.4-SNAPSHOT.jar> to /home/jenkins/jenkins-slave/maven-repositories/1/org/apache/activemq/activemq-blueprint/5.14.4-SNAPSHOT/activemq-blueprint-5.14.4-SNAPSHOT.jar
[INFO] Installing <https://builds.apache.org/job/ActiveMQ-Java8-5.14.x/ws/activemq-blueprint/pom.xml> to /home/jenkins/jenkins-slave/maven-repositories/1/org/apache/activemq/activemq-blueprint/5.14.4-SNAPSHOT/activemq-blueprint-5.14.4-SNAPSHOT.pom
[INFO]
[INFO] --- maven-bundle-plugin:2.3.7:install (default-install) @ activemq-blueprint ---
[INFO] Installing org/apache/activemq/activemq-blueprint/5.14.4-SNAPSHOT/activemq-blueprint-5.14.4-SNAPSHOT.jar
[INFO] Writing OBR metadata
[INFO]
[INFO] >>> maven-source-plugin:2.4:jar (default-cli) > generate-sources @ activemq-blueprint >>>
[INFO]
[INFO] --- maven-enforcer-plugin:1.3.1:enforce (default) @ activemq-blueprint ---
[INFO]
[INFO] --- maven-bundle-plugin:2.3.7:cleanVersions (cleanVersions) @ activemq-blueprint ---
[WARNING] Failed to getClass for org.apache.maven.plugin.source.SourceJarMojo
[INFO]
[INFO] <<< maven-source-plugin:2.4:jar (default-cli) < generate-sources @ activemq-blueprint <<<
[INFO]
[INFO] --- maven-source-plugin:2.4:jar (default-cli) @ activemq-blueprint ---
[INFO] Building jar: <https://builds.apache.org/job/ActiveMQ-Java8-5.14.x/ws/activemq-blueprint/target/activemq-blueprint-5.14.4-SNAPSHOT-sources.jar>
[INFO]                                                                        
[INFO] ------------------------------------------------------------------------
[INFO] Skipping ActiveMQ :: Web Demo
[INFO] This project has been banned from the build due to previous failures.
[INFO] ------------------------------------------------------------------------
[INFO]                                                                        
[INFO] ------------------------------------------------------------------------
[INFO] Skipping ActiveMQ :: Web Console
[INFO] This project has been banned from the build due to previous failures.
[INFO] ------------------------------------------------------------------------
[INFO]                                                                        
[INFO] ------------------------------------------------------------------------
[INFO] Skipping ActiveMQ :: Karaf Integration Tests
[INFO] This project has been banned from the build due to previous failures.
[INFO] ------------------------------------------------------------------------
[INFO]                                                                        
[INFO] ------------------------------------------------------------------------
[INFO] Skipping ActiveMQ :: Integration Test :: Spring 3.1
[INFO] This project has been banned from the build due to previous failures.
[INFO] ------------------------------------------------------------------------
[INFO]                                                                        
[INFO] ------------------------------------------------------------------------
[INFO] Skipping ActiveMQ :: Assembly
[INFO] This project has been banned from the build due to previous failures.
[INFO] ------------------------------------------------------------------------
[INFO] ------------------------------------------------------------------------
[INFO] Reactor Summary:
[INFO]
[INFO] ActiveMQ ........................................... SUCCESS [  3.186 s]
[INFO] ActiveMQ :: Openwire Generator ..................... SUCCESS [  3.993 s]
[INFO] ActiveMQ :: Client ................................. FAILURE [  5.427 s]
[INFO] ActiveMQ :: Openwire Legacy Support ................ SKIPPED
[INFO] ActiveMQ :: JAAS ................................... SUCCESS [ 33.234 s]
[INFO] ActiveMQ :: Broker ................................. SKIPPED
[INFO] ActiveMQ :: KahaDB Store ........................... SKIPPED
[INFO] ActiveMQ :: STOMP Protocol ......................... SKIPPED
[INFO] ActiveMQ :: MQTT Protocol .......................... SKIPPED
[INFO] ActiveMQ :: JDBC Store ............................. SKIPPED
[INFO] ActiveMQ :: LevelDB Store .......................... SKIPPED
[INFO] ActiveMQ :: Generic JMS Pool ....................... SKIPPED
[INFO] ActiveMQ :: Pool ................................... SKIPPED
[INFO] ActiveMQ :: RA ..................................... SKIPPED
[INFO] ActiveMQ :: Spring ................................. SKIPPED
[INFO] ActiveMQ :: Console ................................ SKIPPED
[INFO] ActiveMQ :: Partition Management ................... SKIPPED
[INFO] ActiveMQ :: Runtime Configuration .................. SKIPPED
[INFO] ActiveMQ :: Tooling ................................ SUCCESS [  0.683 s]
[INFO] ActiveMQ :: JUnit Rule ............................. SKIPPED
[INFO] ActiveMQ :: Unit Tests ............................. SKIPPED
[INFO] ActiveMQ :: HTTP Protocol Support .................. SKIPPED
[INFO] ActiveMQ :: AMQP ................................... SKIPPED
[INFO] ActiveMQ :: Camel .................................. SKIPPED
[INFO] ActiveMQ :: All JAR bundle ......................... SKIPPED
[INFO] ActiveMQ :: Log4j Appender ......................... SKIPPED
[INFO] ActiveMQ :: Apache Karaf ........................... SKIPPED
[INFO] ActiveMQ :: ConnectionFactory ...................... SKIPPED
[INFO] ActiveMQ :: RAR .................................... SKIPPED
[INFO] ActiveMQ :: Run Jar ................................ SKIPPED
[INFO] ActiveMQ :: Shiro .................................. SKIPPED
[INFO] ActiveMQ :: Memory Usage Test Plugin ............... SKIPPED
[INFO] ActiveMQ :: Performance Test Plugin ................ SKIPPED
[INFO] ActiveMQ :: StartUp/Stop Plugin .................... SKIPPED
[INFO] ActiveMQ :: Web .................................... SKIPPED
[INFO] ActiveMQ :: OSGi bundle ............................ SKIPPED
[INFO] ActiveMQ :: Blueprint .............................. SUCCESS [  7.008 s]
[INFO] ActiveMQ :: Web Demo ............................... SKIPPED
[INFO] ActiveMQ :: Web Console ............................ SKIPPED
[INFO] ActiveMQ :: Karaf Integration Tests ................ SKIPPED
[INFO] ActiveMQ :: Integration Test :: Spring 3.1 ......... SKIPPED
[INFO] ActiveMQ :: Assembly ............................... SKIPPED
[INFO] ------------------------------------------------------------------------
[INFO] BUILD FAILURE
[INFO] ------------------------------------------------------------------------
[INFO] Total time: 01:08 min
[INFO] Finished at: 2017-02-24T02:56:26+00:00
[INFO] Final Memory: 86M/1382M
[INFO] ------------------------------------------------------------------------
[ERROR] Failed to execute goal org.apache.maven.plugins:maven-compiler-plugin:3.3:testCompile (default-testCompile) on project activemq-client: Compilation failure
[ERROR] <https://builds.apache.org/job/ActiveMQ-Java8-5.14.x/ws/activemq-client/src/test/java/org/apache/activemq/thread/TaskRunnerFactoryTest.java>:[46,70] incompatible types: java.util.List<java.lang.Object> cannot be converted to java.util.List<org.apache.activemq.thread.TaskRunner>
[ERROR] -> [Help 1]
org.apache.maven.lifecycle.LifecycleExecutionException: Failed to execute goal org.apache.maven.plugins:maven-compiler-plugin:3.3:testCompile (default-testCompile) on project activemq-client: Compilation failure
<https://builds.apache.org/job/ActiveMQ-Java8-5.14.x/ws/activemq-client/src/test/java/org/apache/activemq/thread/TaskRunnerFactoryTest.java>:[46,70] incompatible types: java.util.List<java.lang.Object> cannot be converted to java.util.List<org.apache.activemq.thread.TaskRunner>

        at org.apache.maven.lifecycle.internal.MojoExecutor.execute(MojoExecutor.java:212)
        at org.apache.maven.lifecycle.internal.MojoExecutor.execute(MojoExecutor.java:153)
        at org.apache.maven.lifecycle.internal.MojoExecutor.execute(MojoExecutor.java:145)
        at org.apache.maven.lifecycle.internal.LifecycleModuleBuilder.buildProject(LifecycleModuleBuilder.java:116)
        at org.apache.maven.lifecycle.internal.LifecycleModuleBuilder.buildProject(LifecycleModuleBuilder.java:80)
        at org.apache.maven.lifecycle.internal.builder.singlethreaded.SingleThreadedBuilder.build(SingleThreadedBuilder.java:51)
        at org.apache.maven.lifecycle.internal.LifecycleStarter.execute(LifecycleStarter.java:128)
        at org.apache.maven.DefaultMaven.doExecute(DefaultMaven.java:307)
        at org.apache.maven.DefaultMaven.doExecute(DefaultMaven.java:193)
        at org.apache.maven.DefaultMaven.execute(DefaultMaven.java:106)
        at org.jvnet.hudson.maven3.launcher.Maven33Launcher.main(Maven33Launcher.java:129)
        at sun.reflect.NativeMethodAccessorImpl.invoke0(Native Method)
        at sun.reflect.NativeMethodAccessorImpl.invoke(NativeMethodAccessorImpl.java:62)
        at sun.reflect.DelegatingMethodAccessorImpl.invoke(DelegatingMethodAccessorImpl.java:43)
        at java.lang.reflect.Method.invoke(Method.java:498)
        at org.codehaus.plexus.classworlds.launcher.Launcher.launchStandard(Launcher.java:330)
        at org.codehaus.plexus.classworlds.launcher.Launcher.launch(Launcher.java:238)
        at jenkins.maven3.agent.Maven33Main.launch(Maven33Main.java:176)
        at sun.reflect.NativeMethodAccessorImpl.invoke0(Native Method)
        at sun.reflect.NativeMethodAccessorImpl.invoke(NativeMethodAccessorImpl.java:62)
        at sun.reflect.DelegatingMethodAccessorImpl.invoke(DelegatingMethodAccessorImpl.java:43)
        at java.lang.reflect.Method.invoke(Method.java:498)
        at hudson.maven.Maven3Builder.call(Maven3Builder.java:139)
        at hudson.maven.Maven3Builder.call(Maven3Builder.java:70)
        at hudson.remoting.UserRequest.perform(UserRequest.java:153)
        at hudson.remoting.UserRequest.perform(UserRequest.java:50)
        at hudson.remoting.Request$2.run(Request.java:336)
        at hudson.remoting.InterceptingExecutorService$1.call(InterceptingExecutorService.java:68)
        at java.util.concurrent.FutureTask.run(FutureTask.java:266)
        at java.util.concurrent.ThreadPoolExecutor.runWorker(ThreadPoolExecutor.java:1142)
        at java.util.concurrent.ThreadPoolExecutor$Worker.run(ThreadPoolExecutor.java:617)
        at java.lang.Thread.run(Thread.java:745)
Caused by: org.apache.maven.plugin.compiler.CompilationFailureException: Compilation failure
<https://builds.apache.org/job/ActiveMQ-Java8-5.14.x/ws/activemq-client/src/test/java/org/apache/activemq/thread/TaskRunnerFactoryTest.java>:[46,70] incompatible types: java.util.List<java.lang.Object> cannot be converted to java.util.List<org.apache.activemq.thread.TaskRunner>

        at org.apache.maven.plugin.compiler.AbstractCompilerMojo.execute(AbstractCompilerMojo.java:911)
        at org.apache.maven.plugin.compiler.TestCompilerMojo.execute(TestCompilerMojo.java:153)
        at org.apache.maven.plugin.DefaultBuildPluginManager.executeMojo(DefaultBuildPluginManager.java:134)
        at org.apache.maven.lifecycle.internal.MojoExecutor.execute(MojoExecutor.java:207)
        ... 31 more
[ERROR]
[ERROR] Re-run Maven using the -X switch to enable full debug logging.
[ERROR]
[ERROR] For more information about the errors and possible solutions, please read the following articles:
[ERROR] [Help 1] http://cwiki.apache.org/confluence/display/MAVEN/MojoFailureException
[ERROR]
[ERROR] After correcting the problems, you can resume the build with the command
[ERROR]   mvn <goals> -rf :activemq-client
[JENKINS] Archiving <https://builds.apache.org/job/ActiveMQ-Java8-5.14.x/ws/activemq-kahadb-store/pom.xml> to org.apache.activemq/activemq-kahadb-store/5.14.4-SNAPSHOT/activemq-kahadb-store-5.14.4-SNAPSHOT.pom
[JENKINS] Archiving <https://builds.apache.org/job/ActiveMQ-Java8-5.14.x/ws/activemq-osgi/pom.xml> to org.apache.activemq/activemq-osgi/5.14.4-SNAPSHOT/activemq-osgi-5.14.4-SNAPSHOT.pom
[JENKINS] Archiving <https://builds.apache.org/job/ActiveMQ-Java8-5.14.x/ws/activemq-unit-tests/pom.xml> to org.apache.activemq/activemq-unit-tests/5.14.4-SNAPSHOT/activemq-unit-tests-5.14.4-SNAPSHOT.pom
Compressed 71.40 KB of artifacts by 44.8% relative to #32
[JENKINS] Archiving <https://builds.apache.org/job/ActiveMQ-Java8-5.14.x/ws/activemq-openwire-legacy/pom.xml> to org.apache.activemq/activemq-openwire-legacy/5.14.4-SNAPSHOT/activemq-openwire-legacy-5.14.4-SNAPSHOT.pom
[JENKINS] Archiving <https://builds.apache.org/job/ActiveMQ-Java8-5.14.x/ws/activemq-karaf-itest/pom.xml> to org.apache.activemq/activemq-karaf-itest/5.14.4-SNAPSHOT/activemq-karaf-itest-5.14.4-SNAPSHOT.pom
[JENKINS] Archiving <https://builds.apache.org/job/ActiveMQ-Java8-5.14.x/ws/activemq-rar/pom.xml> to org.apache.activemq/activemq-rar/5.14.4-SNAPSHOT/activemq-rar-5.14.4-SNAPSHOT.pom
[JENKINS] Archiving <https://builds.apache.org/job/ActiveMQ-Java8-5.14.x/ws/activemq-http/pom.xml> to org.apache.activemq/activemq-http/5.14.4-SNAPSHOT/activemq-http-5.14.4-SNAPSHOT.pom
[JENKINS] Archiving <https://builds.apache.org/job/ActiveMQ-Java8-5.14.x/ws/activemq-amqp/pom.xml> to org.apache.activemq/activemq-amqp/5.14.4-SNAPSHOT/activemq-amqp-5.14.4-SNAPSHOT.pom
[JENKINS] Archiving <https://builds.apache.org/job/ActiveMQ-Java8-5.14.x/ws/activemq-client/pom.xml> to org.apache.activemq/activemq-client/5.14.4-SNAPSHOT/activemq-client-5.14.4-SNAPSHOT.pom
[JENKINS] Archiving <https://builds.apache.org/job/ActiveMQ-Java8-5.14.x/ws/activemq-blueprint/pom.xml> to org.apache.activemq/activemq-blueprint/5.14.4-SNAPSHOT/activemq-blueprint-5.14.4-SNAPSHOT.pom
[JENKINS] Archiving <https://builds.apache.org/job/ActiveMQ-Java8-5.14.x/ws/activemq-blueprint/target/activemq-blueprint-5.14.4-SNAPSHOT.jar> to org.apache.activemq/activemq-blueprint/5.14.4-SNAPSHOT/activemq-blueprint-5.14.4-SNAPSHOT.jar
[JENKINS] Archiving <https://builds.apache.org/job/ActiveMQ-Java8-5.14.x/ws/activemq-blueprint/target/activemq-blueprint-5.14.4-SNAPSHOT-sources.jar> to org.apache.activemq/activemq-blueprint/5.14.4-SNAPSHOT/activemq-blueprint-5.14.4-SNAPSHOT-sources.jar
[JENKINS] Archiving <https://builds.apache.org/job/ActiveMQ-Java8-5.14.x/ws/activemq-tooling/activemq-junit/pom.xml> to org.apache.activemq.tooling/activemq-junit/5.14.4-SNAPSHOT/activemq-junit-5.14.4-SNAPSHOT.pom
[JENKINS] Archiving <https://builds.apache.org/job/ActiveMQ-Java8-5.14.x/ws/activemq-tooling/pom.xml> to org.apache.activemq.tooling/activemq-tooling/5.14.4-SNAPSHOT/activemq-tooling-5.14.4-SNAPSHOT.pom
[JENKINS] Archiving <https://builds.apache.org/job/ActiveMQ-Java8-5.14.x/ws/activemq-jms-pool/pom.xml> to org.apache.activemq/activemq-jms-pool/5.14.4-SNAPSHOT/activemq-jms-pool-5.14.4-SNAPSHOT.pom
[JENKINS] Archiving <https://builds.apache.org/job/ActiveMQ-Java8-5.14.x/ws/activemq-pool/pom.xml> to org.apache.activemq/activemq-pool/5.14.4-SNAPSHOT/activemq-pool-5.14.4-SNAPSHOT.pom
[JENKINS] Archiving <https://builds.apache.org/job/ActiveMQ-Java8-5.14.x/ws/activemq-jdbc-store/pom.xml> to org.apache.activemq/activemq-jdbc-store/5.14.4-SNAPSHOT/activemq-jdbc-store-5.14.4-SNAPSHOT.pom
[JENKINS] Archiving <https://builds.apache.org/job/ActiveMQ-Java8-5.14.x/ws/activemq-camel/pom.xml> to org.apache.activemq/activemq-camel/5.14.4-SNAPSHOT/activemq-camel-5.14.4-SNAPSHOT.pom
[JENKINS] Archiving <https://builds.apache.org/job/ActiveMQ-Java8-5.14.x/ws/activemq-runtime-config/pom.xml> to org.apache.activemq/activemq-runtime-config/5.14.4-SNAPSHOT/activemq-runtime-config-5.14.4-SNAPSHOT.pom
[JENKINS] Archiving <https://builds.apache.org/job/ActiveMQ-Java8-5.14.x/ws/pom.xml> to org.apache.activemq/activemq-parent/5.14.4-SNAPSHOT/activemq-parent-5.14.4-SNAPSHOT.pom
Compressed 59.92 KB of artifacts by 53.4% relative to #33
[JENKINS] Archiving <https://builds.apache.org/job/ActiveMQ-Java8-5.14.x/ws/activemq-stomp/pom.xml> to org.apache.activemq/activemq-stomp/5.14.4-SNAPSHOT/activemq-stomp-5.14.4-SNAPSHOT.pom
[JENKINS] Archiving <https://builds.apache.org/job/ActiveMQ-Java8-5.14.x/ws/activemq-openwire-generator/pom.xml> to org.apache.activemq/activemq-openwire-generator/5.14.4-SNAPSHOT/activemq-openwire-generator-5.14.4-SNAPSHOT.pom
[JENKINS] Archiving <https://builds.apache.org/job/ActiveMQ-Java8-5.14.x/ws/activemq-openwire-generator/target/activemq-openwire-generator-5.14.4-SNAPSHOT.jar> to org.apache.activemq/activemq-openwire-generator/5.14.4-SNAPSHOT/activemq-openwire-generator-5.14.4-SNAPSHOT.jar
[JENKINS] Archiving <https://builds.apache.org/job/ActiveMQ-Java8-5.14.x/ws/activemq-openwire-generator/target/activemq-openwire-generator-5.14.4-SNAPSHOT-sources.jar> to org.apache.activemq/activemq-openwire-generator/5.14.4-SNAPSHOT/activemq-openwire-generator-5.14.4-SNAPSHOT-sources.jar
[JENKINS] Archiving <https://builds.apache.org/job/ActiveMQ-Java8-5.14.x/ws/activemq-broker/pom.xml> to org.apache.activemq/activemq-broker/5.14.4-SNAPSHOT/activemq-broker-5.14.4-SNAPSHOT.pom
[JENKINS] Archiving <https://builds.apache.org/job/ActiveMQ-Java8-5.14.x/ws/activemq-web-demo/pom.xml> to org.apache.activemq/activemq-web-demo/5.14.4-SNAPSHOT/activemq-web-demo-5.14.4-SNAPSHOT.pom
[JENKINS] Archiving <https://builds.apache.org/job/ActiveMQ-Java8-5.14.x/ws/activemq-mqtt/pom.xml> to org.apache.activemq/activemq-mqtt/5.14.4-SNAPSHOT/activemq-mqtt-5.14.4-SNAPSHOT.pom
[JENKINS] Archiving <https://builds.apache.org/job/ActiveMQ-Java8-5.14.x/ws/activemq-shiro/pom.xml> to org.apache.activemq/activemq-shiro/5.14.4-SNAPSHOT/activemq-shiro-5.14.4-SNAPSHOT.pom
[JENKINS] Archiving <https://builds.apache.org/job/ActiveMQ-Java8-5.14.x/ws/activemq-tooling/activemq-perf-maven-plugin/pom.xml> to org.apache.activemq.tooling/activemq-perf-maven-plugin/5.14.4-SNAPSHOT/activemq-perf-maven-plugin-5.14.4-SNAPSHOT.pom
[JENKINS] Archiving <https://builds.apache.org/job/ActiveMQ-Java8-5.14.x/ws/activemq-run/pom.xml> to org.apache.activemq/activemq-run/5.14.4-SNAPSHOT/activemq-run-5.14.4-SNAPSHOT.pom
[JENKINS] Archiving <https://builds.apache.org/job/ActiveMQ-Java8-5.14.x/ws/activemq-tooling/activemq-maven-plugin/pom.xml> to org.apache.activemq.tooling/activemq-maven-plugin/5.14.4-SNAPSHOT/activemq-maven-plugin-5.14.4-SNAPSHOT.pom
[JENKINS] Archiving <https://builds.apache.org/job/ActiveMQ-Java8-5.14.x/ws/activemq-karaf/pom.xml> to org.apache.activemq/activemq-karaf/5.14.4-SNAPSHOT/activemq-karaf-5.14.4-SNAPSHOT.pom
[JENKINS] Archiving <https://builds.apache.org/job/ActiveMQ-Java8-5.14.x/ws/activemq-web-console/pom.xml> to org.apache.activemq/activemq-web-console/5.14.4-SNAPSHOT/activemq-web-console-5.14.4-SNAPSHOT.pom
[JENKINS] Archiving <https://builds.apache.org/job/ActiveMQ-Java8-5.14.x/ws/activemq-jaas/pom.xml> to org.apache.activemq/activemq-jaas/5.14.4-SNAPSHOT/activemq-jaas-5.14.4-SNAPSHOT.pom
[JENKINS] Archiving <https://builds.apache.org/job/ActiveMQ-Java8-5.14.x/ws/activemq-jaas/target/activemq-jaas-5.14.4-SNAPSHOT.jar> to org.apache.activemq/activemq-jaas/5.14.4-SNAPSHOT/activemq-jaas-5.14.4-SNAPSHOT.jar
[JENKINS] Archiving <https://builds.apache.org/job/ActiveMQ-Java8-5.14.x/ws/activemq-jaas/target/activemq-jaas-5.14.4-SNAPSHOT-sources.jar> to org.apache.activemq/activemq-jaas/5.14.4-SNAPSHOT/activemq-jaas-5.14.4-SNAPSHOT-sources.jar
[JENKINS] Archiving <https://builds.apache.org/job/ActiveMQ-Java8-5.14.x/ws/activemq-itests-spring31/pom.xml> to org.apache.activemq/activemq-itests-spring31/5.14.4-SNAPSHOT/activemq-itests-spring31-5.14.4-SNAPSHOT.pom
[JENKINS] Archiving <https://builds.apache.org/job/ActiveMQ-Java8-5.14.x/ws/activemq-tooling/activemq-memtest-maven-plugin/pom.xml> to org.apache.activemq.tooling/activemq-memtest-maven-plugin/5.14.4-SNAPSHOT/activemq-memtest-maven-plugin-5.14.4-SNAPSHOT.pom
[JENKINS] Archiving <https://builds.apache.org/job/ActiveMQ-Java8-5.14.x/ws/activemq-ra/pom.xml> to org.apache.activemq/activemq-ra/5.14.4-SNAPSHOT/activemq-ra-5.14.4-SNAPSHOT.pom
[JENKINS] Archiving <https://builds.apache.org/job/ActiveMQ-Java8-5.14.x/ws/activemq-partition/pom.xml> to org.apache.activemq/activemq-partition/5.14.4-SNAPSHOT/activemq-partition-5.14.4-SNAPSHOT.pom
[JENKINS] Archiving <https://builds.apache.org/job/ActiveMQ-Java8-5.14.x/ws/activemq-all/pom.xml> to org.apache.activemq/activemq-all/5.14.4-SNAPSHOT/activemq-all-5.14.4-SNAPSHOT.pom
[JENKINS] Archiving <https://builds.apache.org/job/ActiveMQ-Java8-5.14.x/ws/assembly/pom.xml> to org.apache.activemq/apache-activemq/5.14.4-SNAPSHOT/apache-activemq-5.14.4-SNAPSHOT.pom
[JENKINS] Archiving <https://builds.apache.org/job/ActiveMQ-Java8-5.14.x/ws/activemq-console/pom.xml> to org.apache.activemq/activemq-console/5.14.4-SNAPSHOT/activemq-console-5.14.4-SNAPSHOT.pom
[JENKINS] Archiving <https://builds.apache.org/job/ActiveMQ-Java8-5.14.x/ws/activemq-spring/pom.xml> to org.apache.activemq/activemq-spring/5.14.4-SNAPSHOT/activemq-spring-5.14.4-SNAPSHOT.pom
[JENKINS] Archiving <https://builds.apache.org/job/ActiveMQ-Java8-5.14.x/ws/activemq-cf/pom.xml> to org.apache.activemq/activemq-cf/5.14.4-SNAPSHOT/activemq-cf-5.14.4-SNAPSHOT.pom
[JENKINS] Archiving <https://builds.apache.org/job/ActiveMQ-Java8-5.14.x/ws/activemq-leveldb-store/pom.xml> to org.apache.activemq/activemq-leveldb-store/5.14.4-SNAPSHOT/activemq-leveldb-store-5.14.4-SNAPSHOT.pom
[JENKINS] Archiving <https://builds.apache.org/job/ActiveMQ-Java8-5.14.x/ws/activemq-web/pom.xml> to org.apache.activemq/activemq-web/5.14.4-SNAPSHOT/activemq-web-5.14.4-SNAPSHOT.pom
[JENKINS] Archiving <https://builds.apache.org/job/ActiveMQ-Java8-5.14.x/ws/activemq-log4j-appender/pom.xml> to org.apache.activemq/activemq-log4j-appender/5.14.4-SNAPSHOT/activemq-log4j-appender-5.14.4-SNAPSHOT.pom
Sending e-mails to: [hidden email]
[locks-and-latches] Releasing all the locks
[locks-and-latches] All the locks released
channel stopped
Reply | Threaded
Open this post in threaded view
|

Jenkins build is unstable: ActiveMQ-Java8-5.14.x #35

Apache Jenkins Server-2
Reply | Threaded
Open this post in threaded view
|

Jenkins build is still unstable: ActiveMQ-Java8-5.14.x #36

Apache Jenkins Server-2
Reply | Threaded
Open this post in threaded view
|

Jenkins build is still unstable: ActiveMQ-Java8-5.14.x #37

Apache Jenkins Server-2
Reply | Threaded
Open this post in threaded view
|

Jenkins build is still unstable: ActiveMQ-Java8-5.14.x #38

Apache Jenkins Server-2
Reply | Threaded
Open this post in threaded view
|

Build failed in Jenkins: ActiveMQ-Java8-5.14.x #39

Apache Jenkins Server-2
See <https://builds.apache.org/job/ActiveMQ-Java8-5.14.x/39/display/redirect?page=changes>

Changes:

[tabish121] [AMQ-6603] ensure failover does not track consumer creation that fails

[tabish121] AMQ-6603 Stop tracking producer if creation failed

------------------------------------------
[...truncated 243.47 KB...]
[INFO] --- maven-site-plugin:3.4:attach-descriptor (attach-descriptor) @ activemq-blueprint ---
[INFO]
[INFO] --- ianal-maven-plugin:1.0-alpha-1:verify-legal-files (default) @ activemq-blueprint ---
[INFO] Checking legal files in: activemq-blueprint-5.14.5-SNAPSHOT.jar
[INFO]
[INFO] --- maven-install-plugin:2.5.2:install (default-install) @ activemq-blueprint ---
[INFO] Installing <https://builds.apache.org/job/ActiveMQ-Java8-5.14.x/ws/activemq-blueprint/target/activemq-blueprint-5.14.5-SNAPSHOT.jar> to /home/jenkins/jenkins-slave/maven-repositories/1/org/apache/activemq/activemq-blueprint/5.14.5-SNAPSHOT/activemq-blueprint-5.14.5-SNAPSHOT.jar
[INFO] Installing <https://builds.apache.org/job/ActiveMQ-Java8-5.14.x/ws/activemq-blueprint/pom.xml> to /home/jenkins/jenkins-slave/maven-repositories/1/org/apache/activemq/activemq-blueprint/5.14.5-SNAPSHOT/activemq-blueprint-5.14.5-SNAPSHOT.pom
[INFO]
[INFO] --- maven-bundle-plugin:2.3.7:install (default-install) @ activemq-blueprint ---
[INFO] Installing org/apache/activemq/activemq-blueprint/5.14.5-SNAPSHOT/activemq-blueprint-5.14.5-SNAPSHOT.jar
[INFO] Writing OBR metadata
[INFO]
[INFO] >>> maven-source-plugin:2.4:jar (default-cli) > generate-sources @ activemq-blueprint >>>
[INFO]
[INFO] --- maven-enforcer-plugin:1.3.1:enforce (default) @ activemq-blueprint ---
[INFO]
[INFO] --- maven-bundle-plugin:2.3.7:cleanVersions (cleanVersions) @ activemq-blueprint ---
[WARNING] Failed to getClass for org.apache.maven.plugin.source.SourceJarMojo
[INFO]
[INFO] <<< maven-source-plugin:2.4:jar (default-cli) < generate-sources @ activemq-blueprint <<<
[INFO]
[INFO] --- maven-source-plugin:2.4:jar (default-cli) @ activemq-blueprint ---
[INFO] Building jar: <https://builds.apache.org/job/ActiveMQ-Java8-5.14.x/ws/activemq-blueprint/target/activemq-blueprint-5.14.5-SNAPSHOT-sources.jar>
[INFO]                                                                        
[INFO] ------------------------------------------------------------------------
[INFO] Skipping ActiveMQ :: Web Demo
[INFO] This project has been banned from the build due to previous failures.
[INFO] ------------------------------------------------------------------------
[INFO]                                                                        
[INFO] ------------------------------------------------------------------------
[INFO] Skipping ActiveMQ :: Web Console
[INFO] This project has been banned from the build due to previous failures.
[INFO] ------------------------------------------------------------------------
[INFO]                                                                        
[INFO] ------------------------------------------------------------------------
[INFO] Skipping ActiveMQ :: Karaf Integration Tests
[INFO] This project has been banned from the build due to previous failures.
[INFO] ------------------------------------------------------------------------
[INFO]                                                                        
[INFO] ------------------------------------------------------------------------
[INFO] Skipping ActiveMQ :: Integration Test :: Spring 3.1
[INFO] This project has been banned from the build due to previous failures.
[INFO] ------------------------------------------------------------------------
[INFO]                                                                        
[INFO] ------------------------------------------------------------------------
[INFO] Skipping ActiveMQ :: Assembly
[INFO] This project has been banned from the build due to previous failures.
[INFO] ------------------------------------------------------------------------
[INFO] ------------------------------------------------------------------------
[INFO] Reactor Summary:
[INFO]
[INFO] ActiveMQ ........................................... SUCCESS [  2.926 s]
[INFO] ActiveMQ :: Openwire Generator ..................... SUCCESS [  3.754 s]
[INFO] ActiveMQ :: Client ................................. SUCCESS [01:37 min]
[INFO] ActiveMQ :: Openwire Legacy Support ................ SUCCESS [  3.681 s]
[INFO] ActiveMQ :: JAAS ................................... SUCCESS [ 26.497 s]
[INFO] ActiveMQ :: Broker ................................. SUCCESS [01:18 min]
[INFO] ActiveMQ :: KahaDB Store ........................... SUCCESS [02:33 min]
[INFO] ActiveMQ :: STOMP Protocol ......................... SUCCESS [15:28 min]
[INFO] ActiveMQ :: MQTT Protocol .......................... SUCCESS [23:07 min]
[INFO] ActiveMQ :: JDBC Store ............................. SUCCESS [  2.872 s]
[INFO] ActiveMQ :: LevelDB Store .......................... SUCCESS [05:03 min]
[INFO] ActiveMQ :: Generic JMS Pool ....................... SUCCESS [ 51.539 s]
[INFO] ActiveMQ :: Pool ................................... FAILURE [  0.818 s]
[INFO] ActiveMQ :: RA ..................................... SUCCESS [02:31 min]
[INFO] ActiveMQ :: Spring ................................. SKIPPED
[INFO] ActiveMQ :: Console ................................ SUCCESS [  5.656 s]
[INFO] ActiveMQ :: Partition Management ................... SUCCESS [ 18.949 s]
[INFO] ActiveMQ :: Runtime Configuration .................. SKIPPED
[INFO] ActiveMQ :: Tooling ................................ SUCCESS [  0.729 s]
[INFO] ActiveMQ :: JUnit Rule ............................. SKIPPED
[INFO] ActiveMQ :: Unit Tests ............................. SKIPPED
[INFO] ActiveMQ :: HTTP Protocol Support .................. SKIPPED
[INFO] ActiveMQ :: AMQP ................................... SKIPPED
[INFO] ActiveMQ :: Camel .................................. SKIPPED
[INFO] ActiveMQ :: All JAR bundle ......................... SKIPPED
[INFO] ActiveMQ :: Log4j Appender ......................... SUCCESS [  5.292 s]
[INFO] ActiveMQ :: Apache Karaf ........................... SKIPPED
[INFO] ActiveMQ :: ConnectionFactory ...................... SUCCESS [  3.306 s]
[INFO] ActiveMQ :: RAR .................................... SKIPPED
[INFO] ActiveMQ :: Run Jar ................................ SUCCESS [  1.770 s]
[INFO] ActiveMQ :: Shiro .................................. SKIPPED
[INFO] ActiveMQ :: Memory Usage Test Plugin ............... SUCCESS [  2.862 s]
[INFO] ActiveMQ :: Performance Test Plugin ................ SKIPPED
[INFO] ActiveMQ :: StartUp/Stop Plugin .................... SKIPPED
[INFO] ActiveMQ :: Web .................................... SKIPPED
[INFO] ActiveMQ :: OSGi bundle ............................ SKIPPED
[INFO] ActiveMQ :: Blueprint .............................. SUCCESS [ 17.434 s]
[INFO] ActiveMQ :: Web Demo ............................... SKIPPED
[INFO] ActiveMQ :: Web Console ............................ SKIPPED
[INFO] ActiveMQ :: Karaf Integration Tests ................ SKIPPED
[INFO] ActiveMQ :: Integration Test :: Spring 3.1 ......... SKIPPED
[INFO] ActiveMQ :: Assembly ............................... SKIPPED
[INFO] ------------------------------------------------------------------------
[INFO] BUILD FAILURE
[INFO] ------------------------------------------------------------------------
[INFO] Total time: 54:38 min
[INFO] Finished at: 2017-03-01T10:24:06+00:00
[INFO] Final Memory: 108M/1420M
[INFO] ------------------------------------------------------------------------
Waiting for Jenkins to finish collecting data
[ERROR] Failed to execute goal org.apache.maven.plugins:maven-compiler-plugin:3.3:testCompile (default-testCompile) on project activemq-pool: Compilation failure: Compilation failure:
[ERROR] <https://builds.apache.org/job/ActiveMQ-Java8-5.14.x/ws/activemq-pool/src/test/java/org/apache/activemq/pool/PooledConsumerTest.java>:[19,30] package com.google.common.base does not exist
[ERROR] <https://builds.apache.org/job/ActiveMQ-Java8-5.14.x/ws/activemq-pool/src/test/java/org/apache/activemq/pool/PooledConsumerTest.java>:[125,33] cannot find symbol
[ERROR] symbol:   variable Strings
[ERROR] location: class org.apache.activemq.pool.PooledConsumerTest.PooledConsumer
[ERROR] <https://builds.apache.org/job/ActiveMQ-Java8-5.14.x/ws/activemq-pool/src/test/java/org/apache/activemq/pool/PooledConsumerTest.java>:[127,33] cannot find symbol
[ERROR] symbol:   variable Strings
[ERROR] location: class org.apache.activemq.pool.PooledConsumerTest.PooledConsumer
[ERROR] -> [Help 1]
org.apache.maven.lifecycle.LifecycleExecutionException: Failed to execute goal org.apache.maven.plugins:maven-compiler-plugin:3.3:testCompile (default-testCompile) on project activemq-pool: Compilation failure
        at org.apache.maven.lifecycle.internal.MojoExecutor.execute(MojoExecutor.java:212)
        at org.apache.maven.lifecycle.internal.MojoExecutor.execute(MojoExecutor.java:153)
        at org.apache.maven.lifecycle.internal.MojoExecutor.execute(MojoExecutor.java:145)
        at org.apache.maven.lifecycle.internal.LifecycleModuleBuilder.buildProject(LifecycleModuleBuilder.java:116)
        at org.apache.maven.lifecycle.internal.LifecycleModuleBuilder.buildProject(LifecycleModuleBuilder.java:80)
        at org.apache.maven.lifecycle.internal.builder.singlethreaded.SingleThreadedBuilder.build(SingleThreadedBuilder.java:51)
        at org.apache.maven.lifecycle.internal.LifecycleStarter.execute(LifecycleStarter.java:128)
        at org.apache.maven.DefaultMaven.doExecute(DefaultMaven.java:307)
        at org.apache.maven.DefaultMaven.doExecute(DefaultMaven.java:193)
        at org.apache.maven.DefaultMaven.execute(DefaultMaven.java:106)
        at org.jvnet.hudson.maven3.launcher.Maven33Launcher.main(Maven33Launcher.java:129)
        at sun.reflect.NativeMethodAccessorImpl.invoke0(Native Method)
        at sun.reflect.NativeMethodAccessorImpl.invoke(NativeMethodAccessorImpl.java:62)
        at sun.reflect.DelegatingMethodAccessorImpl.invoke(DelegatingMethodAccessorImpl.java:43)
        at java.lang.reflect.Method.invoke(Method.java:498)
        at org.codehaus.plexus.classworlds.launcher.Launcher.launchStandard(Launcher.java:330)
        at org.codehaus.plexus.classworlds.launcher.Launcher.launch(Launcher.java:238)
        at jenkins.maven3.agent.Maven33Main.launch(Maven33Main.java:176)
        at sun.reflect.NativeMethodAccessorImpl.invoke0(Native Method)
        at sun.reflect.NativeMethodAccessorImpl.invoke(NativeMethodAccessorImpl.java:62)
        at sun.reflect.DelegatingMethodAccessorImpl.invoke(DelegatingMethodAccessorImpl.java:43)
        at java.lang.reflect.Method.invoke(Method.java:498)
        at hudson.maven.Maven3Builder.call(Maven3Builder.java:139)
        at hudson.maven.Maven3Builder.call(Maven3Builder.java:70)
        at hudson.remoting.UserRequest.perform(UserRequest.java:153)
        at hudson.remoting.UserRequest.perform(UserRequest.java:50)
        at hudson.remoting.Request$2.run(Request.java:336)
        at hudson.remoting.InterceptingExecutorService$1.call(InterceptingExecutorService.java:68)
        at java.util.concurrent.FutureTask.run(FutureTask.java:266)
        at java.util.concurrent.ThreadPoolExecutor.runWorker(ThreadPoolExecutor.java:1142)
        at java.util.concurrent.ThreadPoolExecutor$Worker.run(ThreadPoolExecutor.java:617)
        at java.lang.Thread.run(Thread.java:745)
Caused by: org.apache.maven.plugin.compiler.CompilationFailureException: Compilation failure
        at org.apache.maven.plugin.compiler.AbstractCompilerMojo.execute(AbstractCompilerMojo.java:911)
        at org.apache.maven.plugin.compiler.TestCompilerMojo.execute(TestCompilerMojo.java:153)
        at org.apache.maven.plugin.DefaultBuildPluginManager.executeMojo(DefaultBuildPluginManager.java:134)
        at org.apache.maven.lifecycle.internal.MojoExecutor.execute(MojoExecutor.java:207)
        ... 31 more
[ERROR]
[ERROR] Re-run Maven using the -X switch to enable full debug logging.
[ERROR]
[ERROR] For more information about the errors and possible solutions, please read the following articles:
[ERROR] [Help 1] http://cwiki.apache.org/confluence/display/MAVEN/MojoFailureException
[ERROR]
[ERROR] After correcting the problems, you can resume the build with the command
[ERROR]   mvn <goals> -rf :activemq-pool
[JENKINS] Archiving <https://builds.apache.org/job/ActiveMQ-Java8-5.14.x/ws/activemq-kahadb-store/pom.xml> to org.apache.activemq/activemq-kahadb-store/5.14.5-SNAPSHOT/activemq-kahadb-store-5.14.5-SNAPSHOT.pom
[JENKINS] Archiving <https://builds.apache.org/job/ActiveMQ-Java8-5.14.x/ws/activemq-kahadb-store/target/activemq-kahadb-store-5.14.5-SNAPSHOT.jar> to org.apache.activemq/activemq-kahadb-store/5.14.5-SNAPSHOT/activemq-kahadb-store-5.14.5-SNAPSHOT.jar
[JENKINS] Archiving <https://builds.apache.org/job/ActiveMQ-Java8-5.14.x/ws/activemq-kahadb-store/target/activemq-kahadb-store-5.14.5-SNAPSHOT-sources.jar> to org.apache.activemq/activemq-kahadb-store/5.14.5-SNAPSHOT/activemq-kahadb-store-5.14.5-SNAPSHOT-sources.jar
[JENKINS] Archiving <https://builds.apache.org/job/ActiveMQ-Java8-5.14.x/ws/activemq-osgi/pom.xml> to org.apache.activemq/activemq-osgi/5.14.5-SNAPSHOT/activemq-osgi-5.14.5-SNAPSHOT.pom
[JENKINS] Archiving <https://builds.apache.org/job/ActiveMQ-Java8-5.14.x/ws/activemq-unit-tests/pom.xml> to org.apache.activemq/activemq-unit-tests/5.14.5-SNAPSHOT/activemq-unit-tests-5.14.5-SNAPSHOT.pom
Compressed 71.40 KB of artifacts by 44.8% relative to #38
[JENKINS] Archiving <https://builds.apache.org/job/ActiveMQ-Java8-5.14.x/ws/activemq-openwire-legacy/pom.xml> to org.apache.activemq/activemq-openwire-legacy/5.14.5-SNAPSHOT/activemq-openwire-legacy-5.14.5-SNAPSHOT.pom
[JENKINS] Archiving <https://builds.apache.org/job/ActiveMQ-Java8-5.14.x/ws/activemq-openwire-legacy/target/activemq-openwire-legacy-5.14.5-SNAPSHOT.jar> to org.apache.activemq/activemq-openwire-legacy/5.14.5-SNAPSHOT/activemq-openwire-legacy-5.14.5-SNAPSHOT.jar
[JENKINS] Archiving <https://builds.apache.org/job/ActiveMQ-Java8-5.14.x/ws/activemq-openwire-legacy/target/activemq-openwire-legacy-5.14.5-SNAPSHOT-sources.jar> to org.apache.activemq/activemq-openwire-legacy/5.14.5-SNAPSHOT/activemq-openwire-legacy-5.14.5-SNAPSHOT-sources.jar
[JENKINS] Archiving <https://builds.apache.org/job/ActiveMQ-Java8-5.14.x/ws/activemq-karaf-itest/pom.xml> to org.apache.activemq/activemq-karaf-itest/5.14.5-SNAPSHOT/activemq-karaf-itest-5.14.5-SNAPSHOT.pom
[JENKINS] Archiving <https://builds.apache.org/job/ActiveMQ-Java8-5.14.x/ws/activemq-rar/pom.xml> to org.apache.activemq/activemq-rar/5.14.5-SNAPSHOT/activemq-rar-5.14.5-SNAPSHOT.pom
[JENKINS] Archiving <https://builds.apache.org/job/ActiveMQ-Java8-5.14.x/ws/activemq-http/pom.xml> to org.apache.activemq/activemq-http/5.14.5-SNAPSHOT/activemq-http-5.14.5-SNAPSHOT.pom
[JENKINS] Archiving <https://builds.apache.org/job/ActiveMQ-Java8-5.14.x/ws/activemq-amqp/pom.xml> to org.apache.activemq/activemq-amqp/5.14.5-SNAPSHOT/activemq-amqp-5.14.5-SNAPSHOT.pom
[JENKINS] Archiving <https://builds.apache.org/job/ActiveMQ-Java8-5.14.x/ws/activemq-client/pom.xml> to org.apache.activemq/activemq-client/5.14.5-SNAPSHOT/activemq-client-5.14.5-SNAPSHOT.pom
[JENKINS] Archiving <https://builds.apache.org/job/ActiveMQ-Java8-5.14.x/ws/activemq-client/target/activemq-client-5.14.5-SNAPSHOT.jar> to org.apache.activemq/activemq-client/5.14.5-SNAPSHOT/activemq-client-5.14.5-SNAPSHOT.jar
[JENKINS] Archiving <https://builds.apache.org/job/ActiveMQ-Java8-5.14.x/ws/activemq-client/target/activemq-client-5.14.5-SNAPSHOT-sources.jar> to org.apache.activemq/activemq-client/5.14.5-SNAPSHOT/activemq-client-5.14.5-SNAPSHOT-sources.jar
[JENKINS] Archiving <https://builds.apache.org/job/ActiveMQ-Java8-5.14.x/ws/activemq-blueprint/pom.xml> to org.apache.activemq/activemq-blueprint/5.14.5-SNAPSHOT/activemq-blueprint-5.14.5-SNAPSHOT.pom
[JENKINS] Archiving <https://builds.apache.org/job/ActiveMQ-Java8-5.14.x/ws/activemq-blueprint/target/activemq-blueprint-5.14.5-SNAPSHOT.jar> to org.apache.activemq/activemq-blueprint/5.14.5-SNAPSHOT/activemq-blueprint-5.14.5-SNAPSHOT.jar
[JENKINS] Archiving <https://builds.apache.org/job/ActiveMQ-Java8-5.14.x/ws/activemq-blueprint/target/activemq-blueprint-5.14.5-SNAPSHOT-sources.jar> to org.apache.activemq/activemq-blueprint/5.14.5-SNAPSHOT/activemq-blueprint-5.14.5-SNAPSHOT-sources.jar
[JENKINS] Archiving <https://builds.apache.org/job/ActiveMQ-Java8-5.14.x/ws/activemq-tooling/activemq-junit/pom.xml> to org.apache.activemq.tooling/activemq-junit/5.14.5-SNAPSHOT/activemq-junit-5.14.5-SNAPSHOT.pom
[JENKINS] Archiving <https://builds.apache.org/job/ActiveMQ-Java8-5.14.x/ws/activemq-tooling/pom.xml> to org.apache.activemq.tooling/activemq-tooling/5.14.5-SNAPSHOT/activemq-tooling-5.14.5-SNAPSHOT.pom
[JENKINS] Archiving <https://builds.apache.org/job/ActiveMQ-Java8-5.14.x/ws/activemq-jms-pool/pom.xml> to org.apache.activemq/activemq-jms-pool/5.14.5-SNAPSHOT/activemq-jms-pool-5.14.5-SNAPSHOT.pom
[JENKINS] Archiving <https://builds.apache.org/job/ActiveMQ-Java8-5.14.x/ws/activemq-jms-pool/target/activemq-jms-pool-5.14.5-SNAPSHOT.jar> to org.apache.activemq/activemq-jms-pool/5.14.5-SNAPSHOT/activemq-jms-pool-5.14.5-SNAPSHOT.jar
[JENKINS] Archiving <https://builds.apache.org/job/ActiveMQ-Java8-5.14.x/ws/activemq-jms-pool/target/activemq-jms-pool-5.14.5-SNAPSHOT-sources.jar> to org.apache.activemq/activemq-jms-pool/5.14.5-SNAPSHOT/activemq-jms-pool-5.14.5-SNAPSHOT-sources.jar
[JENKINS] Archiving <https://builds.apache.org/job/ActiveMQ-Java8-5.14.x/ws/activemq-pool/pom.xml> to org.apache.activemq/activemq-pool/5.14.5-SNAPSHOT/activemq-pool-5.14.5-SNAPSHOT.pom
[JENKINS] Archiving <https://builds.apache.org/job/ActiveMQ-Java8-5.14.x/ws/activemq-jdbc-store/pom.xml> to org.apache.activemq/activemq-jdbc-store/5.14.5-SNAPSHOT/activemq-jdbc-store-5.14.5-SNAPSHOT.pom
[JENKINS] Archiving <https://builds.apache.org/job/ActiveMQ-Java8-5.14.x/ws/activemq-jdbc-store/target/activemq-jdbc-store-5.14.5-SNAPSHOT.jar> to org.apache.activemq/activemq-jdbc-store/5.14.5-SNAPSHOT/activemq-jdbc-store-5.14.5-SNAPSHOT.jar
[JENKINS] Archiving <https://builds.apache.org/job/ActiveMQ-Java8-5.14.x/ws/activemq-jdbc-store/target/activemq-jdbc-store-5.14.5-SNAPSHOT-sources.jar> to org.apache.activemq/activemq-jdbc-store/5.14.5-SNAPSHOT/activemq-jdbc-store-5.14.5-SNAPSHOT-sources.jar
[JENKINS] Archiving <https://builds.apache.org/job/ActiveMQ-Java8-5.14.x/ws/activemq-camel/pom.xml> to org.apache.activemq/activemq-camel/5.14.5-SNAPSHOT/activemq-camel-5.14.5-SNAPSHOT.pom
[JENKINS] Archiving <https://builds.apache.org/job/ActiveMQ-Java8-5.14.x/ws/activemq-runtime-config/pom.xml> to org.apache.activemq/activemq-runtime-config/5.14.5-SNAPSHOT/activemq-runtime-config-5.14.5-SNAPSHOT.pom
[JENKINS] Archiving <https://builds.apache.org/job/ActiveMQ-Java8-5.14.x/ws/pom.xml> to org.apache.activemq/activemq-parent/5.14.5-SNAPSHOT/activemq-parent-5.14.5-SNAPSHOT.pom
Compressed 59.92 KB of artifacts by 53.4% relative to #38
[JENKINS] Archiving <https://builds.apache.org/job/ActiveMQ-Java8-5.14.x/ws/activemq-stomp/pom.xml> to org.apache.activemq/activemq-stomp/5.14.5-SNAPSHOT/activemq-stomp-5.14.5-SNAPSHOT.pom
[JENKINS] Archiving <https://builds.apache.org/job/ActiveMQ-Java8-5.14.x/ws/activemq-stomp/target/activemq-stomp-5.14.5-SNAPSHOT.jar> to org.apache.activemq/activemq-stomp/5.14.5-SNAPSHOT/activemq-stomp-5.14.5-SNAPSHOT.jar
[JENKINS] Archiving <https://builds.apache.org/job/ActiveMQ-Java8-5.14.x/ws/activemq-stomp/target/activemq-stomp-5.14.5-SNAPSHOT-sources.jar> to org.apache.activemq/activemq-stomp/5.14.5-SNAPSHOT/activemq-stomp-5.14.5-SNAPSHOT-sources.jar
[JENKINS] Archiving <https://builds.apache.org/job/ActiveMQ-Java8-5.14.x/ws/activemq-openwire-generator/pom.xml> to org.apache.activemq/activemq-openwire-generator/5.14.5-SNAPSHOT/activemq-openwire-generator-5.14.5-SNAPSHOT.pom
[JENKINS] Archiving <https://builds.apache.org/job/ActiveMQ-Java8-5.14.x/ws/activemq-openwire-generator/target/activemq-openwire-generator-5.14.5-SNAPSHOT.jar> to org.apache.activemq/activemq-openwire-generator/5.14.5-SNAPSHOT/activemq-openwire-generator-5.14.5-SNAPSHOT.jar
[JENKINS] Archiving <https://builds.apache.org/job/ActiveMQ-Java8-5.14.x/ws/activemq-openwire-generator/target/activemq-openwire-generator-5.14.5-SNAPSHOT-sources.jar> to org.apache.activemq/activemq-openwire-generator/5.14.5-SNAPSHOT/activemq-openwire-generator-5.14.5-SNAPSHOT-sources.jar
[JENKINS] Archiving <https://builds.apache.org/job/ActiveMQ-Java8-5.14.x/ws/activemq-broker/pom.xml> to org.apache.activemq/activemq-broker/5.14.5-SNAPSHOT/activemq-broker-5.14.5-SNAPSHOT.pom
[JENKINS] Archiving <https://builds.apache.org/job/ActiveMQ-Java8-5.14.x/ws/activemq-broker/target/activemq-broker-5.14.5-SNAPSHOT.jar> to org.apache.activemq/activemq-broker/5.14.5-SNAPSHOT/activemq-broker-5.14.5-SNAPSHOT.jar
[JENKINS] Archiving <https://builds.apache.org/job/ActiveMQ-Java8-5.14.x/ws/activemq-broker/target/activemq-broker-5.14.5-SNAPSHOT-tests.jar> to org.apache.activemq/activemq-broker/5.14.5-SNAPSHOT/activemq-broker-5.14.5-SNAPSHOT-tests.jar
[JENKINS] Archiving <https://builds.apache.org/job/ActiveMQ-Java8-5.14.x/ws/activemq-broker/target/activemq-broker-5.14.5-SNAPSHOT-sources.jar> to org.apache.activemq/activemq-broker/5.14.5-SNAPSHOT/activemq-broker-5.14.5-SNAPSHOT-sources.jar
[JENKINS] Archiving <https://builds.apache.org/job/ActiveMQ-Java8-5.14.x/ws/activemq-web-demo/pom.xml> to org.apache.activemq/activemq-web-demo/5.14.5-SNAPSHOT/activemq-web-demo-5.14.5-SNAPSHOT.pom
[JENKINS] Archiving <https://builds.apache.org/job/ActiveMQ-Java8-5.14.x/ws/activemq-mqtt/pom.xml> to org.apache.activemq/activemq-mqtt/5.14.5-SNAPSHOT/activemq-mqtt-5.14.5-SNAPSHOT.pom
[JENKINS] Archiving <https://builds.apache.org/job/ActiveMQ-Java8-5.14.x/ws/activemq-mqtt/target/activemq-mqtt-5.14.5-SNAPSHOT.jar> to org.apache.activemq/activemq-mqtt/5.14.5-SNAPSHOT/activemq-mqtt-5.14.5-SNAPSHOT.jar
[JENKINS] Archiving <https://builds.apache.org/job/ActiveMQ-Java8-5.14.x/ws/activemq-mqtt/target/activemq-mqtt-5.14.5-SNAPSHOT-sources.jar> to org.apache.activemq/activemq-mqtt/5.14.5-SNAPSHOT/activemq-mqtt-5.14.5-SNAPSHOT-sources.jar
[JENKINS] Archiving <https://builds.apache.org/job/ActiveMQ-Java8-5.14.x/ws/activemq-shiro/pom.xml> to org.apache.activemq/activemq-shiro/5.14.5-SNAPSHOT/activemq-shiro-5.14.5-SNAPSHOT.pom
[JENKINS] Archiving <https://builds.apache.org/job/ActiveMQ-Java8-5.14.x/ws/activemq-tooling/activemq-perf-maven-plugin/pom.xml> to org.apache.activemq.tooling/activemq-perf-maven-plugin/5.14.5-SNAPSHOT/activemq-perf-maven-plugin-5.14.5-SNAPSHOT.pom
[JENKINS] Archiving <https://builds.apache.org/job/ActiveMQ-Java8-5.14.x/ws/activemq-run/dependency-reduced-pom.xml> to org.apache.activemq/activemq-run/5.14.5-SNAPSHOT/activemq-run-5.14.5-SNAPSHOT.pom
[JENKINS] Archiving <https://builds.apache.org/job/ActiveMQ-Java8-5.14.x/ws/activemq-run/target/activemq-run-5.14.5-SNAPSHOT.jar> to org.apache.activemq/activemq-run/5.14.5-SNAPSHOT/activemq-run-5.14.5-SNAPSHOT.jar
[JENKINS] Archiving <https://builds.apache.org/job/ActiveMQ-Java8-5.14.x/ws/activemq-run/target/activemq-run-5.14.5-SNAPSHOT-sources.jar> to org.apache.activemq/activemq-run/5.14.5-SNAPSHOT/activemq-run-5.14.5-SNAPSHOT-sources.jar
[JENKINS] Archiving <https://builds.apache.org/job/ActiveMQ-Java8-5.14.x/ws/activemq-tooling/activemq-maven-plugin/pom.xml> to org.apache.activemq.tooling/activemq-maven-plugin/5.14.5-SNAPSHOT/activemq-maven-plugin-5.14.5-SNAPSHOT.pom
[JENKINS] Archiving <https://builds.apache.org/job/ActiveMQ-Java8-5.14.x/ws/activemq-karaf/pom.xml> to org.apache.activemq/activemq-karaf/5.14.5-SNAPSHOT/activemq-karaf-5.14.5-SNAPSHOT.pom
[JENKINS] Archiving <https://builds.apache.org/job/ActiveMQ-Java8-5.14.x/ws/activemq-web-console/pom.xml> to org.apache.activemq/activemq-web-console/5.14.5-SNAPSHOT/activemq-web-console-5.14.5-SNAPSHOT.pom
[JENKINS] Archiving <https://builds.apache.org/job/ActiveMQ-Java8-5.14.x/ws/activemq-jaas/pom.xml> to org.apache.activemq/activemq-jaas/5.14.5-SNAPSHOT/activemq-jaas-5.14.5-SNAPSHOT.pom
[JENKINS] Archiving <https://builds.apache.org/job/ActiveMQ-Java8-5.14.x/ws/activemq-jaas/target/activemq-jaas-5.14.5-SNAPSHOT.jar> to org.apache.activemq/activemq-jaas/5.14.5-SNAPSHOT/activemq-jaas-5.14.5-SNAPSHOT.jar
[JENKINS] Archiving <https://builds.apache.org/job/ActiveMQ-Java8-5.14.x/ws/activemq-jaas/target/activemq-jaas-5.14.5-SNAPSHOT-sources.jar> to org.apache.activemq/activemq-jaas/5.14.5-SNAPSHOT/activemq-jaas-5.14.5-SNAPSHOT-sources.jar
[JENKINS] Archiving <https://builds.apache.org/job/ActiveMQ-Java8-5.14.x/ws/activemq-itests-spring31/pom.xml> to org.apache.activemq/activemq-itests-spring31/5.14.5-SNAPSHOT/activemq-itests-spring31-5.14.5-SNAPSHOT.pom
[JENKINS] Archiving <https://builds.apache.org/job/ActiveMQ-Java8-5.14.x/ws/activemq-tooling/activemq-memtest-maven-plugin/pom.xml> to org.apache.activemq.tooling/activemq-memtest-maven-plugin/5.14.5-SNAPSHOT/activemq-memtest-maven-plugin-5.14.5-SNAPSHOT.pom
[JENKINS] Archiving <https://builds.apache.org/job/ActiveMQ-Java8-5.14.x/ws/activemq-tooling/activemq-memtest-maven-plugin/target/activemq-memtest-maven-plugin-5.14.5-SNAPSHOT.jar> to org.apache.activemq.tooling/activemq-memtest-maven-plugin/5.14.5-SNAPSHOT/activemq-memtest-maven-plugin-5.14.5-SNAPSHOT.jar
[JENKINS] Archiving <https://builds.apache.org/job/ActiveMQ-Java8-5.14.x/ws/activemq-tooling/activemq-memtest-maven-plugin/target/activemq-memtest-maven-plugin-5.14.5-SNAPSHOT-sources.jar> to org.apache.activemq.tooling/activemq-memtest-maven-plugin/5.14.5-SNAPSHOT/activemq-memtest-maven-plugin-5.14.5-SNAPSHOT-sources.jar
[JENKINS] Archiving <https://builds.apache.org/job/ActiveMQ-Java8-5.14.x/ws/activemq-ra/pom.xml> to org.apache.activemq/activemq-ra/5.14.5-SNAPSHOT/activemq-ra-5.14.5-SNAPSHOT.pom
[JENKINS] Archiving <https://builds.apache.org/job/ActiveMQ-Java8-5.14.x/ws/activemq-ra/target/activemq-ra-5.14.5-SNAPSHOT.jar> to org.apache.activemq/activemq-ra/5.14.5-SNAPSHOT/activemq-ra-5.14.5-SNAPSHOT.jar
[JENKINS] Archiving <https://builds.apache.org/job/ActiveMQ-Java8-5.14.x/ws/activemq-ra/target/xbean/activemq-ra.xsd> to org.apache.activemq/activemq-ra/5.14.5-SNAPSHOT/activemq-ra-5.14.5-SNAPSHOT.xsd
[JENKINS] Archiving <https://builds.apache.org/job/ActiveMQ-Java8-5.14.x/ws/activemq-ra/target/xbean/activemq-ra.xsd.html> to org.apache.activemq/activemq-ra/5.14.5-SNAPSHOT/activemq-ra-5.14.5-SNAPSHOT-schema.html
[JENKINS] Archiving <https://builds.apache.org/job/ActiveMQ-Java8-5.14.x/ws/activemq-ra/target/xbean/activemq-ra.xsd.html> to org.apache.activemq/activemq-ra/5.14.5-SNAPSHOT/activemq-ra-5.14.5-SNAPSHOT.xsd.html
[JENKINS] Archiving <https://builds.apache.org/job/ActiveMQ-Java8-5.14.x/ws/activemq-ra/target/activemq-ra-5.14.5-SNAPSHOT-sources.jar> to org.apache.activemq/activemq-ra/5.14.5-SNAPSHOT/activemq-ra-5.14.5-SNAPSHOT-sources.jar
[JENKINS] Archiving <https://builds.apache.org/job/ActiveMQ-Java8-5.14.x/ws/activemq-partition/pom.xml> to org.apache.activemq/activemq-partition/5.14.5-SNAPSHOT/activemq-partition-5.14.5-SNAPSHOT.pom
[JENKINS] Archiving <https://builds.apache.org/job/ActiveMQ-Java8-5.14.x/ws/activemq-partition/target/activemq-partition-5.14.5-SNAPSHOT.jar> to org.apache.activemq/activemq-partition/5.14.5-SNAPSHOT/activemq-partition-5.14.5-SNAPSHOT.jar
[JENKINS] Archiving <https://builds.apache.org/job/ActiveMQ-Java8-5.14.x/ws/activemq-partition/target/activemq-partition-5.14.5-SNAPSHOT-sources.jar> to org.apache.activemq/activemq-partition/5.14.5-SNAPSHOT/activemq-partition-5.14.5-SNAPSHOT-sources.jar
[JENKINS] Archiving <https://builds.apache.org/job/ActiveMQ-Java8-5.14.x/ws/activemq-all/pom.xml> to org.apache.activemq/activemq-all/5.14.5-SNAPSHOT/activemq-all-5.14.5-SNAPSHOT.pom
[JENKINS] Archiving <https://builds.apache.org/job/ActiveMQ-Java8-5.14.x/ws/assembly/pom.xml> to org.apache.activemq/apache-activemq/5.14.5-SNAPSHOT/apache-activemq-5.14.5-SNAPSHOT.pom
[JENKINS] Archiving <https://builds.apache.org/job/ActiveMQ-Java8-5.14.x/ws/activemq-console/pom.xml> to org.apache.activemq/activemq-console/5.14.5-SNAPSHOT/activemq-console-5.14.5-SNAPSHOT.pom
[JENKINS] Archiving <https://builds.apache.org/job/ActiveMQ-Java8-5.14.x/ws/activemq-console/target/activemq-console-5.14.5-SNAPSHOT.jar> to org.apache.activemq/activemq-console/5.14.5-SNAPSHOT/activemq-console-5.14.5-SNAPSHOT.jar
[JENKINS] Archiving <https://builds.apache.org/job/ActiveMQ-Java8-5.14.x/ws/activemq-console/target/activemq-console-5.14.5-SNAPSHOT-sources.jar> to org.apache.activemq/activemq-console/5.14.5-SNAPSHOT/activemq-console-5.14.5-SNAPSHOT-sources.jar
[JENKINS] Archiving <https://builds.apache.org/job/ActiveMQ-Java8-5.14.x/ws/activemq-spring/pom.xml> to org.apache.activemq/activemq-spring/5.14.5-SNAPSHOT/activemq-spring-5.14.5-SNAPSHOT.pom
[JENKINS] Archiving <https://builds.apache.org/job/ActiveMQ-Java8-5.14.x/ws/activemq-cf/pom.xml> to org.apache.activemq/activemq-cf/5.14.5-SNAPSHOT/activemq-cf-5.14.5-SNAPSHOT.pom
[JENKINS] Archiving <https://builds.apache.org/job/ActiveMQ-Java8-5.14.x/ws/activemq-cf/target/activemq-cf-5.14.5-SNAPSHOT.jar> to org.apache.activemq/activemq-cf/5.14.5-SNAPSHOT/activemq-cf-5.14.5-SNAPSHOT.jar
[JENKINS] Archiving <https://builds.apache.org/job/ActiveMQ-Java8-5.14.x/ws/activemq-cf/target/activemq-cf-5.14.5-SNAPSHOT-sources.jar> to org.apache.activemq/activemq-cf/5.14.5-SNAPSHOT/activemq-cf-5.14.5-SNAPSHOT-sources.jar
[JENKINS] Archiving <https://builds.apache.org/job/ActiveMQ-Java8-5.14.x/ws/activemq-leveldb-store/pom.xml> to org.apache.activemq/activemq-leveldb-store/5.14.5-SNAPSHOT/activemq-leveldb-store-5.14.5-SNAPSHOT.pom
[JENKINS] Archiving <https://builds.apache.org/job/ActiveMQ-Java8-5.14.x/ws/activemq-leveldb-store/target/activemq-leveldb-store-5.14.5-SNAPSHOT.jar> to org.apache.activemq/activemq-leveldb-store/5.14.5-SNAPSHOT/activemq-leveldb-store-5.14.5-SNAPSHOT.jar
[JENKINS] Archiving <https://builds.apache.org/job/ActiveMQ-Java8-5.14.x/ws/activemq-leveldb-store/target/activemq-leveldb-store-5.14.5-SNAPSHOT-sources.jar> to org.apache.activemq/activemq-leveldb-store/5.14.5-SNAPSHOT/activemq-leveldb-store-5.14.5-SNAPSHOT-sources.jar
[JENKINS] Archiving <https://builds.apache.org/job/ActiveMQ-Java8-5.14.x/ws/activemq-web/pom.xml> to org.apache.activemq/activemq-web/5.14.5-SNAPSHOT/activemq-web-5.14.5-SNAPSHOT.pom
[JENKINS] Archiving <https://builds.apache.org/job/ActiveMQ-Java8-5.14.x/ws/activemq-log4j-appender/pom.xml> to org.apache.activemq/activemq-log4j-appender/5.14.5-SNAPSHOT/activemq-log4j-appender-5.14.5-SNAPSHOT.pom
[JENKINS] Archiving <https://builds.apache.org/job/ActiveMQ-Java8-5.14.x/ws/activemq-log4j-appender/target/activemq-log4j-appender-5.14.5-SNAPSHOT.jar> to org.apache.activemq/activemq-log4j-appender/5.14.5-SNAPSHOT/activemq-log4j-appender-5.14.5-SNAPSHOT.jar
[JENKINS] Archiving <https://builds.apache.org/job/ActiveMQ-Java8-5.14.x/ws/activemq-log4j-appender/target/activemq-log4j-appender-5.14.5-SNAPSHOT-sources.jar> to org.apache.activemq/activemq-log4j-appender/5.14.5-SNAPSHOT/activemq-log4j-appender-5.14.5-SNAPSHOT-sources.jar
Sending e-mails to: [hidden email]
Sending e-mails to: [hidden email]
[locks-and-latches] Releasing all the locks
[locks-and-latches] All the locks released
channel stopped
Reply | Threaded
Open this post in threaded view
|

Jenkins build is unstable: ActiveMQ-Java8-5.14.x #40

Apache Jenkins Server-2
Reply | Threaded
Open this post in threaded view
|

Jenkins build is still unstable: ActiveMQ-Java8-5.14.x #41

Apache Jenkins Server-2
Reply | Threaded
Open this post in threaded view
|

Jenkins build is still unstable: ActiveMQ-Java8-5.14.x #42

Apache Jenkins Server-2
Reply | Threaded
Open this post in threaded view
|

Jenkins build is still unstable: ActiveMQ-Java8-5.14.x #43

Apache Jenkins Server-2
Reply | Threaded
Open this post in threaded view
|

Jenkins build is still unstable: ActiveMQ-Java8-5.14.x #44

Apache Jenkins Server-2
Reply | Threaded
Open this post in threaded view
|

Jenkins build is still unstable: ActiveMQ-Java8-5.14.x #45

Apache Jenkins Server-2
1234