Jenkins build is unstable: ActiveMQ-Java8 #1333

classic Classic list List threaded Threaded
55 messages Options
123
Reply | Threaded
Open this post in threaded view
|

Jenkins build is still unstable: ActiveMQ-Java8 #1353

Apache Jenkins Server-2
Reply | Threaded
Open this post in threaded view
|

Jenkins build is still unstable: ActiveMQ-Java8 #1354

Apache Jenkins Server-2
Reply | Threaded
Open this post in threaded view
|

Jenkins build is still unstable: ActiveMQ-Java8 #1355

Apache Jenkins Server-2
Reply | Threaded
Open this post in threaded view
|

Jenkins build is still unstable: ActiveMQ-Java8 #1356

Apache Jenkins Server-2
Reply | Threaded
Open this post in threaded view
|

Jenkins build is still unstable: ActiveMQ-Java8 #1357

Apache Jenkins Server-2
Reply | Threaded
Open this post in threaded view
|

Jenkins build is still unstable: ActiveMQ-Java8 #1358

Apache Jenkins Server-2
Reply | Threaded
Open this post in threaded view
|

Jenkins build is still unstable: ActiveMQ-Java8 #1359

Apache Jenkins Server-2
Reply | Threaded
Open this post in threaded view
|

Jenkins build is still unstable: ActiveMQ-Java8 #1360

Apache Jenkins Server-2
Reply | Threaded
Open this post in threaded view
|

Jenkins build is still unstable: ActiveMQ-Java8 #1361

Apache Jenkins Server-2
Reply | Threaded
Open this post in threaded view
|

Build failed in Jenkins: ActiveMQ-Java8 #1362

Apache Jenkins Server-2
See <https://builds.apache.org/job/ActiveMQ-Java8/1362/display/redirect?page=changes>

Changes:

[pascalschumacher] BrokerService: fix typo in field and parameter name

[chipitsine] AMQ-6904 add overrides for ms sql

[asutosh.pandya] AMQ-6905 : Upgraded ActivationConfigProperty as per API Documentation

[jbonofre] [AMQ-7252] Upgrade to Velocity 2.1

[jbonofre] [AMQ-7310] Upgrade to Tomcat API 9.0.27

[jbonofre] AMQ-6908 allow use of ActiveMQ console login credential (for

[jbonofre] [AMQ-6556] Support system property proxy settings for HTTP(S) client

[jbonofre] [AMQ-7345] Upgrade to jackson-databind 2.9.10.1

[jbonofre] [AMQ-7329] Fix exclusion in activemq-osgi

[jbonofre] [AMQ-7008] Add index on messages table to speed up browsing


------------------------------------------
[...truncated 2.02 MB...]
    at sun.reflect.DelegatingMethodAccessorImpl.invoke (DelegatingMethodAccessorImpl.java:43)
    at java.lang.reflect.Method.invoke (Method.java:498)
    at hudson.maven.Maven3Builder.call (Maven3Builder.java:139)
    at hudson.maven.Maven3Builder.call (Maven3Builder.java:70)
    at hudson.remoting.UserRequest.perform (UserRequest.java:212)
    at hudson.remoting.UserRequest.perform (UserRequest.java:54)
    at hudson.remoting.Request$2.run (Request.java:369)
    at hudson.remoting.InterceptingExecutorService$1.call (InterceptingExecutorService.java:72)
    at java.util.concurrent.FutureTask.run (FutureTask.java:266)
    at java.util.concurrent.ThreadPoolExecutor.runWorker (ThreadPoolExecutor.java:1149)
    at java.util.concurrent.ThreadPoolExecutor$Worker.run (ThreadPoolExecutor.java:624)
    at java.lang.Thread.run (Thread.java:748)
Caused by: org.apache.maven.plugin.PluginExecutionException: Execution process-resource-bundles of goal org.apache.maven.plugins:maven-remote-resources-plugin:1.5:process failed.
    at org.apache.maven.plugin.DefaultBuildPluginManager.executeMojo (DefaultBuildPluginManager.java:148)
    at org.apache.maven.lifecycle.internal.MojoExecutor.execute (MojoExecutor.java:210)
    at org.apache.maven.lifecycle.internal.MojoExecutor.execute (MojoExecutor.java:156)
    at org.apache.maven.lifecycle.internal.MojoExecutor.execute (MojoExecutor.java:148)
    at org.apache.maven.lifecycle.internal.LifecycleModuleBuilder.buildProject (LifecycleModuleBuilder.java:117)
    at org.apache.maven.lifecycle.internal.LifecycleModuleBuilder.buildProject (LifecycleModuleBuilder.java:81)
    at org.apache.maven.lifecycle.internal.builder.singlethreaded.SingleThreadedBuilder.build (SingleThreadedBuilder.java:56)
    at org.apache.maven.lifecycle.internal.LifecycleStarter.execute (LifecycleStarter.java:128)
    at org.apache.maven.DefaultMaven.doExecute (DefaultMaven.java:305)
    at org.apache.maven.DefaultMaven.doExecute (DefaultMaven.java:192)
    at org.apache.maven.DefaultMaven.execute (DefaultMaven.java:105)
    at org.jvnet.hudson.maven3.launcher.Maven35Launcher.main (Maven35Launcher.java:130)
    at sun.reflect.NativeMethodAccessorImpl.invoke0 (Native Method)
    at sun.reflect.NativeMethodAccessorImpl.invoke (NativeMethodAccessorImpl.java:62)
    at sun.reflect.DelegatingMethodAccessorImpl.invoke (DelegatingMethodAccessorImpl.java:43)
    at java.lang.reflect.Method.invoke (Method.java:498)
    at org.codehaus.plexus.classworlds.launcher.Launcher.launchEnhanced (Launcher.java:282)
    at org.codehaus.plexus.classworlds.launcher.Launcher.launch (Launcher.java:225)
    at jenkins.maven3.agent.Maven35Main.launch (Maven35Main.java:178)
    at sun.reflect.NativeMethodAccessorImpl.invoke0 (Native Method)
    at sun.reflect.NativeMethodAccessorImpl.invoke (NativeMethodAccessorImpl.java:62)
    at sun.reflect.DelegatingMethodAccessorImpl.invoke (DelegatingMethodAccessorImpl.java:43)
    at java.lang.reflect.Method.invoke (Method.java:498)
    at hudson.maven.Maven3Builder.call (Maven3Builder.java:139)
    at hudson.maven.Maven3Builder.call (Maven3Builder.java:70)
    at hudson.remoting.UserRequest.perform (UserRequest.java:212)
    at hudson.remoting.UserRequest.perform (UserRequest.java:54)
    at hudson.remoting.Request$2.run (Request.java:369)
    at hudson.remoting.InterceptingExecutorService$1.call (InterceptingExecutorService.java:72)
    at java.util.concurrent.FutureTask.run (FutureTask.java:266)
    at java.util.concurrent.ThreadPoolExecutor.runWorker (ThreadPoolExecutor.java:1149)
    at java.util.concurrent.ThreadPoolExecutor$Worker.run (ThreadPoolExecutor.java:624)
    at java.lang.Thread.run (Thread.java:748)
Caused by: java.lang.NullPointerException
    at org.apache.maven.artifact.resolver.filter.ExclusionArtifactFilter.include (ExclusionArtifactFilter.java:58)
    at org.apache.maven.project.artifact.MavenMetadataSource.createDependencyArtifact (MavenMetadataSource.java:350)
    at org.apache.maven.project.artifact.MavenMetadataSource.createDependencyArtifact (MavenMetadataSource.java:321)
    at org.apache.maven.project.artifact.MavenMetadataSource.retrieve (MavenMetadataSource.java:241)
    at org.apache.maven.repository.legacy.resolver.DefaultLegacyArtifactCollector.recurse (DefaultLegacyArtifactCollector.java:551)
    at org.apache.maven.repository.legacy.resolver.DefaultLegacyArtifactCollector.collect (DefaultLegacyArtifactCollector.java:148)
    at org.apache.maven.artifact.resolver.DefaultArtifactResolver.resolve (DefaultArtifactResolver.java:504)
    at org.apache.maven.artifact.resolver.DefaultArtifactResolver.resolveWithExceptions (DefaultArtifactResolver.java:358)
    at org.apache.maven.artifact.resolver.DefaultArtifactResolver.resolveTransitively (DefaultArtifactResolver.java:352)
    at org.apache.maven.artifact.resolver.DefaultArtifactResolver.resolveTransitively (DefaultArtifactResolver.java:324)
    at org.apache.maven.artifact.resolver.DefaultArtifactResolver.resolveTransitively (DefaultArtifactResolver.java:287)
    at org.apache.maven.shared.artifact.resolver.DefaultProjectDependenciesResolver.resolve (DefaultProjectDependenciesResolver.java:140)
    at org.apache.maven.shared.artifact.resolver.DefaultProjectDependenciesResolver.resolve (DefaultProjectDependenciesResolver.java:187)
    at org.apache.maven.plugin.resources.remote.ProcessRemoteResourcesMojo.resolveProjectArtifacts (ProcessRemoteResourcesMojo.java:721)
    at org.apache.maven.plugin.resources.remote.ProcessRemoteResourcesMojo.getProjects (ProcessRemoteResourcesMojo.java:624)
    at org.apache.maven.plugin.resources.remote.ProcessRemoteResourcesMojo.configureVelocityContext (ProcessRemoteResourcesMojo.java:1009)
    at org.apache.maven.plugin.resources.remote.ProcessRemoteResourcesMojo.execute (ProcessRemoteResourcesMojo.java:513)
    at org.apache.maven.plugin.DefaultBuildPluginManager.executeMojo (DefaultBuildPluginManager.java:137)
    at org.apache.maven.lifecycle.internal.MojoExecutor.execute (MojoExecutor.java:210)
    at org.apache.maven.lifecycle.internal.MojoExecutor.execute (MojoExecutor.java:156)
    at org.apache.maven.lifecycle.internal.MojoExecutor.execute (MojoExecutor.java:148)
    at org.apache.maven.lifecycle.internal.LifecycleModuleBuilder.buildProject (LifecycleModuleBuilder.java:117)
    at org.apache.maven.lifecycle.internal.LifecycleModuleBuilder.buildProject (LifecycleModuleBuilder.java:81)
    at org.apache.maven.lifecycle.internal.builder.singlethreaded.SingleThreadedBuilder.build (SingleThreadedBuilder.java:56)
    at org.apache.maven.lifecycle.internal.LifecycleStarter.execute (LifecycleStarter.java:128)
    at org.apache.maven.DefaultMaven.doExecute (DefaultMaven.java:305)
    at org.apache.maven.DefaultMaven.doExecute (DefaultMaven.java:192)
    at org.apache.maven.DefaultMaven.execute (DefaultMaven.java:105)
    at org.jvnet.hudson.maven3.launcher.Maven35Launcher.main (Maven35Launcher.java:130)
    at sun.reflect.NativeMethodAccessorImpl.invoke0 (Native Method)
    at sun.reflect.NativeMethodAccessorImpl.invoke (NativeMethodAccessorImpl.java:62)
    at sun.reflect.DelegatingMethodAccessorImpl.invoke (DelegatingMethodAccessorImpl.java:43)
    at java.lang.reflect.Method.invoke (Method.java:498)
    at org.codehaus.plexus.classworlds.launcher.Launcher.launchEnhanced (Launcher.java:282)
    at org.codehaus.plexus.classworlds.launcher.Launcher.launch (Launcher.java:225)
    at jenkins.maven3.agent.Maven35Main.launch (Maven35Main.java:178)
    at sun.reflect.NativeMethodAccessorImpl.invoke0 (Native Method)
    at sun.reflect.NativeMethodAccessorImpl.invoke (NativeMethodAccessorImpl.java:62)
    at sun.reflect.DelegatingMethodAccessorImpl.invoke (DelegatingMethodAccessorImpl.java:43)
    at java.lang.reflect.Method.invoke (Method.java:498)
    at hudson.maven.Maven3Builder.call (Maven3Builder.java:139)
    at hudson.maven.Maven3Builder.call (Maven3Builder.java:70)
    at hudson.remoting.UserRequest.perform (UserRequest.java:212)
    at hudson.remoting.UserRequest.perform (UserRequest.java:54)
    at hudson.remoting.Request$2.run (Request.java:369)
    at hudson.remoting.InterceptingExecutorService$1.call (InterceptingExecutorService.java:72)
    at java.util.concurrent.FutureTask.run (FutureTask.java:266)
    at java.util.concurrent.ThreadPoolExecutor.runWorker (ThreadPoolExecutor.java:1149)
    at java.util.concurrent.ThreadPoolExecutor$Worker.run (ThreadPoolExecutor.java:624)
    at java.lang.Thread.run (Thread.java:748)
[ERROR]
[ERROR] Re-run Maven using the -X switch to enable full debug logging.
[ERROR]
[ERROR] For more information about the errors and possible solutions, please read the following articles:
[ERROR] [Help 1] http://cwiki.apache.org/confluence/display/MAVEN/PluginExecutionException
[ERROR]
[ERROR] After correcting the problems, you can resume the build with the command
[ERROR]   mvn <goals> -rf :activemq-osgi
[JENKINS] Archiving <https://builds.apache.org/job/ActiveMQ-Java8/ws/activemq-kahadb-store/pom.xml> to org.apache.activemq/activemq-kahadb-store/5.16.0-SNAPSHOT/activemq-kahadb-store-5.16.0-SNAPSHOT.pom
[JENKINS] Archiving <https://builds.apache.org/job/ActiveMQ-Java8/ws/activemq-kahadb-store/target/activemq-kahadb-store-5.16.0-SNAPSHOT.jar> to org.apache.activemq/activemq-kahadb-store/5.16.0-20191119.124715-321/activemq-kahadb-store-5.16.0-20191119.124715-321.jar
[JENKINS] Archiving <https://builds.apache.org/job/ActiveMQ-Java8/ws/activemq-osgi/pom.xml> to org.apache.activemq/activemq-osgi/5.16.0-SNAPSHOT/activemq-osgi-5.16.0-SNAPSHOT.pom
[JENKINS] Archiving <https://builds.apache.org/job/ActiveMQ-Java8/ws/activemq-unit-tests/pom.xml> to org.apache.activemq/activemq-unit-tests/5.16.0-SNAPSHOT/activemq-unit-tests-5.16.0-SNAPSHOT.pom
[JENKINS] Archiving <https://builds.apache.org/job/ActiveMQ-Java8/ws/activemq-unit-tests/target/activemq-unit-tests-5.16.0-SNAPSHOT.jar> to org.apache.activemq/activemq-unit-tests/5.16.0-20191119.182544-317/activemq-unit-tests-5.16.0-20191119.182544-317.jar
[JENKINS] Archiving <https://builds.apache.org/job/ActiveMQ-Java8/ws/activemq-unit-tests/target/activemq-unit-tests-5.16.0-SNAPSHOT-tests.jar> to org.apache.activemq/activemq-unit-tests/5.16.0-20191119.182544-317/activemq-unit-tests-5.16.0-20191119.182544-317-tests.jar
[JENKINS] Archiving <https://builds.apache.org/job/ActiveMQ-Java8/ws/activemq-openwire-legacy/pom.xml> to org.apache.activemq/activemq-openwire-legacy/5.16.0-SNAPSHOT/activemq-openwire-legacy-5.16.0-SNAPSHOT.pom
[JENKINS] Archiving <https://builds.apache.org/job/ActiveMQ-Java8/ws/activemq-openwire-legacy/target/activemq-openwire-legacy-5.16.0-SNAPSHOT.jar> to org.apache.activemq/activemq-openwire-legacy/5.16.0-20191119.121824-321/activemq-openwire-legacy-5.16.0-20191119.121824-321.jar
[JENKINS] Archiving <https://builds.apache.org/job/ActiveMQ-Java8/ws/activemq-karaf-itest/pom.xml> to org.apache.activemq/activemq-karaf-itest/5.16.0-SNAPSHOT/activemq-karaf-itest-5.16.0-SNAPSHOT.pom
[JENKINS] Archiving <https://builds.apache.org/job/ActiveMQ-Java8/ws/activemq-karaf-itest/target/activemq-karaf-itest-5.16.0-SNAPSHOT.jar> to org.apache.activemq/activemq-karaf-itest/5.16.0-20191119.190104-317/activemq-karaf-itest-5.16.0-20191119.190104-317.jar
[JENKINS] Archiving <https://builds.apache.org/job/ActiveMQ-Java8/ws/activemq-rar/pom.xml> to org.apache.activemq/activemq-rar/5.16.0-SNAPSHOT/activemq-rar-5.16.0-SNAPSHOT.pom
[JENKINS] Archiving <https://builds.apache.org/job/ActiveMQ-Java8/ws/activemq-rar/target/activemq-rar-5.16.0-SNAPSHOT.rar> to org.apache.activemq/activemq-rar/5.16.0-20191119.185052-315/activemq-rar-5.16.0-20191119.185052-315.rar
[Fast Archiver] Compressed 10.80 MB of artifacts by 45.4% relative to #1361
[JENKINS] Archiving <https://builds.apache.org/job/ActiveMQ-Java8/ws/activemq-http/pom.xml> to org.apache.activemq/activemq-http/5.16.0-SNAPSHOT/activemq-http-5.16.0-SNAPSHOT.pom
[JENKINS] Archiving <https://builds.apache.org/job/ActiveMQ-Java8/ws/activemq-http/target/activemq-http-5.16.0-SNAPSHOT.jar> to org.apache.activemq/activemq-http/5.16.0-20191119.183622-317/activemq-http-5.16.0-20191119.183622-317.jar
[JENKINS] Archiving <https://builds.apache.org/job/ActiveMQ-Java8/ws/activemq-amqp/pom.xml> to org.apache.activemq/activemq-amqp/5.16.0-SNAPSHOT/activemq-amqp-5.16.0-SNAPSHOT.pom
[JENKINS] Archiving <https://builds.apache.org/job/ActiveMQ-Java8/ws/activemq-amqp/target/activemq-amqp-5.16.0-SNAPSHOT.jar> to org.apache.activemq/activemq-amqp/5.16.0-20191119.184435-316/activemq-amqp-5.16.0-20191119.184435-316.jar
[JENKINS] Archiving <https://builds.apache.org/job/ActiveMQ-Java8/ws/activemq-client/pom.xml> to org.apache.activemq/activemq-client/5.16.0-SNAPSHOT/activemq-client-5.16.0-SNAPSHOT.pom
[JENKINS] Archiving <https://builds.apache.org/job/ActiveMQ-Java8/ws/activemq-client/target/activemq-client-5.16.0-SNAPSHOT.jar> to org.apache.activemq/activemq-client/5.16.0-20191119.121808-321/activemq-client-5.16.0-20191119.121808-321.jar
[JENKINS] Archiving <https://builds.apache.org/job/ActiveMQ-Java8/ws/activemq-blueprint/pom.xml> to org.apache.activemq/activemq-blueprint/5.16.0-SNAPSHOT/activemq-blueprint-5.16.0-SNAPSHOT.pom
[JENKINS] Archiving <https://builds.apache.org/job/ActiveMQ-Java8/ws/activemq-blueprint/target/activemq-blueprint-5.16.0-SNAPSHOT.jar> to org.apache.activemq/activemq-blueprint/5.16.0-20191119.185307-319/activemq-blueprint-5.16.0-20191119.185307-319.jar
[JENKINS] Archiving <https://builds.apache.org/job/ActiveMQ-Java8/ws/activemq-tooling/activemq-junit/pom.xml> to org.apache.activemq.tooling/activemq-junit/5.16.0-SNAPSHOT/activemq-junit-5.16.0-SNAPSHOT.pom
[JENKINS] Archiving <https://builds.apache.org/job/ActiveMQ-Java8/ws/activemq-tooling/activemq-junit/target/activemq-junit-5.16.0-SNAPSHOT.jar> to org.apache.activemq.tooling/activemq-junit/5.16.0-20191119.134727-318/activemq-junit-5.16.0-20191119.134727-318.jar
[JENKINS] Archiving <https://builds.apache.org/job/ActiveMQ-Java8/ws/activemq-tooling/pom.xml> to org.apache.activemq.tooling/activemq-tooling/5.16.0-SNAPSHOT/activemq-tooling-5.16.0-SNAPSHOT.pom
[JENKINS] Archiving <https://builds.apache.org/job/ActiveMQ-Java8/ws/activemq-jms-pool/pom.xml> to org.apache.activemq/activemq-jms-pool/5.16.0-SNAPSHOT/activemq-jms-pool-5.16.0-SNAPSHOT.pom
[JENKINS] Archiving <https://builds.apache.org/job/ActiveMQ-Java8/ws/activemq-jms-pool/target/activemq-jms-pool-5.16.0-SNAPSHOT.jar> to org.apache.activemq/activemq-jms-pool/5.16.0-20191119.133334-319/activemq-jms-pool-5.16.0-20191119.133334-319.jar
[JENKINS] Archiving <https://builds.apache.org/job/ActiveMQ-Java8/ws/activemq-pool/pom.xml> to org.apache.activemq/activemq-pool/5.16.0-SNAPSHOT/activemq-pool-5.16.0-SNAPSHOT.pom
[JENKINS] Archiving <https://builds.apache.org/job/ActiveMQ-Java8/ws/activemq-pool/target/activemq-pool-5.16.0-SNAPSHOT.jar> to org.apache.activemq/activemq-pool/5.16.0-20191119.133350-319/activemq-pool-5.16.0-20191119.133350-319.jar
[JENKINS] Archiving <https://builds.apache.org/job/ActiveMQ-Java8/ws/activemq-jdbc-store/pom.xml> to org.apache.activemq/activemq-jdbc-store/5.16.0-SNAPSHOT/activemq-jdbc-store-5.16.0-SNAPSHOT.pom
[JENKINS] Archiving <https://builds.apache.org/job/ActiveMQ-Java8/ws/activemq-jdbc-store/target/activemq-jdbc-store-5.16.0-SNAPSHOT.jar> to org.apache.activemq/activemq-jdbc-store/5.16.0-20191119.132346-321/activemq-jdbc-store-5.16.0-20191119.132346-321.jar
[JENKINS] Archiving <https://builds.apache.org/job/ActiveMQ-Java8/ws/activemq-camel/pom.xml> to org.apache.activemq/activemq-camel/5.16.0-SNAPSHOT/activemq-camel-5.16.0-SNAPSHOT.pom
[JENKINS] Archiving <https://builds.apache.org/job/ActiveMQ-Java8/ws/activemq-camel/target/activemq-camel-5.16.0-SNAPSHOT.jar> to org.apache.activemq/activemq-camel/5.16.0-20191119.184918-317/activemq-camel-5.16.0-20191119.184918-317.jar
[JENKINS] Archiving <https://builds.apache.org/job/ActiveMQ-Java8/ws/activemq-runtime-config/pom.xml> to org.apache.activemq/activemq-runtime-config/5.16.0-SNAPSHOT/activemq-runtime-config-5.16.0-SNAPSHOT.pom
[JENKINS] Archiving <https://builds.apache.org/job/ActiveMQ-Java8/ws/activemq-runtime-config/target/activemq-runtime-config-5.16.0-SNAPSHOT.jar> to org.apache.activemq/activemq-runtime-config/5.16.0-20191119.134703-318/activemq-runtime-config-5.16.0-20191119.134703-318.jar
[JENKINS] Archiving <https://builds.apache.org/job/ActiveMQ-Java8/ws/pom.xml> to org.apache.activemq/activemq-parent/5.16.0-SNAPSHOT/activemq-parent-5.16.0-SNAPSHOT.pom
[JENKINS] Archiving <https://builds.apache.org/job/ActiveMQ-Java8/ws/activemq-stomp/pom.xml> to org.apache.activemq/activemq-stomp/5.16.0-SNAPSHOT/activemq-stomp-5.16.0-SNAPSHOT.pom
[JENKINS] Archiving <https://builds.apache.org/job/ActiveMQ-Java8/ws/activemq-stomp/target/activemq-stomp-5.16.0-SNAPSHOT.jar> to org.apache.activemq/activemq-stomp/5.16.0-20191119.130258-321/activemq-stomp-5.16.0-20191119.130258-321.jar
[JENKINS] Archiving <https://builds.apache.org/job/ActiveMQ-Java8/ws/activemq-openwire-generator/pom.xml> to org.apache.activemq/activemq-openwire-generator/5.16.0-SNAPSHOT/activemq-openwire-generator-5.16.0-SNAPSHOT.pom
[JENKINS] Archiving <https://builds.apache.org/job/ActiveMQ-Java8/ws/activemq-openwire-generator/target/activemq-openwire-generator-5.16.0-SNAPSHOT.jar> to org.apache.activemq/activemq-openwire-generator/5.16.0-20191119.121529-322/activemq-openwire-generator-5.16.0-20191119.121529-322.jar
[JENKINS] Archiving <https://builds.apache.org/job/ActiveMQ-Java8/ws/activemq-broker/pom.xml> to org.apache.activemq/activemq-broker/5.16.0-SNAPSHOT/activemq-broker-5.16.0-SNAPSHOT.pom
[JENKINS] Archiving <https://builds.apache.org/job/ActiveMQ-Java8/ws/activemq-broker/target/activemq-broker-5.16.0-SNAPSHOT.jar> to org.apache.activemq/activemq-broker/5.16.0-20191119.122108-321/activemq-broker-5.16.0-20191119.122108-321.jar
[JENKINS] Archiving <https://builds.apache.org/job/ActiveMQ-Java8/ws/activemq-broker/target/activemq-broker-5.16.0-SNAPSHOT-tests.jar> to org.apache.activemq/activemq-broker/5.16.0-20191119.122108-321/activemq-broker-5.16.0-20191119.122108-321-tests.jar
[JENKINS] Archiving <https://builds.apache.org/job/ActiveMQ-Java8/ws/activemq-web-demo/pom.xml> to org.apache.activemq/activemq-web-demo/5.16.0-SNAPSHOT/activemq-web-demo-5.16.0-SNAPSHOT.pom
[JENKINS] Archiving <https://builds.apache.org/job/ActiveMQ-Java8/ws/activemq-web-demo/target/activemq-web-demo-5.16.0-SNAPSHOT.war> to org.apache.activemq/activemq-web-demo/5.16.0-20191119.185353-315/activemq-web-demo-5.16.0-20191119.185353-315.war
[Fast Archiver] Compressed 34.29 MB of artifacts by 87.4% relative to #1361
[JENKINS] Archiving <https://builds.apache.org/job/ActiveMQ-Java8/ws/activemq-mqtt/pom.xml> to org.apache.activemq/activemq-mqtt/5.16.0-SNAPSHOT/activemq-mqtt-5.16.0-SNAPSHOT.pom
[JENKINS] Archiving <https://builds.apache.org/job/ActiveMQ-Java8/ws/activemq-mqtt/target/activemq-mqtt-5.16.0-SNAPSHOT.jar> to org.apache.activemq/activemq-mqtt/5.16.0-20191119.132332-321/activemq-mqtt-5.16.0-20191119.132332-321.jar
[JENKINS] Archiving <https://builds.apache.org/job/ActiveMQ-Java8/ws/activemq-shiro/pom.xml> to org.apache.activemq/activemq-shiro/5.16.0-SNAPSHOT/activemq-shiro-5.16.0-SNAPSHOT.pom
[JENKINS] Archiving <https://builds.apache.org/job/ActiveMQ-Java8/ws/activemq-shiro/target/activemq-shiro-5.16.0-SNAPSHOT.jar> to org.apache.activemq/activemq-shiro/5.16.0-20191119.185123-317/activemq-shiro-5.16.0-20191119.185123-317.jar
[JENKINS] Archiving <https://builds.apache.org/job/ActiveMQ-Java8/ws/activemq-tooling/activemq-perf-maven-plugin/pom.xml> to org.apache.activemq.tooling/activemq-perf-maven-plugin/5.16.0-SNAPSHOT/activemq-perf-maven-plugin-5.16.0-SNAPSHOT.pom
[JENKINS] Archiving <https://builds.apache.org/job/ActiveMQ-Java8/ws/activemq-tooling/activemq-perf-maven-plugin/target/activemq-perf-maven-plugin-5.16.0-SNAPSHOT.jar> to org.apache.activemq.tooling/activemq-perf-maven-plugin/5.16.0-20191119.185158-316/activemq-perf-maven-plugin-5.16.0-20191119.185158-316.jar
[JENKINS] Archiving <https://builds.apache.org/job/ActiveMQ-Java8/ws/activemq-run/dependency-reduced-pom.xml> to org.apache.activemq/activemq-run/5.16.0-SNAPSHOT/activemq-run-5.16.0-SNAPSHOT.pom
[JENKINS] Archiving <https://builds.apache.org/job/ActiveMQ-Java8/ws/activemq-run/target/activemq-run-5.16.0-SNAPSHOT.jar> to org.apache.activemq/activemq-run/5.16.0-20191119.185107-317/activemq-run-5.16.0-20191119.185107-317.jar
[JENKINS] Archiving <https://builds.apache.org/job/ActiveMQ-Java8/ws/activemq-tooling/activemq-maven-plugin/pom.xml> to org.apache.activemq.tooling/activemq-maven-plugin/5.16.0-SNAPSHOT/activemq-maven-plugin-5.16.0-SNAPSHOT.pom
[JENKINS] Archiving <https://builds.apache.org/job/ActiveMQ-Java8/ws/activemq-tooling/activemq-maven-plugin/target/activemq-maven-plugin-5.16.0-SNAPSHOT.jar> to org.apache.activemq.tooling/activemq-maven-plugin/5.16.0-20191119.185219-315/activemq-maven-plugin-5.16.0-20191119.185219-315.jar
[JENKINS] Archiving <https://builds.apache.org/job/ActiveMQ-Java8/ws/activemq-karaf/pom.xml> to org.apache.activemq/activemq-karaf/5.16.0-SNAPSHOT/activemq-karaf-5.16.0-SNAPSHOT.pom
[JENKINS] Archiving <https://builds.apache.org/job/ActiveMQ-Java8/ws/activemq-karaf/target/activemq-karaf-5.16.0-SNAPSHOT.jar> to org.apache.activemq/activemq-karaf/5.16.0-20191119.185009-317/activemq-karaf-5.16.0-20191119.185009-317.jar
[JENKINS] Archiving <https://builds.apache.org/job/ActiveMQ-Java8/ws/activemq-karaf/target/classes/features.xml> to org.apache.activemq/activemq-karaf/5.16.0-20191119.185009-317/activemq-karaf-5.16.0-20191119.185009-317-features.xml
[JENKINS] Archiving <https://builds.apache.org/job/ActiveMQ-Java8/ws/activemq-karaf/target/classes/features-core.xml> to org.apache.activemq/activemq-karaf/5.16.0-20191119.185009-317/activemq-karaf-5.16.0-20191119.185009-317-features-core.xml
[JENKINS] Archiving <https://builds.apache.org/job/ActiveMQ-Java8/ws/activemq-karaf/target/classes/activemq.xml> to org.apache.activemq/activemq-karaf/5.16.0-20191119.185009-317/activemq-karaf-5.16.0-20191119.185009-317-activemq.xml
[JENKINS] Archiving <https://builds.apache.org/job/ActiveMQ-Java8/ws/activemq-karaf/target/classes/org.apache.activemq.server-default.cfg> to org.apache.activemq/activemq-karaf/5.16.0-20191119.185009-317/activemq-karaf-5.16.0-20191119.185009-317-activemq.cfg
[JENKINS] Archiving <https://builds.apache.org/job/ActiveMQ-Java8/ws/activemq-karaf/target/classes/org.apache.activemq.webconsole.cfg> to org.apache.activemq/activemq-karaf/5.16.0-20191119.185009-317/activemq-karaf-5.16.0-20191119.185009-317-activemq-webconsole.cfg
[JENKINS] Archiving <https://builds.apache.org/job/ActiveMQ-Java8/ws/activemq-web-console/pom.xml> to org.apache.activemq/activemq-web-console/5.16.0-SNAPSHOT/activemq-web-console-5.16.0-SNAPSHOT.pom
[JENKINS] Archiving <https://builds.apache.org/job/ActiveMQ-Java8/ws/activemq-web-console/target/activemq-web-console-5.16.0-SNAPSHOT.war> to org.apache.activemq/activemq-web-console/5.16.0-20191119.185414-315/activemq-web-console-5.16.0-20191119.185414-315.war
[Fast Archiver] Compressed 14.97 MB of artifacts by 51.2% relative to #1361
[JENKINS] Archiving <https://builds.apache.org/job/ActiveMQ-Java8/ws/activemq-jaas/pom.xml> to org.apache.activemq/activemq-jaas/5.16.0-SNAPSHOT/activemq-jaas-5.16.0-SNAPSHOT.pom
[JENKINS] Archiving <https://builds.apache.org/job/ActiveMQ-Java8/ws/activemq-jaas/target/activemq-jaas-5.16.0-SNAPSHOT.jar> to org.apache.activemq/activemq-jaas/5.16.0-20191119.122001-322/activemq-jaas-5.16.0-20191119.122001-322.jar
[JENKINS] Archiving <https://builds.apache.org/job/ActiveMQ-Java8/ws/activemq-itests-spring31/pom.xml> to org.apache.activemq/activemq-itests-spring31/5.16.0-SNAPSHOT/activemq-itests-spring31-5.16.0-SNAPSHOT.pom
[JENKINS] Archiving <https://builds.apache.org/job/ActiveMQ-Java8/ws/activemq-itests-spring31/target/activemq-itests-spring31-5.16.0-SNAPSHOT.jar> to org.apache.activemq/activemq-itests-spring31/5.16.0-20191119.190119-317/activemq-itests-spring31-5.16.0-20191119.190119-317.jar
[JENKINS] Archiving <https://builds.apache.org/job/ActiveMQ-Java8/ws/activemq-tooling/activemq-memtest-maven-plugin/pom.xml> to org.apache.activemq.tooling/activemq-memtest-maven-plugin/5.16.0-SNAPSHOT/activemq-memtest-maven-plugin-5.16.0-SNAPSHOT.pom
[JENKINS] Archiving <https://builds.apache.org/job/ActiveMQ-Java8/ws/activemq-tooling/activemq-memtest-maven-plugin/target/activemq-memtest-maven-plugin-5.16.0-SNAPSHOT.jar> to org.apache.activemq.tooling/activemq-memtest-maven-plugin/5.16.0-20191119.185137-316/activemq-memtest-maven-plugin-5.16.0-20191119.185137-316.jar
[JENKINS] Archiving <https://builds.apache.org/job/ActiveMQ-Java8/ws/activemq-ra/pom.xml> to org.apache.activemq/activemq-ra/5.16.0-SNAPSHOT/activemq-ra-5.16.0-SNAPSHOT.pom
[JENKINS] Archiving <https://builds.apache.org/job/ActiveMQ-Java8/ws/activemq-ra/target/activemq-ra-5.16.0-SNAPSHOT.jar> to org.apache.activemq/activemq-ra/5.16.0-20191119.133544-319/activemq-ra-5.16.0-20191119.133544-319.jar
[JENKINS] Archiving <https://builds.apache.org/job/ActiveMQ-Java8/ws/activemq-ra/target/xbean/activemq-ra.xsd> to org.apache.activemq/activemq-ra/5.16.0-20191119.133544-319/activemq-ra-5.16.0-20191119.133544-319.xsd
[JENKINS] Archiving <https://builds.apache.org/job/ActiveMQ-Java8/ws/activemq-ra/target/xbean/activemq-ra.xsd.html> to org.apache.activemq/activemq-ra/5.16.0-20191119.133544-319/activemq-ra-5.16.0-20191119.133544-319-schema.html
[JENKINS] Archiving <https://builds.apache.org/job/ActiveMQ-Java8/ws/activemq-ra/target/xbean/activemq-ra.xsd.html> to org.apache.activemq/activemq-ra/5.16.0-20191119.133544-319/activemq-ra-5.16.0-20191119.133544-319.xsd.html
[JENKINS] Archiving <https://builds.apache.org/job/ActiveMQ-Java8/ws/activemq-partition/pom.xml> to org.apache.activemq/activemq-partition/5.16.0-SNAPSHOT/activemq-partition-5.16.0-SNAPSHOT.pom
[JENKINS] Archiving <https://builds.apache.org/job/ActiveMQ-Java8/ws/activemq-partition/target/activemq-partition-5.16.0-SNAPSHOT.jar> to org.apache.activemq/activemq-partition/5.16.0-20191119.133803-318/activemq-partition-5.16.0-20191119.133803-318.jar
[JENKINS] Archiving <https://builds.apache.org/job/ActiveMQ-Java8/ws/activemq-all/dependency-reduced-pom.xml> to org.apache.activemq/activemq-all/5.16.0-SNAPSHOT/activemq-all-5.16.0-SNAPSHOT.pom
[JENKINS] Archiving <https://builds.apache.org/job/ActiveMQ-Java8/ws/activemq-all/target/activemq-all-5.16.0-SNAPSHOT.jar> to org.apache.activemq/activemq-all/5.16.0-20191119.184935-316/activemq-all-5.16.0-20191119.184935-316.jar
[JENKINS] Archiving <https://builds.apache.org/job/ActiveMQ-Java8/ws/assembly/pom.xml> to org.apache.activemq/apache-activemq/5.16.0-SNAPSHOT/apache-activemq-5.16.0-SNAPSHOT.pom
[JENKINS] Archiving <https://builds.apache.org/job/ActiveMQ-Java8/ws/assembly/target/apache-activemq-5.16.0-SNAPSHOT-bin.tar.gz> to org.apache.activemq/apache-activemq/5.16.0-20191119.190329-315/apache-activemq-5.16.0-20191119.190329-315-bin.tar.gz
[JENKINS] Archiving <https://builds.apache.org/job/ActiveMQ-Java8/ws/assembly/target/apache-activemq-5.16.0-SNAPSHOT-bin.zip> to org.apache.activemq/apache-activemq/5.16.0-20191119.190329-315/apache-activemq-5.16.0-20191119.190329-315-bin.zip
[Fast Archiver] Compressed 125.74 MB of artifacts by 28.3% relative to #1361
[JENKINS] Archiving <https://builds.apache.org/job/ActiveMQ-Java8/ws/activemq-console/pom.xml> to org.apache.activemq/activemq-console/5.16.0-SNAPSHOT/activemq-console-5.16.0-SNAPSHOT.pom
[JENKINS] Archiving <https://builds.apache.org/job/ActiveMQ-Java8/ws/activemq-console/target/activemq-console-5.16.0-SNAPSHOT.jar> to org.apache.activemq/activemq-console/5.16.0-20191119.133734-318/activemq-console-5.16.0-20191119.133734-318.jar
[JENKINS] Archiving <https://builds.apache.org/job/ActiveMQ-Java8/ws/activemq-spring/pom.xml> to org.apache.activemq/activemq-spring/5.16.0-SNAPSHOT/activemq-spring-5.16.0-SNAPSHOT.pom
[JENKINS] Archiving <https://builds.apache.org/job/ActiveMQ-Java8/ws/activemq-spring/target/activemq-spring-5.16.0-SNAPSHOT.jar> to org.apache.activemq/activemq-spring/5.16.0-20191119.133709-318/activemq-spring-5.16.0-20191119.133709-318.jar
[JENKINS] Archiving <https://builds.apache.org/job/ActiveMQ-Java8/ws/activemq-spring/target/classes/activemq.xsd> to org.apache.activemq/activemq-spring/5.16.0-20191119.133709-318/activemq-spring-5.16.0-20191119.133709-318.xsd
[JENKINS] Archiving <https://builds.apache.org/job/ActiveMQ-Java8/ws/activemq-spring/target/classes/activemq.xsd.html> to org.apache.activemq/activemq-spring/5.16.0-20191119.133709-318/activemq-spring-5.16.0-20191119.133709-318-schema.html
[Fast Archiver] Compressed 906.20 KB of artifacts by 49.4% relative to #1361
[JENKINS] Archiving <https://builds.apache.org/job/ActiveMQ-Java8/ws/activemq-cf/pom.xml> to org.apache.activemq/activemq-cf/5.16.0-SNAPSHOT/activemq-cf-5.16.0-SNAPSHOT.pom
[JENKINS] Archiving <https://builds.apache.org/job/ActiveMQ-Java8/ws/activemq-cf/target/activemq-cf-5.16.0-SNAPSHOT.jar> to org.apache.activemq/activemq-cf/5.16.0-20191119.185035-317/activemq-cf-5.16.0-20191119.185035-317.jar
[JENKINS] Archiving <https://builds.apache.org/job/ActiveMQ-Java8/ws/activemq-leveldb-store/pom.xml> to org.apache.activemq/activemq-leveldb-store/5.16.0-SNAPSHOT/activemq-leveldb-store-5.16.0-SNAPSHOT.pom
[JENKINS] Archiving <https://builds.apache.org/job/ActiveMQ-Java8/ws/activemq-leveldb-store/target/activemq-leveldb-store-5.16.0-SNAPSHOT.jar> to org.apache.activemq/activemq-leveldb-store/5.16.0-20191119.133243-320/activemq-leveldb-store-5.16.0-20191119.133243-320.jar
[JENKINS] Archiving <https://builds.apache.org/job/ActiveMQ-Java8/ws/activemq-web/pom.xml> to org.apache.activemq/activemq-web/5.16.0-SNAPSHOT/activemq-web-5.16.0-SNAPSHOT.pom
[JENKINS] Archiving <https://builds.apache.org/job/ActiveMQ-Java8/ws/activemq-web/target/activemq-web-5.16.0-SNAPSHOT.jar> to org.apache.activemq/activemq-web/5.16.0-20191119.185250-315/activemq-web-5.16.0-20191119.185250-315.jar
[JENKINS] Archiving <https://builds.apache.org/job/ActiveMQ-Java8/ws/activemq-log4j-appender/pom.xml> to org.apache.activemq/activemq-log4j-appender/5.16.0-SNAPSHOT/activemq-log4j-appender-5.16.0-SNAPSHOT.pom
[JENKINS] Archiving <https://builds.apache.org/job/ActiveMQ-Java8/ws/activemq-log4j-appender/target/activemq-log4j-appender-5.16.0-SNAPSHOT.jar> to org.apache.activemq/activemq-log4j-appender/5.16.0-20191119.184955-317/activemq-log4j-appender-5.16.0-20191119.184955-317.jar
Sending e-mails to: [hidden email]
Sending e-mails to: [hidden email]
Sending e-mails to: [hidden email]
No mail will be sent out, as 'ActiveMQ-Java8 » ActiveMQ :: Openwire Legacy Support #1362' does not have a result yet. Please make sure you set a proper result in case of pipeline/build scripts.
Sending e-mails to: [hidden email]
Sending e-mails to: [hidden email]
Sending e-mails to: [hidden email]
No mail will be sent out, as 'ActiveMQ-Java8 » ActiveMQ :: AMQP #1362' does not have a result yet. Please make sure you set a proper result in case of pipeline/build scripts.
No mail will be sent out, as 'ActiveMQ-Java8 » ActiveMQ :: Client #1362' does not have a result yet. Please make sure you set a proper result in case of pipeline/build scripts.
No mail will be sent out, as 'ActiveMQ-Java8 » ActiveMQ :: Blueprint #1362' does not have a result yet. Please make sure you set a proper result in case of pipeline/build scripts.
No mail will be sent out, as 'ActiveMQ-Java8 » ActiveMQ :: JUnit Rule #1362' does not have a result yet. Please make sure you set a proper result in case of pipeline/build scripts.
No mail will be sent out, as 'ActiveMQ-Java8 » ActiveMQ :: Tooling #1362' does not have a result yet. Please make sure you set a proper result in case of pipeline/build scripts.
No mail will be sent out, as 'ActiveMQ-Java8 » ActiveMQ :: Generic JMS Pool #1362' does not have a result yet. Please make sure you set a proper result in case of pipeline/build scripts.
No mail will be sent out, as 'ActiveMQ-Java8 » ActiveMQ :: Pool #1362' does not have a result yet. Please make sure you set a proper result in case of pipeline/build scripts.
No mail will be sent out, as 'ActiveMQ-Java8 » ActiveMQ :: JDBC Store #1362' does not have a result yet. Please make sure you set a proper result in case of pipeline/build scripts.
Sending e-mails to: [hidden email]
No mail will be sent out, as 'ActiveMQ-Java8 » ActiveMQ :: Runtime Configuration #1362' does not have a result yet. Please make sure you set a proper result in case of pipeline/build scripts.
No mail will be sent out, as 'ActiveMQ-Java8 » ActiveMQ #1362' does not have a result yet. Please make sure you set a proper result in case of pipeline/build scripts.
No mail will be sent out, as 'ActiveMQ-Java8 » ActiveMQ :: STOMP Protocol #1362' does not have a result yet. Please make sure you set a proper result in case of pipeline/build scripts.
No mail will be sent out, as 'ActiveMQ-Java8 » ActiveMQ :: Openwire Generator #1362' does not have a result yet. Please make sure you set a proper result in case of pipeline/build scripts.
No mail will be sent out, as 'ActiveMQ-Java8 » ActiveMQ :: Broker #1362' does not have a result yet. Please make sure you set a proper result in case of pipeline/build scripts.
No mail will be sent out, as 'ActiveMQ-Java8 » ActiveMQ :: Web Demo #1362' does not have a result yet. Please make sure you set a proper result in case of pipeline/build scripts.
Sending e-mails to: [hidden email]
No mail will be sent out, as 'ActiveMQ-Java8 » ActiveMQ :: Shiro #1362' does not have a result yet. Please make sure you set a proper result in case of pipeline/build scripts.
No mail will be sent out, as 'ActiveMQ-Java8 » ActiveMQ :: Performance Test Plugin #1362' does not have a result yet. Please make sure you set a proper result in case of pipeline/build scripts.
No mail will be sent out, as 'ActiveMQ-Java8 » ActiveMQ :: Run Jar #1362' does not have a result yet. Please make sure you set a proper result in case of pipeline/build scripts.
No mail will be sent out, as 'ActiveMQ-Java8 » ActiveMQ :: StartUp/Stop Plugin #1362' does not have a result yet. Please make sure you set a proper result in case of pipeline/build scripts.
No mail will be sent out, as 'ActiveMQ-Java8 » ActiveMQ :: Apache Karaf #1362' does not have a result yet. Please make sure you set a proper result in case of pipeline/build scripts.
No mail will be sent out, as 'ActiveMQ-Java8 » ActiveMQ :: Web Console #1362' does not have a result yet. Please make sure you set a proper result in case of pipeline/build scripts.
No mail will be sent out, as 'ActiveMQ-Java8 » ActiveMQ :: JAAS #1362' does not have a result yet. Please make sure you set a proper result in case of pipeline/build scripts.
No mail will be sent out, as 'ActiveMQ-Java8 » ActiveMQ :: Integration Test :: Spring 3.1 #1362' does not have a result yet. Please make sure you set a proper result in case of pipeline/build scripts.
No mail will be sent out, as 'ActiveMQ-Java8 » ActiveMQ :: Memory Usage Test Plugin #1362' does not have a result yet. Please make sure you set a proper result in case of pipeline/build scripts.
Sending e-mails to: [hidden email]
No mail will be sent out, as 'ActiveMQ-Java8 » ActiveMQ :: Partition Management #1362' does not have a result yet. Please make sure you set a proper result in case of pipeline/build scripts.
No mail will be sent out, as 'ActiveMQ-Java8 » ActiveMQ :: All JAR bundle #1362' does not have a result yet. Please make sure you set a proper result in case of pipeline/build scripts.
Sending e-mails to: [hidden email]
No mail will be sent out, as 'ActiveMQ-Java8 » ActiveMQ :: Console #1362' does not have a result yet. Please make sure you set a proper result in case of pipeline/build scripts.
Sending e-mails to: [hidden email]
No mail will be sent out, as 'ActiveMQ-Java8 » ActiveMQ :: ConnectionFactory #1362' does not have a result yet. Please make sure you set a proper result in case of pipeline/build scripts.
Sending e-mails to: [hidden email]
No mail will be sent out, as 'ActiveMQ-Java8 » ActiveMQ :: Web #1362' does not have a result yet. Please make sure you set a proper result in case of pipeline/build scripts.
No mail will be sent out, as 'ActiveMQ-Java8 » ActiveMQ :: Log4j Appender #1362' does not have a result yet. Please make sure you set a proper result in case of pipeline/build scripts.
[locks-and-latches] Releasing all the locks
[locks-and-latches] All the locks released
channel stopped
Reply | Threaded
Open this post in threaded view
|

Build failed in Jenkins: ActiveMQ-Java8 #1363

Apache Jenkins Server-2
See <https://builds.apache.org/job/ActiveMQ-Java8/1363/display/redirect>

Changes:


------------------------------------------
[...truncated 2.00 MB...]
    at java.lang.reflect.Method.invoke (Method.java:498)
    at hudson.maven.Maven3Builder.call (Maven3Builder.java:139)
    at hudson.maven.Maven3Builder.call (Maven3Builder.java:70)
    at hudson.remoting.UserRequest.perform (UserRequest.java:212)
    at hudson.remoting.UserRequest.perform (UserRequest.java:54)
    at hudson.remoting.Request$2.run (Request.java:369)
    at hudson.remoting.InterceptingExecutorService$1.call (InterceptingExecutorService.java:72)
    at java.util.concurrent.FutureTask.run (FutureTask.java:266)
    at java.util.concurrent.ThreadPoolExecutor.runWorker (ThreadPoolExecutor.java:1149)
    at java.util.concurrent.ThreadPoolExecutor$Worker.run (ThreadPoolExecutor.java:624)
    at java.lang.Thread.run (Thread.java:748)
Caused by: org.apache.maven.plugin.PluginExecutionException: Execution process-resource-bundles of goal org.apache.maven.plugins:maven-remote-resources-plugin:1.5:process failed.
    at org.apache.maven.plugin.DefaultBuildPluginManager.executeMojo (DefaultBuildPluginManager.java:148)
    at org.apache.maven.lifecycle.internal.MojoExecutor.execute (MojoExecutor.java:210)
    at org.apache.maven.lifecycle.internal.MojoExecutor.execute (MojoExecutor.java:156)
    at org.apache.maven.lifecycle.internal.MojoExecutor.execute (MojoExecutor.java:148)
    at org.apache.maven.lifecycle.internal.LifecycleModuleBuilder.buildProject (LifecycleModuleBuilder.java:117)
    at org.apache.maven.lifecycle.internal.LifecycleModuleBuilder.buildProject (LifecycleModuleBuilder.java:81)
    at org.apache.maven.lifecycle.internal.builder.singlethreaded.SingleThreadedBuilder.build (SingleThreadedBuilder.java:56)
    at org.apache.maven.lifecycle.internal.LifecycleStarter.execute (LifecycleStarter.java:128)
    at org.apache.maven.DefaultMaven.doExecute (DefaultMaven.java:305)
    at org.apache.maven.DefaultMaven.doExecute (DefaultMaven.java:192)
    at org.apache.maven.DefaultMaven.execute (DefaultMaven.java:105)
    at org.jvnet.hudson.maven3.launcher.Maven35Launcher.main (Maven35Launcher.java:130)
    at sun.reflect.NativeMethodAccessorImpl.invoke0 (Native Method)
    at sun.reflect.NativeMethodAccessorImpl.invoke (NativeMethodAccessorImpl.java:62)
    at sun.reflect.DelegatingMethodAccessorImpl.invoke (DelegatingMethodAccessorImpl.java:43)
    at java.lang.reflect.Method.invoke (Method.java:498)
    at org.codehaus.plexus.classworlds.launcher.Launcher.launchEnhanced (Launcher.java:282)
    at org.codehaus.plexus.classworlds.launcher.Launcher.launch (Launcher.java:225)
    at jenkins.maven3.agent.Maven35Main.launch (Maven35Main.java:178)
    at sun.reflect.NativeMethodAccessorImpl.invoke0 (Native Method)
    at sun.reflect.NativeMethodAccessorImpl.invoke (NativeMethodAccessorImpl.java:62)
    at sun.reflect.DelegatingMethodAccessorImpl.invoke (DelegatingMethodAccessorImpl.java:43)
    at java.lang.reflect.Method.invoke (Method.java:498)
    at hudson.maven.Maven3Builder.call (Maven3Builder.java:139)
    at hudson.maven.Maven3Builder.call (Maven3Builder.java:70)
    at hudson.remoting.UserRequest.perform (UserRequest.java:212)
    at hudson.remoting.UserRequest.perform (UserRequest.java:54)
    at hudson.remoting.Request$2.run (Request.java:369)
    at hudson.remoting.InterceptingExecutorService$1.call (InterceptingExecutorService.java:72)
    at java.util.concurrent.FutureTask.run (FutureTask.java:266)
    at java.util.concurrent.ThreadPoolExecutor.runWorker (ThreadPoolExecutor.java:1149)
    at java.util.concurrent.ThreadPoolExecutor$Worker.run (ThreadPoolExecutor.java:624)
    at java.lang.Thread.run (Thread.java:748)
Caused by: java.lang.NullPointerException
    at org.apache.maven.artifact.resolver.filter.ExclusionArtifactFilter.include (ExclusionArtifactFilter.java:58)
    at org.apache.maven.project.artifact.MavenMetadataSource.createDependencyArtifact (MavenMetadataSource.java:350)
    at org.apache.maven.project.artifact.MavenMetadataSource.createDependencyArtifact (MavenMetadataSource.java:321)
    at org.apache.maven.project.artifact.MavenMetadataSource.retrieve (MavenMetadataSource.java:241)
    at org.apache.maven.repository.legacy.resolver.DefaultLegacyArtifactCollector.recurse (DefaultLegacyArtifactCollector.java:551)
    at org.apache.maven.repository.legacy.resolver.DefaultLegacyArtifactCollector.collect (DefaultLegacyArtifactCollector.java:148)
    at org.apache.maven.artifact.resolver.DefaultArtifactResolver.resolve (DefaultArtifactResolver.java:504)
    at org.apache.maven.artifact.resolver.DefaultArtifactResolver.resolveWithExceptions (DefaultArtifactResolver.java:358)
    at org.apache.maven.artifact.resolver.DefaultArtifactResolver.resolveTransitively (DefaultArtifactResolver.java:352)
    at org.apache.maven.artifact.resolver.DefaultArtifactResolver.resolveTransitively (DefaultArtifactResolver.java:324)
    at org.apache.maven.artifact.resolver.DefaultArtifactResolver.resolveTransitively (DefaultArtifactResolver.java:287)
    at org.apache.maven.shared.artifact.resolver.DefaultProjectDependenciesResolver.resolve (DefaultProjectDependenciesResolver.java:140)
    at org.apache.maven.shared.artifact.resolver.DefaultProjectDependenciesResolver.resolve (DefaultProjectDependenciesResolver.java:187)
    at org.apache.maven.plugin.resources.remote.ProcessRemoteResourcesMojo.resolveProjectArtifacts (ProcessRemoteResourcesMojo.java:721)
    at org.apache.maven.plugin.resources.remote.ProcessRemoteResourcesMojo.getProjects (ProcessRemoteResourcesMojo.java:624)
    at org.apache.maven.plugin.resources.remote.ProcessRemoteResourcesMojo.configureVelocityContext (ProcessRemoteResourcesMojo.java:1009)
    at org.apache.maven.plugin.resources.remote.ProcessRemoteResourcesMojo.execute (ProcessRemoteResourcesMojo.java:513)
    at org.apache.maven.plugin.DefaultBuildPluginManager.executeMojo (DefaultBuildPluginManager.java:137)
    at org.apache.maven.lifecycle.internal.MojoExecutor.execute (MojoExecutor.java:210)
    at org.apache.maven.lifecycle.internal.MojoExecutor.execute (MojoExecutor.java:156)
    at org.apache.maven.lifecycle.internal.MojoExecutor.execute (MojoExecutor.java:148)
    at org.apache.maven.lifecycle.internal.LifecycleModuleBuilder.buildProject (LifecycleModuleBuilder.java:117)
    at org.apache.maven.lifecycle.internal.LifecycleModuleBuilder.buildProject (LifecycleModuleBuilder.java:81)
    at org.apache.maven.lifecycle.internal.builder.singlethreaded.SingleThreadedBuilder.build (SingleThreadedBuilder.java:56)
    at org.apache.maven.lifecycle.internal.LifecycleStarter.execute (LifecycleStarter.java:128)
    at org.apache.maven.DefaultMaven.doExecute (DefaultMaven.java:305)
    at org.apache.maven.DefaultMaven.doExecute (DefaultMaven.java:192)
    at org.apache.maven.DefaultMaven.execute (DefaultMaven.java:105)
    at org.jvnet.hudson.maven3.launcher.Maven35Launcher.main (Maven35Launcher.java:130)
    at sun.reflect.NativeMethodAccessorImpl.invoke0 (Native Method)
    at sun.reflect.NativeMethodAccessorImpl.invoke (NativeMethodAccessorImpl.java:62)
    at sun.reflect.DelegatingMethodAccessorImpl.invoke (DelegatingMethodAccessorImpl.java:43)
    at java.lang.reflect.Method.invoke (Method.java:498)
    at org.codehaus.plexus.classworlds.launcher.Launcher.launchEnhanced (Launcher.java:282)
    at org.codehaus.plexus.classworlds.launcher.Launcher.launch (Launcher.java:225)
    at jenkins.maven3.agent.Maven35Main.launch (Maven35Main.java:178)
    at sun.reflect.NativeMethodAccessorImpl.invoke0 (Native Method)
    at sun.reflect.NativeMethodAccessorImpl.invoke (NativeMethodAccessorImpl.java:62)
    at sun.reflect.DelegatingMethodAccessorImpl.invoke (DelegatingMethodAccessorImpl.java:43)
    at java.lang.reflect.Method.invoke (Method.java:498)
    at hudson.maven.Maven3Builder.call (Maven3Builder.java:139)
    at hudson.maven.Maven3Builder.call (Maven3Builder.java:70)
    at hudson.remoting.UserRequest.perform (UserRequest.java:212)
    at hudson.remoting.UserRequest.perform (UserRequest.java:54)
    at hudson.remoting.Request$2.run (Request.java:369)
    at hudson.remoting.InterceptingExecutorService$1.call (InterceptingExecutorService.java:72)
    at java.util.concurrent.FutureTask.run (FutureTask.java:266)
    at java.util.concurrent.ThreadPoolExecutor.runWorker (ThreadPoolExecutor.java:1149)
    at java.util.concurrent.ThreadPoolExecutor$Worker.run (ThreadPoolExecutor.java:624)
    at java.lang.Thread.run (Thread.java:748)
[ERROR]
[ERROR] Re-run Maven using the -X switch to enable full debug logging.
[ERROR]
[ERROR] For more information about the errors and possible solutions, please read the following articles:
[ERROR] [Help 1] http://cwiki.apache.org/confluence/display/MAVEN/PluginExecutionException
[ERROR]
[ERROR] After correcting the problems, you can resume the build with the command
[ERROR]   mvn <goals> -rf :activemq-osgi
[JENKINS] Archiving <https://builds.apache.org/job/ActiveMQ-Java8/ws/activemq-kahadb-store/pom.xml> to org.apache.activemq/activemq-kahadb-store/5.16.0-SNAPSHOT/activemq-kahadb-store-5.16.0-SNAPSHOT.pom
[JENKINS] Archiving <https://builds.apache.org/job/ActiveMQ-Java8/ws/activemq-kahadb-store/target/activemq-kahadb-store-5.16.0-SNAPSHOT.jar> to org.apache.activemq/activemq-kahadb-store/5.16.0-20191120.132418-322/activemq-kahadb-store-5.16.0-20191120.132418-322.jar
[JENKINS] Archiving <https://builds.apache.org/job/ActiveMQ-Java8/ws/activemq-osgi/pom.xml> to org.apache.activemq/activemq-osgi/5.16.0-SNAPSHOT/activemq-osgi-5.16.0-SNAPSHOT.pom
[JENKINS] Archiving <https://builds.apache.org/job/ActiveMQ-Java8/ws/activemq-unit-tests/pom.xml> to org.apache.activemq/activemq-unit-tests/5.16.0-SNAPSHOT/activemq-unit-tests-5.16.0-SNAPSHOT.pom
[JENKINS] Archiving <https://builds.apache.org/job/ActiveMQ-Java8/ws/activemq-unit-tests/target/activemq-unit-tests-5.16.0-SNAPSHOT.jar> to org.apache.activemq/activemq-unit-tests/5.16.0-20191120.183951-318/activemq-unit-tests-5.16.0-20191120.183951-318.jar
[JENKINS] Archiving <https://builds.apache.org/job/ActiveMQ-Java8/ws/activemq-unit-tests/target/activemq-unit-tests-5.16.0-SNAPSHOT-tests.jar> to org.apache.activemq/activemq-unit-tests/5.16.0-20191120.183951-318/activemq-unit-tests-5.16.0-20191120.183951-318-tests.jar
[JENKINS] Archiving <https://builds.apache.org/job/ActiveMQ-Java8/ws/activemq-openwire-legacy/pom.xml> to org.apache.activemq/activemq-openwire-legacy/5.16.0-SNAPSHOT/activemq-openwire-legacy-5.16.0-SNAPSHOT.pom
[JENKINS] Archiving <https://builds.apache.org/job/ActiveMQ-Java8/ws/activemq-openwire-legacy/target/activemq-openwire-legacy-5.16.0-SNAPSHOT.jar> to org.apache.activemq/activemq-openwire-legacy/5.16.0-20191120.130448-322/activemq-openwire-legacy-5.16.0-20191120.130448-322.jar
[JENKINS] Archiving <https://builds.apache.org/job/ActiveMQ-Java8/ws/activemq-karaf-itest/pom.xml> to org.apache.activemq/activemq-karaf-itest/5.16.0-SNAPSHOT/activemq-karaf-itest-5.16.0-SNAPSHOT.pom
[JENKINS] Archiving <https://builds.apache.org/job/ActiveMQ-Java8/ws/activemq-karaf-itest/target/activemq-karaf-itest-5.16.0-SNAPSHOT.jar> to org.apache.activemq/activemq-karaf-itest/5.16.0-20191120.191506-318/activemq-karaf-itest-5.16.0-20191120.191506-318.jar
[JENKINS] Archiving <https://builds.apache.org/job/ActiveMQ-Java8/ws/activemq-rar/pom.xml> to org.apache.activemq/activemq-rar/5.16.0-SNAPSHOT/activemq-rar-5.16.0-SNAPSHOT.pom
[JENKINS] Archiving <https://builds.apache.org/job/ActiveMQ-Java8/ws/activemq-rar/target/activemq-rar-5.16.0-SNAPSHOT.rar> to org.apache.activemq/activemq-rar/5.16.0-20191120.190448-316/activemq-rar-5.16.0-20191120.190448-316.rar
[Fast Archiver] Compressed 10.80 MB of artifacts by 57.0% relative to #1362
[JENKINS] Archiving <https://builds.apache.org/job/ActiveMQ-Java8/ws/activemq-http/pom.xml> to org.apache.activemq/activemq-http/5.16.0-SNAPSHOT/activemq-http-5.16.0-SNAPSHOT.pom
[JENKINS] Archiving <https://builds.apache.org/job/ActiveMQ-Java8/ws/activemq-http/target/activemq-http-5.16.0-SNAPSHOT.jar> to org.apache.activemq/activemq-http/5.16.0-20191120.185040-318/activemq-http-5.16.0-20191120.185040-318.jar
[JENKINS] Archiving <https://builds.apache.org/job/ActiveMQ-Java8/ws/activemq-amqp/pom.xml> to org.apache.activemq/activemq-amqp/5.16.0-SNAPSHOT/activemq-amqp-5.16.0-SNAPSHOT.pom
[JENKINS] Archiving <https://builds.apache.org/job/ActiveMQ-Java8/ws/activemq-amqp/target/activemq-amqp-5.16.0-SNAPSHOT.jar> to org.apache.activemq/activemq-amqp/5.16.0-20191120.185824-317/activemq-amqp-5.16.0-20191120.185824-317.jar
[JENKINS] Archiving <https://builds.apache.org/job/ActiveMQ-Java8/ws/activemq-client/pom.xml> to org.apache.activemq/activemq-client/5.16.0-SNAPSHOT/activemq-client-5.16.0-SNAPSHOT.pom
[JENKINS] Archiving <https://builds.apache.org/job/ActiveMQ-Java8/ws/activemq-client/target/activemq-client-5.16.0-SNAPSHOT.jar> to org.apache.activemq/activemq-client/5.16.0-20191120.130433-322/activemq-client-5.16.0-20191120.130433-322.jar
[JENKINS] Archiving <https://builds.apache.org/job/ActiveMQ-Java8/ws/activemq-blueprint/pom.xml> to org.apache.activemq/activemq-blueprint/5.16.0-SNAPSHOT/activemq-blueprint-5.16.0-SNAPSHOT.pom
[JENKINS] Archiving <https://builds.apache.org/job/ActiveMQ-Java8/ws/activemq-blueprint/target/activemq-blueprint-5.16.0-SNAPSHOT.jar> to org.apache.activemq/activemq-blueprint/5.16.0-20191120.190703-320/activemq-blueprint-5.16.0-20191120.190703-320.jar
[JENKINS] Archiving <https://builds.apache.org/job/ActiveMQ-Java8/ws/activemq-tooling/activemq-junit/pom.xml> to org.apache.activemq.tooling/activemq-junit/5.16.0-SNAPSHOT/activemq-junit-5.16.0-SNAPSHOT.pom
[JENKINS] Archiving <https://builds.apache.org/job/ActiveMQ-Java8/ws/activemq-tooling/activemq-junit/target/activemq-junit-5.16.0-SNAPSHOT.jar> to org.apache.activemq.tooling/activemq-junit/5.16.0-20191120.142524-319/activemq-junit-5.16.0-20191120.142524-319.jar
[JENKINS] Archiving <https://builds.apache.org/job/ActiveMQ-Java8/ws/activemq-tooling/pom.xml> to org.apache.activemq.tooling/activemq-tooling/5.16.0-SNAPSHOT/activemq-tooling-5.16.0-SNAPSHOT.pom
[JENKINS] Archiving <https://builds.apache.org/job/ActiveMQ-Java8/ws/activemq-jms-pool/pom.xml> to org.apache.activemq/activemq-jms-pool/5.16.0-SNAPSHOT/activemq-jms-pool-5.16.0-SNAPSHOT.pom
[JENKINS] Archiving <https://builds.apache.org/job/ActiveMQ-Java8/ws/activemq-jms-pool/target/activemq-jms-pool-5.16.0-SNAPSHOT.jar> to org.apache.activemq/activemq-jms-pool/5.16.0-20191120.141119-320/activemq-jms-pool-5.16.0-20191120.141119-320.jar
[JENKINS] Archiving <https://builds.apache.org/job/ActiveMQ-Java8/ws/activemq-pool/pom.xml> to org.apache.activemq/activemq-pool/5.16.0-SNAPSHOT/activemq-pool-5.16.0-SNAPSHOT.pom
[JENKINS] Archiving <https://builds.apache.org/job/ActiveMQ-Java8/ws/activemq-pool/target/activemq-pool-5.16.0-SNAPSHOT.jar> to org.apache.activemq/activemq-pool/5.16.0-20191120.141137-320/activemq-pool-5.16.0-20191120.141137-320.jar
[JENKINS] Archiving <https://builds.apache.org/job/ActiveMQ-Java8/ws/activemq-jdbc-store/pom.xml> to org.apache.activemq/activemq-jdbc-store/5.16.0-SNAPSHOT/activemq-jdbc-store-5.16.0-SNAPSHOT.pom
[JENKINS] Archiving <https://builds.apache.org/job/ActiveMQ-Java8/ws/activemq-jdbc-store/target/activemq-jdbc-store-5.16.0-SNAPSHOT.jar> to org.apache.activemq/activemq-jdbc-store/5.16.0-20191120.140052-322/activemq-jdbc-store-5.16.0-20191120.140052-322.jar
[JENKINS] Archiving <https://builds.apache.org/job/ActiveMQ-Java8/ws/activemq-camel/pom.xml> to org.apache.activemq/activemq-camel/5.16.0-SNAPSHOT/activemq-camel-5.16.0-SNAPSHOT.pom
[JENKINS] Archiving <https://builds.apache.org/job/ActiveMQ-Java8/ws/activemq-camel/target/activemq-camel-5.16.0-SNAPSHOT.jar> to org.apache.activemq/activemq-camel/5.16.0-20191120.190314-318/activemq-camel-5.16.0-20191120.190314-318.jar
[JENKINS] Archiving <https://builds.apache.org/job/ActiveMQ-Java8/ws/activemq-runtime-config/pom.xml> to org.apache.activemq/activemq-runtime-config/5.16.0-SNAPSHOT/activemq-runtime-config-5.16.0-SNAPSHOT.pom
[JENKINS] Archiving <https://builds.apache.org/job/ActiveMQ-Java8/ws/activemq-runtime-config/target/activemq-runtime-config-5.16.0-SNAPSHOT.jar> to org.apache.activemq/activemq-runtime-config/5.16.0-20191120.142500-319/activemq-runtime-config-5.16.0-20191120.142500-319.jar
[JENKINS] Archiving <https://builds.apache.org/job/ActiveMQ-Java8/ws/pom.xml> to org.apache.activemq/activemq-parent/5.16.0-SNAPSHOT/activemq-parent-5.16.0-SNAPSHOT.pom
[Fast Archiver] Compressed 61.79 KB of artifacts by 51.8% relative to #1362
[JENKINS] Archiving <https://builds.apache.org/job/ActiveMQ-Java8/ws/activemq-stomp/pom.xml> to org.apache.activemq/activemq-stomp/5.16.0-SNAPSHOT/activemq-stomp-5.16.0-SNAPSHOT.pom
[JENKINS] Archiving <https://builds.apache.org/job/ActiveMQ-Java8/ws/activemq-stomp/target/activemq-stomp-5.16.0-SNAPSHOT.jar> to org.apache.activemq/activemq-stomp/5.16.0-20191120.134013-322/activemq-stomp-5.16.0-20191120.134013-322.jar
[JENKINS] Archiving <https://builds.apache.org/job/ActiveMQ-Java8/ws/activemq-openwire-generator/pom.xml> to org.apache.activemq/activemq-openwire-generator/5.16.0-SNAPSHOT/activemq-openwire-generator-5.16.0-SNAPSHOT.pom
[JENKINS] Archiving <https://builds.apache.org/job/ActiveMQ-Java8/ws/activemq-openwire-generator/target/activemq-openwire-generator-5.16.0-SNAPSHOT.jar> to org.apache.activemq/activemq-openwire-generator/5.16.0-20191120.130146-323/activemq-openwire-generator-5.16.0-20191120.130146-323.jar
[JENKINS] Archiving <https://builds.apache.org/job/ActiveMQ-Java8/ws/activemq-broker/pom.xml> to org.apache.activemq/activemq-broker/5.16.0-SNAPSHOT/activemq-broker-5.16.0-SNAPSHOT.pom
[JENKINS] Archiving <https://builds.apache.org/job/ActiveMQ-Java8/ws/activemq-broker/target/activemq-broker-5.16.0-SNAPSHOT.jar> to org.apache.activemq/activemq-broker/5.16.0-20191120.130734-322/activemq-broker-5.16.0-20191120.130734-322.jar
[JENKINS] Archiving <https://builds.apache.org/job/ActiveMQ-Java8/ws/activemq-broker/target/activemq-broker-5.16.0-SNAPSHOT-tests.jar> to org.apache.activemq/activemq-broker/5.16.0-20191120.130734-322/activemq-broker-5.16.0-20191120.130734-322-tests.jar
[JENKINS] Archiving <https://builds.apache.org/job/ActiveMQ-Java8/ws/activemq-web-demo/pom.xml> to org.apache.activemq/activemq-web-demo/5.16.0-SNAPSHOT/activemq-web-demo-5.16.0-SNAPSHOT.pom
[JENKINS] Archiving <https://builds.apache.org/job/ActiveMQ-Java8/ws/activemq-web-demo/target/activemq-web-demo-5.16.0-SNAPSHOT.war> to org.apache.activemq/activemq-web-demo/5.16.0-20191120.190749-316/activemq-web-demo-5.16.0-20191120.190749-316.war
[Fast Archiver] Compressed 34.29 MB of artifacts by 93.1% relative to #1362
[JENKINS] Archiving <https://builds.apache.org/job/ActiveMQ-Java8/ws/activemq-mqtt/pom.xml> to org.apache.activemq/activemq-mqtt/5.16.0-SNAPSHOT/activemq-mqtt-5.16.0-SNAPSHOT.pom
[JENKINS] Archiving <https://builds.apache.org/job/ActiveMQ-Java8/ws/activemq-mqtt/target/activemq-mqtt-5.16.0-SNAPSHOT.jar> to org.apache.activemq/activemq-mqtt/5.16.0-20191120.140038-322/activemq-mqtt-5.16.0-20191120.140038-322.jar
[JENKINS] Archiving <https://builds.apache.org/job/ActiveMQ-Java8/ws/activemq-shiro/pom.xml> to org.apache.activemq/activemq-shiro/5.16.0-SNAPSHOT/activemq-shiro-5.16.0-SNAPSHOT.pom
[JENKINS] Archiving <https://builds.apache.org/job/ActiveMQ-Java8/ws/activemq-shiro/target/activemq-shiro-5.16.0-SNAPSHOT.jar> to org.apache.activemq/activemq-shiro/5.16.0-20191120.190519-318/activemq-shiro-5.16.0-20191120.190519-318.jar
[JENKINS] Archiving <https://builds.apache.org/job/ActiveMQ-Java8/ws/activemq-tooling/activemq-perf-maven-plugin/pom.xml> to org.apache.activemq.tooling/activemq-perf-maven-plugin/5.16.0-SNAPSHOT/activemq-perf-maven-plugin-5.16.0-SNAPSHOT.pom
[JENKINS] Archiving <https://builds.apache.org/job/ActiveMQ-Java8/ws/activemq-tooling/activemq-perf-maven-plugin/target/activemq-perf-maven-plugin-5.16.0-SNAPSHOT.jar> to org.apache.activemq.tooling/activemq-perf-maven-plugin/5.16.0-20191120.190555-317/activemq-perf-maven-plugin-5.16.0-20191120.190555-317.jar
[JENKINS] Archiving <https://builds.apache.org/job/ActiveMQ-Java8/ws/activemq-run/dependency-reduced-pom.xml> to org.apache.activemq/activemq-run/5.16.0-SNAPSHOT/activemq-run-5.16.0-SNAPSHOT.pom
[JENKINS] Archiving <https://builds.apache.org/job/ActiveMQ-Java8/ws/activemq-run/target/activemq-run-5.16.0-SNAPSHOT.jar> to org.apache.activemq/activemq-run/5.16.0-20191120.190502-318/activemq-run-5.16.0-20191120.190502-318.jar
[JENKINS] Archiving <https://builds.apache.org/job/ActiveMQ-Java8/ws/activemq-tooling/activemq-maven-plugin/pom.xml> to org.apache.activemq.tooling/activemq-maven-plugin/5.16.0-SNAPSHOT/activemq-maven-plugin-5.16.0-SNAPSHOT.pom
[JENKINS] Archiving <https://builds.apache.org/job/ActiveMQ-Java8/ws/activemq-tooling/activemq-maven-plugin/target/activemq-maven-plugin-5.16.0-SNAPSHOT.jar> to org.apache.activemq.tooling/activemq-maven-plugin/5.16.0-20191120.190616-316/activemq-maven-plugin-5.16.0-20191120.190616-316.jar
[JENKINS] Archiving <https://builds.apache.org/job/ActiveMQ-Java8/ws/activemq-karaf/pom.xml> to org.apache.activemq/activemq-karaf/5.16.0-SNAPSHOT/activemq-karaf-5.16.0-SNAPSHOT.pom
[JENKINS] Archiving <https://builds.apache.org/job/ActiveMQ-Java8/ws/activemq-karaf/target/activemq-karaf-5.16.0-SNAPSHOT.jar> to org.apache.activemq/activemq-karaf/5.16.0-20191120.190405-318/activemq-karaf-5.16.0-20191120.190405-318.jar
[JENKINS] Archiving <https://builds.apache.org/job/ActiveMQ-Java8/ws/activemq-karaf/target/classes/features.xml> to org.apache.activemq/activemq-karaf/5.16.0-20191120.190405-318/activemq-karaf-5.16.0-20191120.190405-318-features.xml
[JENKINS] Archiving <https://builds.apache.org/job/ActiveMQ-Java8/ws/activemq-karaf/target/classes/features-core.xml> to org.apache.activemq/activemq-karaf/5.16.0-20191120.190405-318/activemq-karaf-5.16.0-20191120.190405-318-features-core.xml
[JENKINS] Archiving <https://builds.apache.org/job/ActiveMQ-Java8/ws/activemq-karaf/target/classes/activemq.xml> to org.apache.activemq/activemq-karaf/5.16.0-20191120.190405-318/activemq-karaf-5.16.0-20191120.190405-318-activemq.xml
[JENKINS] Archiving <https://builds.apache.org/job/ActiveMQ-Java8/ws/activemq-karaf/target/classes/org.apache.activemq.server-default.cfg> to org.apache.activemq/activemq-karaf/5.16.0-20191120.190405-318/activemq-karaf-5.16.0-20191120.190405-318-activemq.cfg
[JENKINS] Archiving <https://builds.apache.org/job/ActiveMQ-Java8/ws/activemq-karaf/target/classes/org.apache.activemq.webconsole.cfg> to org.apache.activemq/activemq-karaf/5.16.0-20191120.190405-318/activemq-karaf-5.16.0-20191120.190405-318-activemq-webconsole.cfg
[JENKINS] Archiving <https://builds.apache.org/job/ActiveMQ-Java8/ws/activemq-web-console/pom.xml> to org.apache.activemq/activemq-web-console/5.16.0-SNAPSHOT/activemq-web-console-5.16.0-SNAPSHOT.pom
[JENKINS] Archiving <https://builds.apache.org/job/ActiveMQ-Java8/ws/activemq-web-console/target/activemq-web-console-5.16.0-SNAPSHOT.war> to org.apache.activemq/activemq-web-console/5.16.0-20191120.190810-316/activemq-web-console-5.16.0-20191120.190810-316.war
[Fast Archiver] Compressed 14.97 MB of artifacts by 63.9% relative to #1362
[JENKINS] Archiving <https://builds.apache.org/job/ActiveMQ-Java8/ws/activemq-jaas/pom.xml> to org.apache.activemq/activemq-jaas/5.16.0-SNAPSHOT/activemq-jaas-5.16.0-SNAPSHOT.pom
[JENKINS] Archiving <https://builds.apache.org/job/ActiveMQ-Java8/ws/activemq-jaas/target/activemq-jaas-5.16.0-SNAPSHOT.jar> to org.apache.activemq/activemq-jaas/5.16.0-20191120.130626-323/activemq-jaas-5.16.0-20191120.130626-323.jar
[JENKINS] Archiving <https://builds.apache.org/job/ActiveMQ-Java8/ws/activemq-itests-spring31/pom.xml> to org.apache.activemq/activemq-itests-spring31/5.16.0-SNAPSHOT/activemq-itests-spring31-5.16.0-SNAPSHOT.pom
[JENKINS] Archiving <https://builds.apache.org/job/ActiveMQ-Java8/ws/activemq-itests-spring31/target/activemq-itests-spring31-5.16.0-SNAPSHOT.jar> to org.apache.activemq/activemq-itests-spring31/5.16.0-20191120.191521-318/activemq-itests-spring31-5.16.0-20191120.191521-318.jar
[JENKINS] Archiving <https://builds.apache.org/job/ActiveMQ-Java8/ws/activemq-tooling/activemq-memtest-maven-plugin/pom.xml> to org.apache.activemq.tooling/activemq-memtest-maven-plugin/5.16.0-SNAPSHOT/activemq-memtest-maven-plugin-5.16.0-SNAPSHOT.pom
[JENKINS] Archiving <https://builds.apache.org/job/ActiveMQ-Java8/ws/activemq-tooling/activemq-memtest-maven-plugin/target/activemq-memtest-maven-plugin-5.16.0-SNAPSHOT.jar> to org.apache.activemq.tooling/activemq-memtest-maven-plugin/5.16.0-20191120.190534-317/activemq-memtest-maven-plugin-5.16.0-20191120.190534-317.jar
[JENKINS] Archiving <https://builds.apache.org/job/ActiveMQ-Java8/ws/activemq-ra/pom.xml> to org.apache.activemq/activemq-ra/5.16.0-SNAPSHOT/activemq-ra-5.16.0-SNAPSHOT.pom
[JENKINS] Archiving <https://builds.apache.org/job/ActiveMQ-Java8/ws/activemq-ra/target/activemq-ra-5.16.0-SNAPSHOT.jar> to org.apache.activemq/activemq-ra/5.16.0-20191120.141331-320/activemq-ra-5.16.0-20191120.141331-320.jar
[JENKINS] Archiving <https://builds.apache.org/job/ActiveMQ-Java8/ws/activemq-ra/target/xbean/activemq-ra.xsd> to org.apache.activemq/activemq-ra/5.16.0-20191120.141331-320/activemq-ra-5.16.0-20191120.141331-320.xsd
[JENKINS] Archiving <https://builds.apache.org/job/ActiveMQ-Java8/ws/activemq-ra/target/xbean/activemq-ra.xsd.html> to org.apache.activemq/activemq-ra/5.16.0-20191120.141331-320/activemq-ra-5.16.0-20191120.141331-320-schema.html
[JENKINS] Archiving <https://builds.apache.org/job/ActiveMQ-Java8/ws/activemq-ra/target/xbean/activemq-ra.xsd.html> to org.apache.activemq/activemq-ra/5.16.0-20191120.141331-320/activemq-ra-5.16.0-20191120.141331-320.xsd.html
[JENKINS] Archiving <https://builds.apache.org/job/ActiveMQ-Java8/ws/activemq-partition/pom.xml> to org.apache.activemq/activemq-partition/5.16.0-SNAPSHOT/activemq-partition-5.16.0-SNAPSHOT.pom
[JENKINS] Archiving <https://builds.apache.org/job/ActiveMQ-Java8/ws/activemq-partition/target/activemq-partition-5.16.0-SNAPSHOT.jar> to org.apache.activemq/activemq-partition/5.16.0-20191120.141557-319/activemq-partition-5.16.0-20191120.141557-319.jar
[JENKINS] Archiving <https://builds.apache.org/job/ActiveMQ-Java8/ws/activemq-all/dependency-reduced-pom.xml> to org.apache.activemq/activemq-all/5.16.0-SNAPSHOT/activemq-all-5.16.0-SNAPSHOT.pom
[JENKINS] Archiving <https://builds.apache.org/job/ActiveMQ-Java8/ws/activemq-all/target/activemq-all-5.16.0-SNAPSHOT.jar> to org.apache.activemq/activemq-all/5.16.0-20191120.190332-317/activemq-all-5.16.0-20191120.190332-317.jar
[JENKINS] Archiving <https://builds.apache.org/job/ActiveMQ-Java8/ws/assembly/pom.xml> to org.apache.activemq/apache-activemq/5.16.0-SNAPSHOT/apache-activemq-5.16.0-SNAPSHOT.pom
[JENKINS] Archiving <https://builds.apache.org/job/ActiveMQ-Java8/ws/assembly/target/apache-activemq-5.16.0-SNAPSHOT-bin.tar.gz> to org.apache.activemq/apache-activemq/5.16.0-20191120.191721-316/apache-activemq-5.16.0-20191120.191721-316-bin.tar.gz
[JENKINS] Archiving <https://builds.apache.org/job/ActiveMQ-Java8/ws/assembly/target/apache-activemq-5.16.0-SNAPSHOT-bin.zip> to org.apache.activemq/apache-activemq/5.16.0-20191120.191721-316/apache-activemq-5.16.0-20191120.191721-316-bin.zip
[Fast Archiver] Compressed 125.75 MB of artifacts by 29.8% relative to #1362
[JENKINS] Archiving <https://builds.apache.org/job/ActiveMQ-Java8/ws/activemq-console/pom.xml> to org.apache.activemq/activemq-console/5.16.0-SNAPSHOT/activemq-console-5.16.0-SNAPSHOT.pom
[JENKINS] Archiving <https://builds.apache.org/job/ActiveMQ-Java8/ws/activemq-console/target/activemq-console-5.16.0-SNAPSHOT.jar> to org.apache.activemq/activemq-console/5.16.0-20191120.141527-319/activemq-console-5.16.0-20191120.141527-319.jar
[JENKINS] Archiving <https://builds.apache.org/job/ActiveMQ-Java8/ws/activemq-spring/pom.xml> to org.apache.activemq/activemq-spring/5.16.0-SNAPSHOT/activemq-spring-5.16.0-SNAPSHOT.pom
[JENKINS] Archiving <https://builds.apache.org/job/ActiveMQ-Java8/ws/activemq-spring/target/activemq-spring-5.16.0-SNAPSHOT.jar> to org.apache.activemq/activemq-spring/5.16.0-20191120.141502-319/activemq-spring-5.16.0-20191120.141502-319.jar
[JENKINS] Archiving <https://builds.apache.org/job/ActiveMQ-Java8/ws/activemq-spring/target/classes/activemq.xsd> to org.apache.activemq/activemq-spring/5.16.0-20191120.141502-319/activemq-spring-5.16.0-20191120.141502-319.xsd
[JENKINS] Archiving <https://builds.apache.org/job/ActiveMQ-Java8/ws/activemq-spring/target/classes/activemq.xsd.html> to org.apache.activemq/activemq-spring/5.16.0-20191120.141502-319/activemq-spring-5.16.0-20191120.141502-319-schema.html
[Fast Archiver] Compressed 906.19 KB of artifacts by 77.7% relative to #1362
[JENKINS] Archiving <https://builds.apache.org/job/ActiveMQ-Java8/ws/activemq-cf/pom.xml> to org.apache.activemq/activemq-cf/5.16.0-SNAPSHOT/activemq-cf-5.16.0-SNAPSHOT.pom
[JENKINS] Archiving <https://builds.apache.org/job/ActiveMQ-Java8/ws/activemq-cf/target/activemq-cf-5.16.0-SNAPSHOT.jar> to org.apache.activemq/activemq-cf/5.16.0-20191120.190431-318/activemq-cf-5.16.0-20191120.190431-318.jar
[JENKINS] Archiving <https://builds.apache.org/job/ActiveMQ-Java8/ws/activemq-leveldb-store/pom.xml> to org.apache.activemq/activemq-leveldb-store/5.16.0-SNAPSHOT/activemq-leveldb-store-5.16.0-SNAPSHOT.pom
[JENKINS] Archiving <https://builds.apache.org/job/ActiveMQ-Java8/ws/activemq-leveldb-store/target/activemq-leveldb-store-5.16.0-SNAPSHOT.jar> to org.apache.activemq/activemq-leveldb-store/5.16.0-20191120.141018-321/activemq-leveldb-store-5.16.0-20191120.141018-321.jar
[JENKINS] Archiving <https://builds.apache.org/job/ActiveMQ-Java8/ws/activemq-web/pom.xml> to org.apache.activemq/activemq-web/5.16.0-SNAPSHOT/activemq-web-5.16.0-SNAPSHOT.pom
[JENKINS] Archiving <https://builds.apache.org/job/ActiveMQ-Java8/ws/activemq-web/target/activemq-web-5.16.0-SNAPSHOT.jar> to org.apache.activemq/activemq-web/5.16.0-20191120.190646-316/activemq-web-5.16.0-20191120.190646-316.jar
[JENKINS] Archiving <https://builds.apache.org/job/ActiveMQ-Java8/ws/activemq-log4j-appender/pom.xml> to org.apache.activemq/activemq-log4j-appender/5.16.0-SNAPSHOT/activemq-log4j-appender-5.16.0-SNAPSHOT.pom
[JENKINS] Archiving <https://builds.apache.org/job/ActiveMQ-Java8/ws/activemq-log4j-appender/target/activemq-log4j-appender-5.16.0-SNAPSHOT.jar> to org.apache.activemq/activemq-log4j-appender/5.16.0-20191120.190350-318/activemq-log4j-appender-5.16.0-20191120.190350-318.jar
No mail will be sent out, as 'ActiveMQ-Java8 » ActiveMQ :: KahaDB Store #1363' does not have a result yet. Please make sure you set a proper result in case of pipeline/build scripts.
Sending e-mails to: [hidden email]
Sending e-mails to: [hidden email]
No mail will be sent out, as 'ActiveMQ-Java8 » ActiveMQ :: Openwire Legacy Support #1363' does not have a result yet. Please make sure you set a proper result in case of pipeline/build scripts.
No mail will be sent out, as 'ActiveMQ-Java8 » ActiveMQ :: Karaf Integration Tests #1363' does not have a result yet. Please make sure you set a proper result in case of pipeline/build scripts.
No mail will be sent out, as 'ActiveMQ-Java8 » ActiveMQ :: RAR #1363' does not have a result yet. Please make sure you set a proper result in case of pipeline/build scripts.
No mail will be sent out, as 'ActiveMQ-Java8 » ActiveMQ :: HTTP Protocol Support #1363' does not have a result yet. Please make sure you set a proper result in case of pipeline/build scripts.
No mail will be sent out, as 'ActiveMQ-Java8 » ActiveMQ :: AMQP #1363' does not have a result yet. Please make sure you set a proper result in case of pipeline/build scripts.
No mail will be sent out, as 'ActiveMQ-Java8 » ActiveMQ :: Client #1363' does not have a result yet. Please make sure you set a proper result in case of pipeline/build scripts.
No mail will be sent out, as 'ActiveMQ-Java8 » ActiveMQ :: Blueprint #1363' does not have a result yet. Please make sure you set a proper result in case of pipeline/build scripts.
No mail will be sent out, as 'ActiveMQ-Java8 » ActiveMQ :: JUnit Rule #1363' does not have a result yet. Please make sure you set a proper result in case of pipeline/build scripts.
No mail will be sent out, as 'ActiveMQ-Java8 » ActiveMQ :: Tooling #1363' does not have a result yet. Please make sure you set a proper result in case of pipeline/build scripts.
No mail will be sent out, as 'ActiveMQ-Java8 » ActiveMQ :: Generic JMS Pool #1363' does not have a result yet. Please make sure you set a proper result in case of pipeline/build scripts.
No mail will be sent out, as 'ActiveMQ-Java8 » ActiveMQ :: Pool #1363' does not have a result yet. Please make sure you set a proper result in case of pipeline/build scripts.
No mail will be sent out, as 'ActiveMQ-Java8 » ActiveMQ :: JDBC Store #1363' does not have a result yet. Please make sure you set a proper result in case of pipeline/build scripts.
No mail will be sent out, as 'ActiveMQ-Java8 » ActiveMQ :: Camel #1363' does not have a result yet. Please make sure you set a proper result in case of pipeline/build scripts.
No mail will be sent out, as 'ActiveMQ-Java8 » ActiveMQ :: Runtime Configuration #1363' does not have a result yet. Please make sure you set a proper result in case of pipeline/build scripts.
No mail will be sent out, as 'ActiveMQ-Java8 » ActiveMQ #1363' does not have a result yet. Please make sure you set a proper result in case of pipeline/build scripts.
No mail will be sent out, as 'ActiveMQ-Java8 » ActiveMQ :: STOMP Protocol #1363' does not have a result yet. Please make sure you set a proper result in case of pipeline/build scripts.
No mail will be sent out, as 'ActiveMQ-Java8 » ActiveMQ :: Openwire Generator #1363' does not have a result yet. Please make sure you set a proper result in case of pipeline/build scripts.
No mail will be sent out, as 'ActiveMQ-Java8 » ActiveMQ :: Broker #1363' does not have a result yet. Please make sure you set a proper result in case of pipeline/build scripts.
No mail will be sent out, as 'ActiveMQ-Java8 » ActiveMQ :: Web Demo #1363' does not have a result yet. Please make sure you set a proper result in case of pipeline/build scripts.
Sending e-mails to: [hidden email]
No mail will be sent out, as 'ActiveMQ-Java8 » ActiveMQ :: Shiro #1363' does not have a result yet. Please make sure you set a proper result in case of pipeline/build scripts.
No mail will be sent out, as 'ActiveMQ-Java8 » ActiveMQ :: Performance Test Plugin #1363' does not have a result yet. Please make sure you set a proper result in case of pipeline/build scripts.
No mail will be sent out, as 'ActiveMQ-Java8 » ActiveMQ :: Run Jar #1363' does not have a result yet. Please make sure you set a proper result in case of pipeline/build scripts.
No mail will be sent out, as 'ActiveMQ-Java8 » ActiveMQ :: StartUp/Stop Plugin #1363' does not have a result yet. Please make sure you set a proper result in case of pipeline/build scripts.
No mail will be sent out, as 'ActiveMQ-Java8 » ActiveMQ :: Apache Karaf #1363' does not have a result yet. Please make sure you set a proper result in case of pipeline/build scripts.
No mail will be sent out, as 'ActiveMQ-Java8 » ActiveMQ :: Web Console #1363' does not have a result yet. Please make sure you set a proper result in case of pipeline/build scripts.
No mail will be sent out, as 'ActiveMQ-Java8 » ActiveMQ :: JAAS #1363' does not have a result yet. Please make sure you set a proper result in case of pipeline/build scripts.
No mail will be sent out, as 'ActiveMQ-Java8 » ActiveMQ :: Integration Test :: Spring 3.1 #1363' does not have a result yet. Please make sure you set a proper result in case of pipeline/build scripts.
No mail will be sent out, as 'ActiveMQ-Java8 » ActiveMQ :: Memory Usage Test Plugin #1363' does not have a result yet. Please make sure you set a proper result in case of pipeline/build scripts.
No mail will be sent out, as 'ActiveMQ-Java8 » ActiveMQ :: RA #1363' does not have a result yet. Please make sure you set a proper result in case of pipeline/build scripts.
No mail will be sent out, as 'ActiveMQ-Java8 » ActiveMQ :: Partition Management #1363' does not have a result yet. Please make sure you set a proper result in case of pipeline/build scripts.
No mail will be sent out, as 'ActiveMQ-Java8 » ActiveMQ :: All JAR bundle #1363' does not have a result yet. Please make sure you set a proper result in case of pipeline/build scripts.
No mail will be sent out, as 'ActiveMQ-Java8 » ActiveMQ :: Assembly #1363' does not have a result yet. Please make sure you set a proper result in case of pipeline/build scripts.
No mail will be sent out, as 'ActiveMQ-Java8 » ActiveMQ :: Console #1363' does not have a result yet. Please make sure you set a proper result in case of pipeline/build scripts.
No mail will be sent out, as 'ActiveMQ-Java8 » ActiveMQ :: Spring #1363' does not have a result yet. Please make sure you set a proper result in case of pipeline/build scripts.
No mail will be sent out, as 'ActiveMQ-Java8 » ActiveMQ :: ConnectionFactory #1363' does not have a result yet. Please make sure you set a proper result in case of pipeline/build scripts.
Sending e-mails to: [hidden email]
No mail will be sent out, as 'ActiveMQ-Java8 » ActiveMQ :: Web #1363' does not have a result yet. Please make sure you set a proper result in case of pipeline/build scripts.
No mail will be sent out, as 'ActiveMQ-Java8 » ActiveMQ :: Log4j Appender #1363' does not have a result yet. Please make sure you set a proper result in case of pipeline/build scripts.
[locks-and-latches] Releasing all the locks
[locks-and-latches] All the locks released
channel stopped
Reply | Threaded
Open this post in threaded view
|

Jenkins build is unstable: ActiveMQ-Java8 #1364

Apache Jenkins Server-2
Reply | Threaded
Open this post in threaded view
|

Jenkins build is still unstable: ActiveMQ-Java8 #1365

Apache Jenkins Server-2
Reply | Threaded
Open this post in threaded view
|

Jenkins build is still unstable: ActiveMQ-Java8 #1366

Apache Jenkins Server-2
Reply | Threaded
Open this post in threaded view
|

Jenkins build is still unstable: ActiveMQ-Java8 #1367

Apache Jenkins Server-2
Reply | Threaded
Open this post in threaded view
|

Jenkins build is still unstable: ActiveMQ-Java8 #1368

Apache Jenkins Server-2
Reply | Threaded
Open this post in threaded view
|

Jenkins build is still unstable: ActiveMQ-Java8 #1369

Apache Jenkins Server-2
Reply | Threaded
Open this post in threaded view
|

Jenkins build is still unstable: ActiveMQ-Java8 #1370

Apache Jenkins Server-2
Reply | Threaded
Open this post in threaded view
|

Jenkins build is still unstable: ActiveMQ-Java8 #1371

Apache Jenkins Server-2
Reply | Threaded
Open this post in threaded view
|

Jenkins build is still unstable: ActiveMQ-Java8 #1372

Apache Jenkins Server-2
123