Quantcast

Jenkins build is unstable: ActiveMQ #897

classic Classic list List threaded Threaded
11 messages Options
Reply | Threaded
Open this post in threaded view
|  
Report Content as Inappropriate

Jenkins build is unstable: ActiveMQ #897

Apache Jenkins Server-2
Reply | Threaded
Open this post in threaded view
|  
Report Content as Inappropriate

Jenkins build is still unstable: ActiveMQ #898

Apache Jenkins Server-2
Reply | Threaded
Open this post in threaded view
|  
Report Content as Inappropriate

Jenkins build is still unstable: ActiveMQ #899

Apache Jenkins Server-2
Reply | Threaded
Open this post in threaded view
|  
Report Content as Inappropriate

Jenkins build is still unstable: ActiveMQ #900

Apache Jenkins Server-2
Reply | Threaded
Open this post in threaded view
|  
Report Content as Inappropriate

Build failed in Jenkins: ActiveMQ #901

Apache Jenkins Server-2
See <https://builds.apache.org/job/ActiveMQ/901/changes>

Changes:

[gtully] https://issues.apache.org/jira/browse/AMQ-2570 - remove wildcards as they are ignored by bnd when the classes are not referenced. this fixes logging at the default debug level for pax logging when unbound from the war file

------------------------------------------
[...truncated 17243 lines...]
Downloading: http://repository.apache.org/snapshots/commons-cli/commons-cli/1.2/commons-cli-1.2.pom
[INFO] Unable to find resource 'commons-cli:commons-cli:pom:1.2' in repository apache.snapshots (https://repository.apache.org/content/repositories/snapshots/)
Downloading: http://repository.springsource.com/maven/bundles/external/commons-cli/commons-cli/1.2/commons-cli-1.2.pom
[INFO] Unable to find resource 'commons-cli:commons-cli:pom:1.2' in repository com.springsource.repository.bundles.external (http://repository.springsource.com/maven/bundles/external)
Downloading: http://repo1.maven.org/maven2/commons-cli/commons-cli/1.2/commons-cli-1.2.pom

Downloading: http://repository.apache.org/snapshots/org/apache/maven/wagon/wagon-ssh-external/1.0-beta-6/wagon-ssh-external-1.0-beta-6.pom
[INFO] Unable to find resource 'org.apache.maven.wagon:wagon-ssh-external:pom:1.0-beta-6' in repository apache.snapshots (https://repository.apache.org/content/repositories/snapshots/)
Downloading: http://repository.springsource.com/maven/bundles/external/org/apache/maven/wagon/wagon-ssh-external/1.0-beta-6/wagon-ssh-external-1.0-beta-6.pom
[INFO] Unable to find resource 'org.apache.maven.wagon:wagon-ssh-external:pom:1.0-beta-6' in repository com.springsource.repository.bundles.external (http://repository.springsource.com/maven/bundles/external)
Downloading: http://repo1.maven.org/maven2/org/apache/maven/wagon/wagon-ssh-external/1.0-beta-6/wagon-ssh-external-1.0-beta-6.pom

Downloading: http://repository.apache.org/snapshots/org/apache/maven/wagon/wagon-ssh-common/1.0-beta-6/wagon-ssh-common-1.0-beta-6.pom
[INFO] Unable to find resource 'org.apache.maven.wagon:wagon-ssh-common:pom:1.0-beta-6' in repository apache.snapshots (https://repository.apache.org/content/repositories/snapshots/)
Downloading: http://repository.springsource.com/maven/bundles/external/org/apache/maven/wagon/wagon-ssh-common/1.0-beta-6/wagon-ssh-common-1.0-beta-6.pom
[INFO] Unable to find resource 'org.apache.maven.wagon:wagon-ssh-common:pom:1.0-beta-6' in repository com.springsource.repository.bundles.external (http://repository.springsource.com/maven/bundles/external)
Downloading: http://repo1.maven.org/maven2/org/apache/maven/wagon/wagon-ssh-common/1.0-beta-6/wagon-ssh-common-1.0-beta-6.pom

Downloading: http://repository.apache.org/snapshots/org/codehaus/plexus/plexus-interactivity-api/1.0-alpha-6/plexus-interactivity-api-1.0-alpha-6.pom
[INFO] Unable to find resource 'org.codehaus.plexus:plexus-interactivity-api:pom:1.0-alpha-6' in repository apache.snapshots (https://repository.apache.org/content/repositories/snapshots/)
Downloading: http://repository.springsource.com/maven/bundles/external/org/codehaus/plexus/plexus-interactivity-api/1.0-alpha-6/plexus-interactivity-api-1.0-alpha-6.pom
[INFO] Unable to find resource 'org.codehaus.plexus:plexus-interactivity-api:pom:1.0-alpha-6' in repository com.springsource.repository.bundles.external (http://repository.springsource.com/maven/bundles/external)
Downloading: http://repo1.maven.org/maven2/org/codehaus/plexus/plexus-interactivity-api/1.0-alpha-6/plexus-interactivity-api-1.0-alpha-6.pom

Downloading: http://repository.apache.org/snapshots/org/codehaus/plexus/plexus-interactivity/1.0-alpha-6/plexus-interactivity-1.0-alpha-6.pom
[INFO] Unable to find resource 'org.codehaus.plexus:plexus-interactivity:pom:1.0-alpha-6' in repository apache.snapshots (https://repository.apache.org/content/repositories/snapshots/)
Downloading: http://repository.springsource.com/maven/bundles/external/org/codehaus/plexus/plexus-interactivity/1.0-alpha-6/plexus-interactivity-1.0-alpha-6.pom
[INFO] Unable to find resource 'org.codehaus.plexus:plexus-interactivity:pom:1.0-alpha-6' in repository com.springsource.repository.bundles.external (http://repository.springsource.com/maven/bundles/external)
Downloading: http://repo1.maven.org/maven2/org/codehaus/plexus/plexus-interactivity/1.0-alpha-6/plexus-interactivity-1.0-alpha-6.pom

Downloading: http://repository.apache.org/snapshots/org/codehaus/plexus/plexus-utils/1.4/plexus-utils-1.4.pom
[INFO] Unable to find resource 'org.codehaus.plexus:plexus-utils:pom:1.4' in repository apache.snapshots (https://repository.apache.org/content/repositories/snapshots/)
Downloading: http://repository.springsource.com/maven/bundles/external/org/codehaus/plexus/plexus-utils/1.4/plexus-utils-1.4.pom
[INFO] Unable to find resource 'org.codehaus.plexus:plexus-utils:pom:1.4' in repository com.springsource.repository.bundles.external (http://repository.springsource.com/maven/bundles/external)
Downloading: http://repo1.maven.org/maven2/org/codehaus/plexus/plexus-utils/1.4/plexus-utils-1.4.pom

Downloading: http://repository.apache.org/snapshots/org/codehaus/plexus/plexus/1.0.9/plexus-1.0.9.pom
[INFO] Unable to find resource 'org.codehaus.plexus:plexus:pom:1.0.9' in repository apache.snapshots (https://repository.apache.org/content/repositories/snapshots/)
Downloading: http://repository.springsource.com/maven/bundles/external/org/codehaus/plexus/plexus/1.0.9/plexus-1.0.9.pom
[INFO] Unable to find resource 'org.codehaus.plexus:plexus:pom:1.0.9' in repository com.springsource.repository.bundles.external (http://repository.springsource.com/maven/bundles/external)
Downloading: http://repo1.maven.org/maven2/org/codehaus/plexus/plexus/1.0.9/plexus-1.0.9.pom

Downloading: http://repository.apache.org/snapshots/org/apache/maven/maven-plugin-descriptor/2.2.1/maven-plugin-descriptor-2.2.1.pom
[INFO] Unable to find resource 'org.apache.maven:maven-plugin-descriptor:pom:2.2.1' in repository apache.snapshots (https://repository.apache.org/content/repositories/snapshots/)
Downloading: http://repository.springsource.com/maven/bundles/external/org/apache/maven/maven-plugin-descriptor/2.2.1/maven-plugin-descriptor-2.2.1.pom
[INFO] Unable to find resource 'org.apache.maven:maven-plugin-descriptor:pom:2.2.1' in repository com.springsource.repository.bundles.external (http://repository.springsource.com/maven/bundles/external)
Downloading: http://repo1.maven.org/maven2/org/apache/maven/maven-plugin-descriptor/2.2.1/maven-plugin-descriptor-2.2.1.pom

Downloading: http://repository.apache.org/snapshots/org/apache/maven/maven-monitor/2.2.1/maven-monitor-2.2.1.pom
[INFO] Unable to find resource 'org.apache.maven:maven-monitor:pom:2.2.1' in repository apache.snapshots (https://repository.apache.org/content/repositories/snapshots/)
Downloading: http://repository.springsource.com/maven/bundles/external/org/apache/maven/maven-monitor/2.2.1/maven-monitor-2.2.1.pom
[INFO] Unable to find resource 'org.apache.maven:maven-monitor:pom:2.2.1' in repository com.springsource.repository.bundles.external (http://repository.springsource.com/maven/bundles/external)
Downloading: http://repo1.maven.org/maven2/org/apache/maven/maven-monitor/2.2.1/maven-monitor-2.2.1.pom

Downloading: http://repository.apache.org/snapshots/org/apache/maven/wagon/wagon-ssh/1.0-beta-6/wagon-ssh-1.0-beta-6.pom
[INFO] Unable to find resource 'org.apache.maven.wagon:wagon-ssh:pom:1.0-beta-6' in repository apache.snapshots (https://repository.apache.org/content/repositories/snapshots/)
Downloading: http://repository.springsource.com/maven/bundles/external/org/apache/maven/wagon/wagon-ssh/1.0-beta-6/wagon-ssh-1.0-beta-6.pom
[INFO] Unable to find resource 'org.apache.maven.wagon:wagon-ssh:pom:1.0-beta-6' in repository com.springsource.repository.bundles.external (http://repository.springsource.com/maven/bundles/external)
Downloading: http://repo1.maven.org/maven2/org/apache/maven/wagon/wagon-ssh/1.0-beta-6/wagon-ssh-1.0-beta-6.pom

Downloading: http://repository.apache.org/snapshots/com/jcraft/jsch/0.1.38/jsch-0.1.38.pom
[INFO] Unable to find resource 'com.jcraft:jsch:pom:0.1.38' in repository apache.snapshots (https://repository.apache.org/content/repositories/snapshots/)
Downloading: http://repository.springsource.com/maven/bundles/external/com/jcraft/jsch/0.1.38/jsch-0.1.38.pom
[INFO] Unable to find resource 'com.jcraft:jsch:pom:0.1.38' in repository com.springsource.repository.bundles.external (http://repository.springsource.com/maven/bundles/external)
Downloading: http://repo1.maven.org/maven2/com/jcraft/jsch/0.1.38/jsch-0.1.38.pom

Downloading: http://repository.apache.org/snapshots/org/sonatype/plexus/plexus-sec-dispatcher/1.3/plexus-sec-dispatcher-1.3.pom
[INFO] Unable to find resource 'org.sonatype.plexus:plexus-sec-dispatcher:pom:1.3' in repository apache.snapshots (https://repository.apache.org/content/repositories/snapshots/)
Downloading: http://repository.springsource.com/maven/bundles/external/org/sonatype/plexus/plexus-sec-dispatcher/1.3/plexus-sec-dispatcher-1.3.pom
[INFO] Unable to find resource 'org.sonatype.plexus:plexus-sec-dispatcher:pom:1.3' in repository com.springsource.repository.bundles.external (http://repository.springsource.com/maven/bundles/external)
Downloading: http://repo1.maven.org/maven2/org/sonatype/plexus/plexus-sec-dispatcher/1.3/plexus-sec-dispatcher-1.3.pom

Downloading: http://repository.apache.org/snapshots/org/sonatype/spice/spice-parent/12/spice-parent-12.pom
[INFO] Unable to find resource 'org.sonatype.spice:spice-parent:pom:12' in repository apache.snapshots (https://repository.apache.org/content/repositories/snapshots/)
Downloading: http://repository.springsource.com/maven/bundles/external/org/sonatype/spice/spice-parent/12/spice-parent-12.pom
[INFO] Unable to find resource 'org.sonatype.spice:spice-parent:pom:12' in repository com.springsource.repository.bundles.external (http://repository.springsource.com/maven/bundles/external)
Downloading: http://repo1.maven.org/maven2/org/sonatype/spice/spice-parent/12/spice-parent-12.pom

Downloading: http://repository.apache.org/snapshots/org/sonatype/forge/forge-parent/4/forge-parent-4.pom
[INFO] Unable to find resource 'org.sonatype.forge:forge-parent:pom:4' in repository apache.snapshots (https://repository.apache.org/content/repositories/snapshots/)
Downloading: http://repository.springsource.com/maven/bundles/external/org/sonatype/forge/forge-parent/4/forge-parent-4.pom
[INFO] Unable to find resource 'org.sonatype.forge:forge-parent:pom:4' in repository com.springsource.repository.bundles.external (http://repository.springsource.com/maven/bundles/external)
Downloading: http://repo1.maven.org/maven2/org/sonatype/forge/forge-parent/4/forge-parent-4.pom

Downloading: http://repository.apache.org/snapshots/org/sonatype/plexus/plexus-cipher/1.4/plexus-cipher-1.4.pom
[INFO] Unable to find resource 'org.sonatype.plexus:plexus-cipher:pom:1.4' in repository apache.snapshots (https://repository.apache.org/content/repositories/snapshots/)
Downloading: http://repository.springsource.com/maven/bundles/external/org/sonatype/plexus/plexus-cipher/1.4/plexus-cipher-1.4.pom
[INFO] Unable to find resource 'org.sonatype.plexus:plexus-cipher:pom:1.4' in repository com.springsource.repository.bundles.external (http://repository.springsource.com/maven/bundles/external)
Downloading: http://repo1.maven.org/maven2/org/sonatype/plexus/plexus-cipher/1.4/plexus-cipher-1.4.pom

Downloading: http://repository.apache.org/snapshots/org/codehaus/plexus/plexus-utils/1.4.9/plexus-utils-1.4.9.pom
[INFO] Unable to find resource 'org.codehaus.plexus:plexus-utils:pom:1.4.9' in repository apache.snapshots (https://repository.apache.org/content/repositories/snapshots/)
Downloading: http://repository.springsource.com/maven/bundles/external/org/codehaus/plexus/plexus-utils/1.4.9/plexus-utils-1.4.9.pom
[INFO] Unable to find resource 'org.codehaus.plexus:plexus-utils:pom:1.4.9' in repository com.springsource.repository.bundles.external (http://repository.springsource.com/maven/bundles/external)
Downloading: http://repo1.maven.org/maven2/org/codehaus/plexus/plexus-utils/1.4.9/plexus-utils-1.4.9.pom

Downloading: http://repository.apache.org/snapshots/org/codehaus/plexus/plexus-archiver/1.1/plexus-archiver-1.1.pom
[INFO] Unable to find resource 'org.codehaus.plexus:plexus-archiver:pom:1.1' in repository apache.snapshots (https://repository.apache.org/content/repositories/snapshots/)
Downloading: http://repo1.maven.org/maven2/org/codehaus/plexus/plexus-archiver/1.1/plexus-archiver-1.1.pom

Downloading: http://repository.apache.org/snapshots/org/apache/maven/shared/maven-shared-io/1.1/maven-shared-io-1.1.pom
[INFO] Unable to find resource 'org.apache.maven.shared:maven-shared-io:pom:1.1' in repository apache.snapshots (https://repository.apache.org/content/repositories/snapshots/)
Downloading: http://repo1.maven.org/maven2/org/apache/maven/shared/maven-shared-io/1.1/maven-shared-io-1.1.pom

Downloading: http://repository.apache.org/snapshots/org/apache/maven/shared/maven-filtering/1.0/maven-filtering-1.0.pom
[INFO] Unable to find resource 'org.apache.maven.shared:maven-filtering:pom:1.0' in repository apache.snapshots (https://repository.apache.org/content/repositories/snapshots/)
Downloading: http://repo1.maven.org/maven2/org/apache/maven/shared/maven-filtering/1.0/maven-filtering-1.0.pom

Downloading: http://repository.apache.org/snapshots/org/apache/maven/shared/maven-repository-builder/1.0-alpha-2/maven-repository-builder-1.0-alpha-2.pom
[INFO] Unable to find resource 'org.apache.maven.shared:maven-repository-builder:pom:1.0-alpha-2' in repository apache.snapshots (https://repository.apache.org/content/repositories/snapshots/)
Downloading: http://repo1.maven.org/maven2/org/apache/maven/shared/maven-repository-builder/1.0-alpha-2/maven-repository-builder-1.0-alpha-2.pom

Downloading: http://repository.apache.org/snapshots/org/apache/maven/shared/maven-common-artifact-filters/1.0-alpha-1/maven-common-artifact-filters-1.0-alpha-1.pom
[INFO] Unable to find resource 'org.apache.maven.shared:maven-common-artifact-filters:pom:1.0-alpha-1' in repository apache.snapshots (https://repository.apache.org/content/repositories/snapshots/)
Downloading: http://repository.springsource.com/maven/bundles/external/org/apache/maven/shared/maven-common-artifact-filters/1.0-alpha-1/maven-common-artifact-filters-1.0-alpha-1.pom
[INFO] Unable to find resource 'org.apache.maven.shared:maven-common-artifact-filters:pom:1.0-alpha-1' in repository com.springsource.repository.bundles.external (http://repository.springsource.com/maven/bundles/external)
Downloading: http://repo1.maven.org/maven2/org/apache/maven/shared/maven-common-artifact-filters/1.0-alpha-1/maven-common-artifact-filters-1.0-alpha-1.pom

Downloading: http://repository.apache.org/snapshots/org/apache/maven/shared/maven-shared-components/6/maven-shared-components-6.pom
[INFO] Unable to find resource 'org.apache.maven.shared:maven-shared-components:pom:6' in repository apache.snapshots (https://repository.apache.org/content/repositories/snapshots/)
Downloading: http://repository.springsource.com/maven/bundles/external/org/apache/maven/shared/maven-shared-components/6/maven-shared-components-6.pom
[INFO] Unable to find resource 'org.apache.maven.shared:maven-shared-components:pom:6' in repository com.springsource.repository.bundles.external (http://repository.springsource.com/maven/bundles/external)
Downloading: http://repo1.maven.org/maven2/org/apache/maven/shared/maven-shared-components/6/maven-shared-components-6.pom

Downloading: http://repository.apache.org/snapshots/org/codehaus/plexus/plexus-archiver/1.1/plexus-archiver-1.1.jar
Downloading: http://repository.apache.org/snapshots/org/apache/maven/shared/maven-shared-io/1.1/maven-shared-io-1.1.jar
[INFO] Unable to find resource 'org.codehaus.plexus:plexus-archiver:jar:1.1' in repository apache.snapshots (https://repository.apache.org/content/repositories/snapshots/)
[INFO] Unable to find resource 'org.apache.maven.shared:maven-shared-io:jar:1.1' in repository apache.snapshots (https://repository.apache.org/content/repositories/snapshots/)
Downloading: http://repo1.maven.org/maven2/org/codehaus/plexus/plexus-archiver/1.1/plexus-archiver-1.1.jar
Downloading: http://repo1.maven.org/maven2/org/apache/maven/shared/maven-shared-io/1.1/maven-shared-io-1.1.jar


Downloading: http://repository.apache.org/snapshots/org/apache/maven/shared/maven-filtering/1.0/maven-filtering-1.0.jar
[INFO] Unable to find resource 'org.apache.maven.shared:maven-filtering:jar:1.0' in repository apache.snapshots (https://repository.apache.org/content/repositories/snapshots/)
Downloading: http://repo1.maven.org/maven2/org/apache/maven/shared/maven-filtering/1.0/maven-filtering-1.0.jar

Downloading: http://repository.apache.org/snapshots/org/apache/maven/shared/maven-repository-builder/1.0-alpha-2/maven-repository-builder-1.0-alpha-2.jar
[INFO] Unable to find resource 'org.apache.maven.shared:maven-repository-builder:jar:1.0-alpha-2' in repository apache.snapshots (https://repository.apache.org/content/repositories/snapshots/)
Downloading: http://repo1.maven.org/maven2/org/apache/maven/shared/maven-repository-builder/1.0-alpha-2/maven-repository-builder-1.0-alpha-2.jar

[INFO] [assembly:attached {execution: unix-bin}]
[INFO] Reading assembly descriptor: src/main/descriptors/unix-bin.xml
[WARNING] Cannot include project artifact: org.apache.activemq:apache-activemq:pom:5.6-SNAPSHOT; it doesn't have an associated file or directory.
[WARNING] Cannot include project artifact: org.apache.activemq:apache-activemq:pom:5.6-SNAPSHOT; it doesn't have an associated file or directory.
[WARNING] Cannot include project artifact: org.apache.activemq:apache-activemq:pom:5.6-SNAPSHOT; it doesn't have an associated file or directory.
[WARNING] Cannot include project artifact: org.apache.activemq:apache-activemq:pom:5.6-SNAPSHOT; it doesn't have an associated file or directory.
[WARNING] Cannot include project artifact: org.apache.activemq:apache-activemq:pom:5.6-SNAPSHOT; it doesn't have an associated file or directory.
[WARNING] The following patterns were never triggered in this artifact inclusion filter:
o  'org.fusesource.commonman:commons-management'

[INFO] apache-activemq-5.6-SNAPSHOT/webapps/admin/WEB-INF already added, skipping
[INFO] Building tar : <https://builds.apache.org/job/ActiveMQ/ws/assembly/target/apache-activemq-5.6-SNAPSHOT-bin.tar.gz>
[INFO] apache-activemq-5.6-SNAPSHOT/webapps/admin/WEB-INF already added, skipping
[INFO] [assembly:attached {execution: windows-bin}]
[INFO] Reading assembly descriptor: src/main/descriptors/windows-bin.xml
[WARNING] Cannot include project artifact: org.apache.activemq:apache-activemq:pom:5.6-SNAPSHOT; it doesn't have an associated file or directory.
[WARNING] Cannot include project artifact: org.apache.activemq:apache-activemq:pom:5.6-SNAPSHOT; it doesn't have an associated file or directory.
[WARNING] Cannot include project artifact: org.apache.activemq:apache-activemq:pom:5.6-SNAPSHOT; it doesn't have an associated file or directory.
[WARNING] Cannot include project artifact: org.apache.activemq:apache-activemq:pom:5.6-SNAPSHOT; it doesn't have an associated file or directory.
[WARNING] Cannot include project artifact: org.apache.activemq:apache-activemq:pom:5.6-SNAPSHOT; it doesn't have an associated file or directory.
[WARNING] The following patterns were never triggered in this artifact inclusion filter:
o  'org.fusesource.commonman:commons-management'

[INFO] apache-activemq-5.6-SNAPSHOT/webapps/admin/WEB-INF already added, skipping
[INFO] Building zip: <https://builds.apache.org/job/ActiveMQ/ws/assembly/target/apache-activemq-5.6-SNAPSHOT-bin.zip>
[INFO] apache-activemq-5.6-SNAPSHOT/webapps/admin/WEB-INF already added, skipping
[INFO] [ianal:verify-legal-files {execution: default}]
[INFO] Checking legal files in: apache-activemq-5.6-SNAPSHOT-bin.zip
[INFO] [install:install {execution: default-install}]
[INFO] Installing <https://builds.apache.org/job/ActiveMQ/ws/assembly/pom.xml> to <https://builds.apache.org/job/ActiveMQ/ws/.repository/org/apache/activemq/apache-activemq/5.6-SNAPSHOT/apache-activemq-5.6-SNAPSHOT.pom>
[INFO] Installing <https://builds.apache.org/job/ActiveMQ/ws/assembly/target/apache-activemq-5.6-SNAPSHOT-bin.tar.gz> to <https://builds.apache.org/job/ActiveMQ/ws/.repository/org/apache/activemq/apache-activemq/5.6-SNAPSHOT/apache-activemq-5.6-SNAPSHOT-bin.tar.gz>
[INFO] Installing <https://builds.apache.org/job/ActiveMQ/ws/assembly/target/apache-activemq-5.6-SNAPSHOT-bin.zip> to <https://builds.apache.org/job/ActiveMQ/ws/.repository/org/apache/activemq/apache-activemq/5.6-SNAPSHOT/apache-activemq-5.6-SNAPSHOT-bin.zip>
[INFO] Preparing source:jar
[JENKINS] Archiving <https://builds.apache.org/job/ActiveMQ/ws/assembly/pom.xml> to /home/hudson/hudson/jobs/ActiveMQ/modules/org.apache.activemq$apache-activemq/builds/2012-03-09_00-08-17/archive/org.apache.activemq/apache-activemq/5.6-SNAPSHOT/apache-activemq-5.6-SNAPSHOT.pom
[JENKINS] Archiving <https://builds.apache.org/job/ActiveMQ/ws/assembly/target/apache-activemq-5.6-SNAPSHOT-bin.tar.gz> to /home/hudson/hudson/jobs/ActiveMQ/modules/org.apache.activemq$apache-activemq/builds/2012-03-09_00-08-17/archive/org.apache.activemq/apache-activemq/5.6-SNAPSHOT/apache-activemq-5.6-SNAPSHOT-bin.tar.gz
[JENKINS] Archiving <https://builds.apache.org/job/ActiveMQ/ws/assembly/target/apache-activemq-5.6-SNAPSHOT-bin.zip> to /home/hudson/hudson/jobs/ActiveMQ/modules/org.apache.activemq$apache-activemq/builds/2012-03-09_00-08-17/archive/org.apache.activemq/apache-activemq/5.6-SNAPSHOT/apache-activemq-5.6-SNAPSHOT-bin.zip
[INFO] [enforcer:enforce {execution: default}]
[INFO] [bundle:cleanVersions {execution: cleanVersions}]
[INFO] [source:jar {execution: default-cli}]
[INFO]
[INFO]
[INFO] ------------------------------------------------------------------------
[INFO] Reactor Summary:
[INFO] ------------------------------------------------------------------------
[INFO] ActiveMQ .............................................. SUCCESS [2:43.629s]
[INFO] ActiveMQ :: KahaDB .................................... SUCCESS [2:07.384s]
[INFO] ActiveMQ :: JAAS ...................................... SUCCESS [1:14.042s]
[INFO] Openwire Generator .................................... SUCCESS [18.290s]
[INFO] ActiveMQ :: jmdns 1.0 ................................. SUCCESS [3.725s]
[INFO] ActiveMQ :: Core ...................................... SUCCESS [6:45:44.624s]
[INFO] ActiveMQ :: RA ........................................ SUCCESS [1:34.636s]
[INFO] ActiveMQ :: Pool ...................................... SUCCESS [41.999s]
[INFO] ActiveMQ :: Spring .................................... SUCCESS [1:26.317s]
[INFO] ActiveMQ :: Camel ..................................... SUCCESS [16:38.155s]
[INFO] ActiveMQ :: Console ................................... SUCCESS [2:09.011s]
[INFO] ActiveMQ :: Optional .................................. SUCCESS [5:07.013s]
[INFO] ActiveMQ :: Jar Bundle ................................ SUCCESS [48.902s]
[INFO] ActiveMQ :: File Server ............................... SUCCESS [19.790s]
[INFO] ActiveMQ :: Blueprint ................................. SUCCESS [19.294s]
[INFO] ActiveMQ :: Apache Karaf .............................. SUCCESS [2:57.355s]
[INFO] ActiveMQ :: RAR ....................................... SUCCESS [55.952s]
[INFO] ActiveMQ :: Run Jar ................................... SUCCESS [2.043s]
[INFO] ActiveMQ Tooling ...................................... SUCCESS [1.537s]
[INFO] ActiveMQ :: Memory Usage Test Plugin .................. SUCCESS [27.199s]
[INFO] ActiveMQ :: Performance Test Plugin ................... SUCCESS [7.984s]
[INFO] ActiveMQ :: StartUp Plugin ............................ SUCCESS [8.823s]
[INFO] ActiveMQ :: Web ....................................... SUCCESS [10.785s]
[INFO] ActiveMQ :: Web Demo .................................. SUCCESS [2:21.620s]
[INFO] ActiveMQ :: XMPP ...................................... SUCCESS [43.622s]
[INFO] ActiveMQ :: Web Console ............................... SUCCESS [1:44.923s]
[INFO] ActiveMQ :: Assembly .................................. SUCCESS [5:59.934s]
[INFO] ------------------------------------------------------------------------
[INFO] ------------------------------------------------------------------------
[INFO] BUILD SUCCESSFUL
[INFO] ------------------------------------------------------------------------
[INFO] Total time: 459 minutes 9 seconds
[INFO] Finished at: Fri Mar 09 07:47:46 UTC 2012
[INFO] Final Memory: 144M/1729M
[INFO] ------------------------------------------------------------------------
channel stopped
[locks-and-latches] Releasing all the locks
[locks-and-latches] All the locks released
Maven RedeployPublished use remote ubuntu2 maven settings from : /home/hudson/.m2/settings.xml
[INFO] Deployment in https://repository.apache.org/content/repositories/snapshots (id=,uniqueVersion=false)
Deploying the main artifact activemq-all-5.6-SNAPSHOT.jar
ERROR: Error deploying artifact: Failed to transfer file: https://repository.apache.org/content/repositories/snapshots/org/apache/activemq/activemq-all/5.6-SNAPSHOT/activemq-all-5.6-SNAPSHOT.jar. Return code is: 401, ReasonPhrase:Unauthorized.
org.apache.maven.artifact.deployer.ArtifactDeploymentException: Error deploying artifact: Failed to transfer file: https://repository.apache.org/content/repositories/snapshots/org/apache/activemq/activemq-all/5.6-SNAPSHOT/activemq-all-5.6-SNAPSHOT.jar. Return code is: 401, ReasonPhrase:Unauthorized.
        at hudson.maven.artifact.deployer.DefaultArtifactDeployer.deploy(DefaultArtifactDeployer.java:175)
        at hudson.maven.reporters.MavenArtifactRecord.deploy(MavenArtifactRecord.java:182)
        at hudson.maven.RedeployPublisher.perform(RedeployPublisher.java:176)
        at hudson.tasks.BuildStepMonitor$1.perform(BuildStepMonitor.java:19)
        at hudson.model.AbstractBuild$AbstractRunner.perform(AbstractBuild.java:703)
        at hudson.model.AbstractBuild$AbstractRunner.performAllBuildSteps(AbstractBuild.java:678)
        at hudson.maven.MavenModuleSetBuild$RunnerImpl.post2(MavenModuleSetBuild.java:998)
        at hudson.model.AbstractBuild$AbstractRunner.post(AbstractBuild.java:625)
        at hudson.model.Run.run(Run.java:1433)
        at hudson.maven.MavenModuleSetBuild.run(MavenModuleSetBuild.java:481)
        at hudson.model.ResourceController.execute(ResourceController.java:88)
        at hudson.model.Executor.run(Executor.java:238)
Caused by: org.apache.maven.wagon.TransferFailedException: Failed to transfer file: https://repository.apache.org/content/repositories/snapshots/org/apache/activemq/activemq-all/5.6-SNAPSHOT/activemq-all-5.6-SNAPSHOT.jar. Return code is: 401, ReasonPhrase:Unauthorized.
        at org.apache.maven.wagon.shared.http4.AbstractHttpClientWagon.put(AbstractHttpClientWagon.java:562)
        at org.apache.maven.wagon.shared.http4.AbstractHttpClientWagon.put(AbstractHttpClientWagon.java:471)
        at org.apache.maven.wagon.shared.http4.AbstractHttpClientWagon.put(AbstractHttpClientWagon.java:451)
        at org.apache.maven.repository.legacy.DefaultWagonManager.putRemoteFile(DefaultWagonManager.java:543)
        at org.apache.maven.repository.legacy.DefaultWagonManager.putArtifact(DefaultWagonManager.java:494)
        at hudson.maven.artifact.deployer.DefaultArtifactDeployer.deploy(DefaultArtifactDeployer.java:160)
        ... 11 more
[INFO] Deployment failed after 1.4 sec
Build step 'Deploy artifacts to Maven repository' changed build result to FAILURE

Reply | Threaded
Open this post in threaded view
|  
Report Content as Inappropriate

Build failed in Jenkins: ActiveMQ #902

Apache Jenkins Server-2
See <https://builds.apache.org/job/ActiveMQ/902/changes>

Changes:

[gtully] https://issues.apache.org/jira/browse/AMQ-2570 - remove wildcards as they are ignored by bnd when the classes are not referenced and replace with explicit imports for the dependencies that are needed. In case of servlet, wildcard is ok as it is referenced but the spo bits of the logging package are needed for the appenders

------------------------------------------
[...truncated 17245 lines...]
[INFO] Unable to find resource 'commons-cli:commons-cli:pom:1.2' in repository apache.snapshots (https://repository.apache.org/content/repositories/snapshots/)
Downloading: http://repository.springsource.com/maven/bundles/external/commons-cli/commons-cli/1.2/commons-cli-1.2.pom
[INFO] Unable to find resource 'commons-cli:commons-cli:pom:1.2' in repository com.springsource.repository.bundles.external (http://repository.springsource.com/maven/bundles/external)
Downloading: http://repo1.maven.org/maven2/commons-cli/commons-cli/1.2/commons-cli-1.2.pom

Downloading: http://repository.apache.org/snapshots/org/apache/maven/wagon/wagon-ssh-external/1.0-beta-6/wagon-ssh-external-1.0-beta-6.pom
[INFO] Unable to find resource 'org.apache.maven.wagon:wagon-ssh-external:pom:1.0-beta-6' in repository apache.snapshots (https://repository.apache.org/content/repositories/snapshots/)
Downloading: http://repository.springsource.com/maven/bundles/external/org/apache/maven/wagon/wagon-ssh-external/1.0-beta-6/wagon-ssh-external-1.0-beta-6.pom
[INFO] Unable to find resource 'org.apache.maven.wagon:wagon-ssh-external:pom:1.0-beta-6' in repository com.springsource.repository.bundles.external (http://repository.springsource.com/maven/bundles/external)
Downloading: http://repo1.maven.org/maven2/org/apache/maven/wagon/wagon-ssh-external/1.0-beta-6/wagon-ssh-external-1.0-beta-6.pom

Downloading: http://repository.apache.org/snapshots/org/apache/maven/wagon/wagon-ssh-common/1.0-beta-6/wagon-ssh-common-1.0-beta-6.pom
[INFO] Unable to find resource 'org.apache.maven.wagon:wagon-ssh-common:pom:1.0-beta-6' in repository apache.snapshots (https://repository.apache.org/content/repositories/snapshots/)
Downloading: http://repository.springsource.com/maven/bundles/external/org/apache/maven/wagon/wagon-ssh-common/1.0-beta-6/wagon-ssh-common-1.0-beta-6.pom
[INFO] Unable to find resource 'org.apache.maven.wagon:wagon-ssh-common:pom:1.0-beta-6' in repository com.springsource.repository.bundles.external (http://repository.springsource.com/maven/bundles/external)
Downloading: http://repo1.maven.org/maven2/org/apache/maven/wagon/wagon-ssh-common/1.0-beta-6/wagon-ssh-common-1.0-beta-6.pom

Downloading: http://repository.apache.org/snapshots/org/codehaus/plexus/plexus-interactivity-api/1.0-alpha-6/plexus-interactivity-api-1.0-alpha-6.pom
[INFO] Unable to find resource 'org.codehaus.plexus:plexus-interactivity-api:pom:1.0-alpha-6' in repository apache.snapshots (https://repository.apache.org/content/repositories/snapshots/)
Downloading: http://repository.springsource.com/maven/bundles/external/org/codehaus/plexus/plexus-interactivity-api/1.0-alpha-6/plexus-interactivity-api-1.0-alpha-6.pom
[INFO] Unable to find resource 'org.codehaus.plexus:plexus-interactivity-api:pom:1.0-alpha-6' in repository com.springsource.repository.bundles.external (http://repository.springsource.com/maven/bundles/external)
Downloading: http://repo1.maven.org/maven2/org/codehaus/plexus/plexus-interactivity-api/1.0-alpha-6/plexus-interactivity-api-1.0-alpha-6.pom

Downloading: http://repository.apache.org/snapshots/org/codehaus/plexus/plexus-interactivity/1.0-alpha-6/plexus-interactivity-1.0-alpha-6.pom
[INFO] Unable to find resource 'org.codehaus.plexus:plexus-interactivity:pom:1.0-alpha-6' in repository apache.snapshots (https://repository.apache.org/content/repositories/snapshots/)
Downloading: http://repository.springsource.com/maven/bundles/external/org/codehaus/plexus/plexus-interactivity/1.0-alpha-6/plexus-interactivity-1.0-alpha-6.pom
[INFO] Unable to find resource 'org.codehaus.plexus:plexus-interactivity:pom:1.0-alpha-6' in repository com.springsource.repository.bundles.external (http://repository.springsource.com/maven/bundles/external)
Downloading: http://repo1.maven.org/maven2/org/codehaus/plexus/plexus-interactivity/1.0-alpha-6/plexus-interactivity-1.0-alpha-6.pom

Downloading: http://repository.apache.org/snapshots/org/codehaus/plexus/plexus-utils/1.4/plexus-utils-1.4.pom
[INFO] Unable to find resource 'org.codehaus.plexus:plexus-utils:pom:1.4' in repository apache.snapshots (https://repository.apache.org/content/repositories/snapshots/)
Downloading: http://repository.springsource.com/maven/bundles/external/org/codehaus/plexus/plexus-utils/1.4/plexus-utils-1.4.pom
[INFO] Unable to find resource 'org.codehaus.plexus:plexus-utils:pom:1.4' in repository com.springsource.repository.bundles.external (http://repository.springsource.com/maven/bundles/external)
Downloading: http://repo1.maven.org/maven2/org/codehaus/plexus/plexus-utils/1.4/plexus-utils-1.4.pom

Downloading: http://repository.apache.org/snapshots/org/codehaus/plexus/plexus/1.0.9/plexus-1.0.9.pom
[INFO] Unable to find resource 'org.codehaus.plexus:plexus:pom:1.0.9' in repository apache.snapshots (https://repository.apache.org/content/repositories/snapshots/)
Downloading: http://repository.springsource.com/maven/bundles/external/org/codehaus/plexus/plexus/1.0.9/plexus-1.0.9.pom
[INFO] Unable to find resource 'org.codehaus.plexus:plexus:pom:1.0.9' in repository com.springsource.repository.bundles.external (http://repository.springsource.com/maven/bundles/external)
Downloading: http://repo1.maven.org/maven2/org/codehaus/plexus/plexus/1.0.9/plexus-1.0.9.pom

Downloading: http://repository.apache.org/snapshots/org/apache/maven/maven-plugin-descriptor/2.2.1/maven-plugin-descriptor-2.2.1.pom
[INFO] Unable to find resource 'org.apache.maven:maven-plugin-descriptor:pom:2.2.1' in repository apache.snapshots (https://repository.apache.org/content/repositories/snapshots/)
Downloading: http://repository.springsource.com/maven/bundles/external/org/apache/maven/maven-plugin-descriptor/2.2.1/maven-plugin-descriptor-2.2.1.pom
[INFO] Unable to find resource 'org.apache.maven:maven-plugin-descriptor:pom:2.2.1' in repository com.springsource.repository.bundles.external (http://repository.springsource.com/maven/bundles/external)
Downloading: http://repo1.maven.org/maven2/org/apache/maven/maven-plugin-descriptor/2.2.1/maven-plugin-descriptor-2.2.1.pom

Downloading: http://repository.apache.org/snapshots/org/apache/maven/maven-monitor/2.2.1/maven-monitor-2.2.1.pom
[INFO] Unable to find resource 'org.apache.maven:maven-monitor:pom:2.2.1' in repository apache.snapshots (https://repository.apache.org/content/repositories/snapshots/)
Downloading: http://repository.springsource.com/maven/bundles/external/org/apache/maven/maven-monitor/2.2.1/maven-monitor-2.2.1.pom
[INFO] Unable to find resource 'org.apache.maven:maven-monitor:pom:2.2.1' in repository com.springsource.repository.bundles.external (http://repository.springsource.com/maven/bundles/external)
Downloading: http://repo1.maven.org/maven2/org/apache/maven/maven-monitor/2.2.1/maven-monitor-2.2.1.pom

Downloading: http://repository.apache.org/snapshots/org/apache/maven/wagon/wagon-ssh/1.0-beta-6/wagon-ssh-1.0-beta-6.pom
[INFO] Unable to find resource 'org.apache.maven.wagon:wagon-ssh:pom:1.0-beta-6' in repository apache.snapshots (https://repository.apache.org/content/repositories/snapshots/)
Downloading: http://repository.springsource.com/maven/bundles/external/org/apache/maven/wagon/wagon-ssh/1.0-beta-6/wagon-ssh-1.0-beta-6.pom
[INFO] Unable to find resource 'org.apache.maven.wagon:wagon-ssh:pom:1.0-beta-6' in repository com.springsource.repository.bundles.external (http://repository.springsource.com/maven/bundles/external)
Downloading: http://repo1.maven.org/maven2/org/apache/maven/wagon/wagon-ssh/1.0-beta-6/wagon-ssh-1.0-beta-6.pom

Downloading: http://repository.apache.org/snapshots/com/jcraft/jsch/0.1.38/jsch-0.1.38.pom
[INFO] Unable to find resource 'com.jcraft:jsch:pom:0.1.38' in repository apache.snapshots (https://repository.apache.org/content/repositories/snapshots/)
Downloading: http://repository.springsource.com/maven/bundles/external/com/jcraft/jsch/0.1.38/jsch-0.1.38.pom
[INFO] Unable to find resource 'com.jcraft:jsch:pom:0.1.38' in repository com.springsource.repository.bundles.external (http://repository.springsource.com/maven/bundles/external)
Downloading: http://repo1.maven.org/maven2/com/jcraft/jsch/0.1.38/jsch-0.1.38.pom

Downloading: http://repository.apache.org/snapshots/org/sonatype/plexus/plexus-sec-dispatcher/1.3/plexus-sec-dispatcher-1.3.pom
[INFO] Unable to find resource 'org.sonatype.plexus:plexus-sec-dispatcher:pom:1.3' in repository apache.snapshots (https://repository.apache.org/content/repositories/snapshots/)
Downloading: http://repository.springsource.com/maven/bundles/external/org/sonatype/plexus/plexus-sec-dispatcher/1.3/plexus-sec-dispatcher-1.3.pom
[INFO] Unable to find resource 'org.sonatype.plexus:plexus-sec-dispatcher:pom:1.3' in repository com.springsource.repository.bundles.external (http://repository.springsource.com/maven/bundles/external)
Downloading: http://repo1.maven.org/maven2/org/sonatype/plexus/plexus-sec-dispatcher/1.3/plexus-sec-dispatcher-1.3.pom

Downloading: http://repository.apache.org/snapshots/org/sonatype/spice/spice-parent/12/spice-parent-12.pom
[INFO] Unable to find resource 'org.sonatype.spice:spice-parent:pom:12' in repository apache.snapshots (https://repository.apache.org/content/repositories/snapshots/)
Downloading: http://repository.springsource.com/maven/bundles/external/org/sonatype/spice/spice-parent/12/spice-parent-12.pom
[INFO] Unable to find resource 'org.sonatype.spice:spice-parent:pom:12' in repository com.springsource.repository.bundles.external (http://repository.springsource.com/maven/bundles/external)
Downloading: http://repo1.maven.org/maven2/org/sonatype/spice/spice-parent/12/spice-parent-12.pom

Downloading: http://repository.apache.org/snapshots/org/sonatype/forge/forge-parent/4/forge-parent-4.pom
[INFO] Unable to find resource 'org.sonatype.forge:forge-parent:pom:4' in repository apache.snapshots (https://repository.apache.org/content/repositories/snapshots/)
Downloading: http://repository.springsource.com/maven/bundles/external/org/sonatype/forge/forge-parent/4/forge-parent-4.pom
[INFO] Unable to find resource 'org.sonatype.forge:forge-parent:pom:4' in repository com.springsource.repository.bundles.external (http://repository.springsource.com/maven/bundles/external)
Downloading: http://repo1.maven.org/maven2/org/sonatype/forge/forge-parent/4/forge-parent-4.pom

Downloading: http://repository.apache.org/snapshots/org/sonatype/plexus/plexus-cipher/1.4/plexus-cipher-1.4.pom
[INFO] Unable to find resource 'org.sonatype.plexus:plexus-cipher:pom:1.4' in repository apache.snapshots (https://repository.apache.org/content/repositories/snapshots/)
Downloading: http://repository.springsource.com/maven/bundles/external/org/sonatype/plexus/plexus-cipher/1.4/plexus-cipher-1.4.pom
[INFO] Unable to find resource 'org.sonatype.plexus:plexus-cipher:pom:1.4' in repository com.springsource.repository.bundles.external (http://repository.springsource.com/maven/bundles/external)
Downloading: http://repo1.maven.org/maven2/org/sonatype/plexus/plexus-cipher/1.4/plexus-cipher-1.4.pom

Downloading: http://repository.apache.org/snapshots/org/codehaus/plexus/plexus-utils/1.4.9/plexus-utils-1.4.9.pom
[INFO] Unable to find resource 'org.codehaus.plexus:plexus-utils:pom:1.4.9' in repository apache.snapshots (https://repository.apache.org/content/repositories/snapshots/)
Downloading: http://repository.springsource.com/maven/bundles/external/org/codehaus/plexus/plexus-utils/1.4.9/plexus-utils-1.4.9.pom
[INFO] Unable to find resource 'org.codehaus.plexus:plexus-utils:pom:1.4.9' in repository com.springsource.repository.bundles.external (http://repository.springsource.com/maven/bundles/external)
Downloading: http://repo1.maven.org/maven2/org/codehaus/plexus/plexus-utils/1.4.9/plexus-utils-1.4.9.pom

Downloading: http://repository.apache.org/snapshots/org/codehaus/plexus/plexus-archiver/1.1/plexus-archiver-1.1.pom
[INFO] Unable to find resource 'org.codehaus.plexus:plexus-archiver:pom:1.1' in repository apache.snapshots (https://repository.apache.org/content/repositories/snapshots/)
Downloading: http://repo1.maven.org/maven2/org/codehaus/plexus/plexus-archiver/1.1/plexus-archiver-1.1.pom

Downloading: http://repository.apache.org/snapshots/org/apache/maven/shared/maven-shared-io/1.1/maven-shared-io-1.1.pom
[INFO] Unable to find resource 'org.apache.maven.shared:maven-shared-io:pom:1.1' in repository apache.snapshots (https://repository.apache.org/content/repositories/snapshots/)
Downloading: http://repo1.maven.org/maven2/org/apache/maven/shared/maven-shared-io/1.1/maven-shared-io-1.1.pom

Downloading: http://repository.apache.org/snapshots/org/apache/maven/shared/maven-filtering/1.0/maven-filtering-1.0.pom
[INFO] Unable to find resource 'org.apache.maven.shared:maven-filtering:pom:1.0' in repository apache.snapshots (https://repository.apache.org/content/repositories/snapshots/)
Downloading: http://repo1.maven.org/maven2/org/apache/maven/shared/maven-filtering/1.0/maven-filtering-1.0.pom

Downloading: http://repository.apache.org/snapshots/org/apache/maven/shared/maven-repository-builder/1.0-alpha-2/maven-repository-builder-1.0-alpha-2.pom
[INFO] Unable to find resource 'org.apache.maven.shared:maven-repository-builder:pom:1.0-alpha-2' in repository apache.snapshots (https://repository.apache.org/content/repositories/snapshots/)
Downloading: http://repo1.maven.org/maven2/org/apache/maven/shared/maven-repository-builder/1.0-alpha-2/maven-repository-builder-1.0-alpha-2.pom

Downloading: http://repository.apache.org/snapshots/org/apache/maven/shared/maven-common-artifact-filters/1.0-alpha-1/maven-common-artifact-filters-1.0-alpha-1.pom
[INFO] Unable to find resource 'org.apache.maven.shared:maven-common-artifact-filters:pom:1.0-alpha-1' in repository apache.snapshots (https://repository.apache.org/content/repositories/snapshots/)
Downloading: http://repository.springsource.com/maven/bundles/external/org/apache/maven/shared/maven-common-artifact-filters/1.0-alpha-1/maven-common-artifact-filters-1.0-alpha-1.pom
[INFO] Unable to find resource 'org.apache.maven.shared:maven-common-artifact-filters:pom:1.0-alpha-1' in repository com.springsource.repository.bundles.external (http://repository.springsource.com/maven/bundles/external)
Downloading: http://repo1.maven.org/maven2/org/apache/maven/shared/maven-common-artifact-filters/1.0-alpha-1/maven-common-artifact-filters-1.0-alpha-1.pom

Downloading: http://repository.apache.org/snapshots/org/apache/maven/shared/maven-shared-components/6/maven-shared-components-6.pom
[INFO] Unable to find resource 'org.apache.maven.shared:maven-shared-components:pom:6' in repository apache.snapshots (https://repository.apache.org/content/repositories/snapshots/)
Downloading: http://repository.springsource.com/maven/bundles/external/org/apache/maven/shared/maven-shared-components/6/maven-shared-components-6.pom
[INFO] Unable to find resource 'org.apache.maven.shared:maven-shared-components:pom:6' in repository com.springsource.repository.bundles.external (http://repository.springsource.com/maven/bundles/external)
Downloading: http://repo1.maven.org/maven2/org/apache/maven/shared/maven-shared-components/6/maven-shared-components-6.pom

Downloading: http://repository.apache.org/snapshots/org/codehaus/plexus/plexus-archiver/1.1/plexus-archiver-1.1.jar
Downloading: http://repository.apache.org/snapshots/org/apache/maven/shared/maven-shared-io/1.1/maven-shared-io-1.1.jar
[INFO] Unable to find resource 'org.apache.maven.shared:maven-shared-io:jar:1.1' in repository apache.snapshots (https://repository.apache.org/content/repositories/snapshots/)
Downloading: http://repo1.maven.org/maven2/org/apache/maven/shared/maven-shared-io/1.1/maven-shared-io-1.1.jar
[INFO] Unable to find resource 'org.codehaus.plexus:plexus-archiver:jar:1.1' in repository apache.snapshots (https://repository.apache.org/content/repositories/snapshots/)
Downloading: http://repo1.maven.org/maven2/org/codehaus/plexus/plexus-archiver/1.1/plexus-archiver-1.1.jar

Downloading: http://repository.apache.org/snapshots/org/apache/maven/shared/maven-filtering/1.0/maven-filtering-1.0.jar
[INFO] Unable to find resource 'org.apache.maven.shared:maven-filtering:jar:1.0' in repository apache.snapshots (https://repository.apache.org/content/repositories/snapshots/)
Downloading: http://repo1.maven.org/maven2/org/apache/maven/shared/maven-filtering/1.0/maven-filtering-1.0.jar

Downloading: http://repository.apache.org/snapshots/org/apache/maven/shared/maven-repository-builder/1.0-alpha-2/maven-repository-builder-1.0-alpha-2.jar
[INFO] Unable to find resource 'org.apache.maven.shared:maven-repository-builder:jar:1.0-alpha-2' in repository apache.snapshots (https://repository.apache.org/content/repositories/snapshots/)
Downloading: http://repo1.maven.org/maven2/org/apache/maven/shared/maven-repository-builder/1.0-alpha-2/maven-repository-builder-1.0-alpha-2.jar


[INFO] [assembly:attached {execution: unix-bin}]
[INFO] Reading assembly descriptor: src/main/descriptors/unix-bin.xml
[WARNING] Cannot include project artifact: org.apache.activemq:apache-activemq:pom:5.6-SNAPSHOT; it doesn't have an associated file or directory.
[WARNING] Cannot include project artifact: org.apache.activemq:apache-activemq:pom:5.6-SNAPSHOT; it doesn't have an associated file or directory.
[WARNING] Cannot include project artifact: org.apache.activemq:apache-activemq:pom:5.6-SNAPSHOT; it doesn't have an associated file or directory.
[WARNING] Cannot include project artifact: org.apache.activemq:apache-activemq:pom:5.6-SNAPSHOT; it doesn't have an associated file or directory.
[WARNING] Cannot include project artifact: org.apache.activemq:apache-activemq:pom:5.6-SNAPSHOT; it doesn't have an associated file or directory.
[WARNING] The following patterns were never triggered in this artifact inclusion filter:
o  'org.fusesource.commonman:commons-management'

[INFO] apache-activemq-5.6-SNAPSHOT/webapps/admin/WEB-INF already added, skipping
[INFO] Building tar : <https://builds.apache.org/job/ActiveMQ/ws/assembly/target/apache-activemq-5.6-SNAPSHOT-bin.tar.gz>
[INFO] apache-activemq-5.6-SNAPSHOT/webapps/admin/WEB-INF already added, skipping
[INFO] [assembly:attached {execution: windows-bin}]
[INFO] Reading assembly descriptor: src/main/descriptors/windows-bin.xml
[WARNING] Cannot include project artifact: org.apache.activemq:apache-activemq:pom:5.6-SNAPSHOT; it doesn't have an associated file or directory.
[WARNING] Cannot include project artifact: org.apache.activemq:apache-activemq:pom:5.6-SNAPSHOT; it doesn't have an associated file or directory.
[WARNING] Cannot include project artifact: org.apache.activemq:apache-activemq:pom:5.6-SNAPSHOT; it doesn't have an associated file or directory.
[WARNING] Cannot include project artifact: org.apache.activemq:apache-activemq:pom:5.6-SNAPSHOT; it doesn't have an associated file or directory.
[WARNING] Cannot include project artifact: org.apache.activemq:apache-activemq:pom:5.6-SNAPSHOT; it doesn't have an associated file or directory.
[WARNING] The following patterns were never triggered in this artifact inclusion filter:
o  'org.fusesource.commonman:commons-management'

[INFO] apache-activemq-5.6-SNAPSHOT/webapps/admin/WEB-INF already added, skipping
[INFO] Building zip: <https://builds.apache.org/job/ActiveMQ/ws/assembly/target/apache-activemq-5.6-SNAPSHOT-bin.zip>
[INFO] apache-activemq-5.6-SNAPSHOT/webapps/admin/WEB-INF already added, skipping
[INFO] [ianal:verify-legal-files {execution: default}]
[INFO] Checking legal files in: apache-activemq-5.6-SNAPSHOT-bin.zip
[INFO] [install:install {execution: default-install}]
[INFO] Installing <https://builds.apache.org/job/ActiveMQ/ws/assembly/pom.xml> to <https://builds.apache.org/job/ActiveMQ/ws/.repository/org/apache/activemq/apache-activemq/5.6-SNAPSHOT/apache-activemq-5.6-SNAPSHOT.pom>
[INFO] Installing <https://builds.apache.org/job/ActiveMQ/ws/assembly/target/apache-activemq-5.6-SNAPSHOT-bin.tar.gz> to <https://builds.apache.org/job/ActiveMQ/ws/.repository/org/apache/activemq/apache-activemq/5.6-SNAPSHOT/apache-activemq-5.6-SNAPSHOT-bin.tar.gz>
[INFO] Installing <https://builds.apache.org/job/ActiveMQ/ws/assembly/target/apache-activemq-5.6-SNAPSHOT-bin.zip> to <https://builds.apache.org/job/ActiveMQ/ws/.repository/org/apache/activemq/apache-activemq/5.6-SNAPSHOT/apache-activemq-5.6-SNAPSHOT-bin.zip>
[INFO] Preparing source:jar
[JENKINS] Archiving <https://builds.apache.org/job/ActiveMQ/ws/assembly/pom.xml> to /home/hudson/hudson/jobs/ActiveMQ/modules/org.apache.activemq$apache-activemq/builds/2012-03-14_00-33-21/archive/org.apache.activemq/apache-activemq/5.6-SNAPSHOT/apache-activemq-5.6-SNAPSHOT.pom
[JENKINS] Archiving <https://builds.apache.org/job/ActiveMQ/ws/assembly/target/apache-activemq-5.6-SNAPSHOT-bin.tar.gz> to /home/hudson/hudson/jobs/ActiveMQ/modules/org.apache.activemq$apache-activemq/builds/2012-03-14_00-33-21/archive/org.apache.activemq/apache-activemq/5.6-SNAPSHOT/apache-activemq-5.6-SNAPSHOT-bin.tar.gz
[JENKINS] Archiving <https://builds.apache.org/job/ActiveMQ/ws/assembly/target/apache-activemq-5.6-SNAPSHOT-bin.zip> to /home/hudson/hudson/jobs/ActiveMQ/modules/org.apache.activemq$apache-activemq/builds/2012-03-14_00-33-21/archive/org.apache.activemq/apache-activemq/5.6-SNAPSHOT/apache-activemq-5.6-SNAPSHOT-bin.zip
[INFO] [enforcer:enforce {execution: default}]
[INFO] [bundle:cleanVersions {execution: cleanVersions}]
[INFO] [source:jar {execution: default-cli}]
[INFO]
[INFO]
[INFO] ------------------------------------------------------------------------
[INFO] Reactor Summary:
[INFO] ------------------------------------------------------------------------
[INFO] ActiveMQ .............................................. SUCCESS [3:34.820s]
[INFO] ActiveMQ :: KahaDB .................................... SUCCESS [3:07.997s]
[INFO] ActiveMQ :: JAAS ...................................... SUCCESS [1:49.635s]
[INFO] Openwire Generator .................................... SUCCESS [40.107s]
[INFO] ActiveMQ :: jmdns 1.0 ................................. SUCCESS [33.349s]
[INFO] ActiveMQ :: Core ...................................... SUCCESS [6:42:57.967s]
[INFO] ActiveMQ :: RA ........................................ SUCCESS [1:42.408s]
[INFO] ActiveMQ :: Pool ...................................... SUCCESS [41.676s]
[INFO] ActiveMQ :: Spring .................................... SUCCESS [1:16.237s]
[INFO] ActiveMQ :: Camel ..................................... SUCCESS [15:39.884s]
[INFO] ActiveMQ :: Console ................................... SUCCESS [2:11.234s]
[INFO] ActiveMQ :: Optional .................................. SUCCESS [5:22.402s]
[INFO] ActiveMQ :: Jar Bundle ................................ SUCCESS [48.436s]
[INFO] ActiveMQ :: File Server ............................... SUCCESS [20.520s]
[INFO] ActiveMQ :: Blueprint ................................. SUCCESS [26.066s]
[INFO] ActiveMQ :: Apache Karaf .............................. SUCCESS [3:14.384s]
[INFO] ActiveMQ :: RAR ....................................... SUCCESS [1:29.566s]
[INFO] ActiveMQ :: Run Jar ................................... SUCCESS [3.108s]
[INFO] ActiveMQ Tooling ...................................... SUCCESS [2.073s]
[INFO] ActiveMQ :: Memory Usage Test Plugin .................. SUCCESS [28.423s]
[INFO] ActiveMQ :: Performance Test Plugin ................... SUCCESS [12.964s]
[INFO] ActiveMQ :: StartUp Plugin ............................ SUCCESS [10.859s]
[INFO] ActiveMQ :: Web ....................................... SUCCESS [14.952s]
[INFO] ActiveMQ :: Web Demo .................................. SUCCESS [3:31.227s]
[INFO] ActiveMQ :: XMPP ...................................... SUCCESS [54.624s]
[INFO] ActiveMQ :: Web Console ............................... SUCCESS [2:09.178s]
[INFO] ActiveMQ :: Assembly .................................. SUCCESS [10:04.649s]
[INFO] ------------------------------------------------------------------------
[INFO] ------------------------------------------------------------------------
[INFO] BUILD SUCCESSFUL
[INFO] ------------------------------------------------------------------------
[INFO] Total time: 467 minutes 21 seconds
[INFO] Finished at: Wed Mar 14 08:21:34 UTC 2012
[INFO] Final Memory: 144M/1627M
[INFO] ------------------------------------------------------------------------
Waiting for Jenkins to finish collecting data
channel stopped
[locks-and-latches] Releasing all the locks
[locks-and-latches] All the locks released
Maven RedeployPublished use remote ubuntu2 maven settings from : /home/hudson/.m2/settings.xml
[INFO] Deployment in https://repository.apache.org/content/repositories/snapshots (id=,uniqueVersion=false)
Deploying the main artifact activemq-all-5.6-SNAPSHOT.jar
ERROR: Error deploying artifact: Failed to transfer file: https://repository.apache.org/content/repositories/snapshots/org/apache/activemq/activemq-all/5.6-SNAPSHOT/activemq-all-5.6-SNAPSHOT.jar. Return code is: 401, ReasonPhrase:Unauthorized.
org.apache.maven.artifact.deployer.ArtifactDeploymentException: Error deploying artifact: Failed to transfer file: https://repository.apache.org/content/repositories/snapshots/org/apache/activemq/activemq-all/5.6-SNAPSHOT/activemq-all-5.6-SNAPSHOT.jar. Return code is: 401, ReasonPhrase:Unauthorized.
        at hudson.maven.artifact.deployer.DefaultArtifactDeployer.deploy(DefaultArtifactDeployer.java:175)
        at hudson.maven.reporters.MavenArtifactRecord.deploy(MavenArtifactRecord.java:182)
        at hudson.maven.RedeployPublisher.perform(RedeployPublisher.java:176)
        at hudson.tasks.BuildStepMonitor$1.perform(BuildStepMonitor.java:19)
        at hudson.model.AbstractBuild$AbstractRunner.perform(AbstractBuild.java:703)
        at hudson.model.AbstractBuild$AbstractRunner.performAllBuildSteps(AbstractBuild.java:678)
        at hudson.maven.MavenModuleSetBuild$RunnerImpl.post2(MavenModuleSetBuild.java:998)
        at hudson.model.AbstractBuild$AbstractRunner.post(AbstractBuild.java:625)
        at hudson.model.Run.run(Run.java:1433)
        at hudson.maven.MavenModuleSetBuild.run(MavenModuleSetBuild.java:481)
        at hudson.model.ResourceController.execute(ResourceController.java:88)
        at hudson.model.Executor.run(Executor.java:238)
Caused by: org.apache.maven.wagon.TransferFailedException: Failed to transfer file: https://repository.apache.org/content/repositories/snapshots/org/apache/activemq/activemq-all/5.6-SNAPSHOT/activemq-all-5.6-SNAPSHOT.jar. Return code is: 401, ReasonPhrase:Unauthorized.
        at org.apache.maven.wagon.shared.http4.AbstractHttpClientWagon.put(AbstractHttpClientWagon.java:562)
        at org.apache.maven.wagon.shared.http4.AbstractHttpClientWagon.put(AbstractHttpClientWagon.java:471)
        at org.apache.maven.wagon.shared.http4.AbstractHttpClientWagon.put(AbstractHttpClientWagon.java:451)
        at org.apache.maven.repository.legacy.DefaultWagonManager.putRemoteFile(DefaultWagonManager.java:543)
        at org.apache.maven.repository.legacy.DefaultWagonManager.putArtifact(DefaultWagonManager.java:494)
        at hudson.maven.artifact.deployer.DefaultArtifactDeployer.deploy(DefaultArtifactDeployer.java:160)
        ... 11 more
[INFO] Deployment failed after 6.3 sec
Build step 'Deploy artifacts to Maven repository' changed build result to FAILURE

Reply | Threaded
Open this post in threaded view
|  
Report Content as Inappropriate

Jenkins build is unstable: ActiveMQ #903

Apache Jenkins Server-2
Reply | Threaded
Open this post in threaded view
|  
Report Content as Inappropriate

Jenkins build is still unstable: ActiveMQ #904

Apache Jenkins Server-2
Reply | Threaded
Open this post in threaded view
|  
Report Content as Inappropriate

Jenkins build is still unstable: ActiveMQ #905

Apache Jenkins Server-2
Reply | Threaded
Open this post in threaded view
|  
Report Content as Inappropriate

Jenkins build is still unstable: ActiveMQ #906

Apache Jenkins Server-2
Reply | Threaded
Open this post in threaded view
|  
Report Content as Inappropriate

Build failed in Jenkins: ActiveMQ #907

Apache Jenkins Server-2
See <https://builds.apache.org/job/ActiveMQ/907/changes>

Changes:

[tabish] https://issues.apache.org/jira/browse/AMQ-3775

Ensure that the orderIndex is reset to a good state.

[tabish] https://issues.apache.org/jira/browse/AMQ-3775

Update test to not use a static port for the broker Uri.

[tabish] fix and test for: https://issues.apache.org/jira/browse/AMQ-3780

ensure that non-persistent messages are cleaned up from temp storage when the Queue is deleted.

[rajdavies] Added package.html for levelDB stub - for https://issues.apache.org/jira/browse/AMQ-3772

[chirino] Use the snapshot version of the leveldb store..

[tabish] fix bad logger define.

[rajdavies] Added config test for LevelDB - for https://issues.apache.org/jira/browse/AMQ-3772

[rajdavies] add property  optimizeMessageStoreInFlightLimit on destinations so can set the inflight limit above which optimize store dispatch is no longer applied - for https://issues.apache.org/jira/browse/AMQ-3750

[tabish] fix for: https://issues.apache.org/jira/browse/AMQ-3776

[tabish] fix for: https://issues.apache.org/jira/browse/AMQ-3777

------------------------------------------
[...truncated 8513 lines...]
[INFO] META-INF/DEPENDENCIES already added, skipping
[INFO] META-INF/NOTICE already added, skipping
[JENKINS] Archiving <https://builds.apache.org/job/ActiveMQ/ws/activemq-blueprint/target/activemq-blueprint-5.6-SNAPSHOT-sources.jar> to /home/hudson/hudson/jobs/ActiveMQ/modules/org.apache.activemq$activemq-blueprint/builds/2012-03-20_22-26-45/archive/org.apache.activemq/activemq-blueprint/5.6-SNAPSHOT/activemq-blueprint-5.6-SNAPSHOT-sources.jar
[INFO] ------------------------------------------------------------------------
[INFO] SKIPPING ActiveMQ :: Apache Karaf
[INFO]    task-segment: [clean, install, source:jar]
[INFO] This project has been banned from further executions due to previous failures.
[INFO] ------------------------------------------------------------------------
[INFO] ------------------------------------------------------------------------
[INFO] SKIPPING ActiveMQ :: RAR
[INFO]    task-segment: [clean, install, source:jar]
[INFO] This project has been banned from further executions due to previous failures.
[INFO] ------------------------------------------------------------------------
[INFO] ------------------------------------------------------------------------
[INFO] SKIPPING ActiveMQ :: Run Jar
[INFO]    task-segment: [clean, install, source:jar]
[INFO] This project has been banned from further executions due to previous failures.
[INFO] ------------------------------------------------------------------------
[INFO] ------------------------------------------------------------------------
[INFO] Building ActiveMQ Tooling
[INFO]    task-segment: [clean, install, source:jar]
[INFO] ------------------------------------------------------------------------
[INFO] [clean:clean {execution: default-clean}]
[INFO] [enforcer:enforce {execution: default}]
[INFO] [bundle:cleanVersions {execution: cleanVersions}]
[INFO] [remote-resources:process {execution: default}]
[INFO] [site:attach-descriptor {execution: default-attach-descriptor}]
[INFO] [ianal:verify-legal-files {execution: default}]
[INFO] [install:install {execution: default-install}]
[INFO] Installing <https://builds.apache.org/job/ActiveMQ/ws/activemq-tooling/pom.xml> to <https://builds.apache.org/job/ActiveMQ/ws/.repository/org/apache/activemq/tooling/activemq-tooling/5.6-SNAPSHOT/activemq-tooling-5.6-SNAPSHOT.pom>
[INFO] Preparing source:jar
[JENKINS] Archiving <https://builds.apache.org/job/ActiveMQ/ws/activemq-tooling/pom.xml> to /home/hudson/hudson/jobs/ActiveMQ/modules/org.apache.activemq.tooling$activemq-tooling/builds/2012-03-20_22-26-45/archive/org.apache.activemq.tooling/activemq-tooling/5.6-SNAPSHOT/activemq-tooling-5.6-SNAPSHOT.pom
[INFO] [enforcer:enforce {execution: default}]
[INFO] [bundle:cleanVersions {execution: cleanVersions}]
[INFO] [source:jar {execution: default-cli}]
[INFO] ------------------------------------------------------------------------
[INFO] SKIPPING ActiveMQ :: Memory Usage Test Plugin
[INFO]    task-segment: [clean, install, source:jar]
[INFO] This project has been banned from further executions due to previous failures.
[INFO] ------------------------------------------------------------------------
[INFO] ------------------------------------------------------------------------
[INFO] SKIPPING ActiveMQ :: Performance Test Plugin
[INFO]    task-segment: [clean, install, source:jar]
[INFO] This project has been banned from further executions due to previous failures.
[INFO] ------------------------------------------------------------------------
[INFO] ------------------------------------------------------------------------
[INFO] SKIPPING ActiveMQ :: StartUp Plugin
[INFO]    task-segment: [clean, install, source:jar]
[INFO] This project has been banned from further executions due to previous failures.
[INFO] ------------------------------------------------------------------------
[INFO] ------------------------------------------------------------------------
[INFO] SKIPPING ActiveMQ :: Web
[INFO]    task-segment: [clean, install, source:jar]
[INFO] This project has been banned from further executions due to previous failures.
[INFO] ------------------------------------------------------------------------
[INFO] ------------------------------------------------------------------------
[INFO] SKIPPING ActiveMQ :: Web Demo
[INFO]    task-segment: [clean, install, source:jar]
[INFO] This project has been banned from further executions due to previous failures.
[INFO] ------------------------------------------------------------------------
[INFO] ------------------------------------------------------------------------
[INFO] SKIPPING ActiveMQ :: XMPP
[INFO]    task-segment: [clean, install, source:jar]
[INFO] This project has been banned from further executions due to previous failures.
[INFO] ------------------------------------------------------------------------
[INFO] ------------------------------------------------------------------------
[INFO] SKIPPING ActiveMQ :: Web Console
[INFO]    task-segment: [clean, install, source:jar]
[INFO] This project has been banned from further executions due to previous failures.
[INFO] ------------------------------------------------------------------------
[INFO] ------------------------------------------------------------------------
[INFO] SKIPPING ActiveMQ :: Assembly
[INFO]    task-segment: [clean, install, source:jar]
[INFO] This project has been banned from further executions due to previous failures.
[INFO] ------------------------------------------------------------------------
[INFO]
[INFO]
[INFO] ------------------------------------------------------------------------
[INFO] Reactor Summary:
[INFO] ------------------------------------------------------------------------
[INFO] ActiveMQ .............................................. SUCCESS [2:43.666s]
[INFO] ActiveMQ :: KahaDB .................................... SUCCESS [1:48.207s]
[INFO] ActiveMQ :: JAAS ...................................... SUCCESS [1:15.663s]
[INFO] Openwire Generator .................................... SUCCESS [17.853s]
[INFO] ActiveMQ :: jmdns 1.0 ................................. SUCCESS [3.448s]
[INFO] ActiveMQ :: Core ...................................... FAILED [59.374s]
[INFO] ActiveMQ :: RA ........................................ SKIPPED (dependency build failed or was skipped)
[INFO] ActiveMQ :: Pool ...................................... SKIPPED (dependency build failed or was skipped)
[INFO] ActiveMQ :: Spring .................................... SKIPPED (dependency build failed or was skipped)
[INFO] ActiveMQ :: Camel ..................................... SKIPPED (dependency build failed or was skipped)
[INFO] ActiveMQ :: Console ................................... SKIPPED (dependency build failed or was skipped)
[INFO] ActiveMQ :: Optional .................................. SKIPPED (dependency build failed or was skipped)
[INFO] ActiveMQ :: Jar Bundle ................................ SKIPPED (dependency build failed or was skipped)
[INFO] ActiveMQ :: File Server ............................... SKIPPED (dependency build failed or was skipped)
[INFO] ActiveMQ :: Blueprint ................................. SUCCESS [17.165s]
[INFO] ActiveMQ :: Apache Karaf .............................. SKIPPED (dependency build failed or was skipped)
[INFO] ActiveMQ :: RAR ....................................... SKIPPED (dependency build failed or was skipped)
[INFO] ActiveMQ :: Run Jar ................................... SKIPPED (dependency build failed or was skipped)
[INFO] ActiveMQ Tooling ...................................... SUCCESS [1.578s]
[INFO] ActiveMQ :: Memory Usage Test Plugin .................. SKIPPED (dependency build failed or was skipped)
[INFO] ActiveMQ :: Performance Test Plugin ................... SKIPPED (dependency build failed or was skipped)
[INFO] ActiveMQ :: StartUp Plugin ............................ SKIPPED (dependency build failed or was skipped)
[INFO] ActiveMQ :: Web ....................................... SKIPPED (dependency build failed or was skipped)
[INFO] ActiveMQ :: Web Demo .................................. SKIPPED (dependency build failed or was skipped)
[INFO] ActiveMQ :: XMPP ...................................... SKIPPED (dependency build failed or was skipped)
[INFO] ActiveMQ :: Web Console ............................... SKIPPED (dependency build failed or was skipped)
[INFO] ActiveMQ :: Assembly .................................. SKIPPED (dependency build failed or was skipped)
[INFO] ------------------------------------------------------------------------
[INFO] Error for project: ActiveMQ :: Core (during source:jar)
[INFO] ------------------------------------------------------------------------
[INFO] Failed to resolve artifact.

Missing:
----------
1) org.fusesource.fuse-extra:fusemq-leveldb:jar:99-master-SNAPSHOT

  Try downloading the file manually from the project website.

  Then, install it using the command:
      mvn install:install-file -DgroupId=org.fusesource.fuse-extra -DartifactId=fusemq-leveldb -Dversion=99-master-SNAPSHOT -Dpackaging=jar -Dfile=/path/to/file

  Alternatively, if you host your own repository you can deploy the file there:
      mvn deploy:deploy-file -DgroupId=org.fusesource.fuse-extra -DartifactId=fusemq-leveldb -Dversion=99-master-SNAPSHOT -Dpackaging=jar -Dfile=/path/to/file -Durl=[url] -DrepositoryId=[id]

  Path to dependency:
  1) org.apache.activemq:activemq-core:bundle:5.6-SNAPSHOT
  2) org.fusesource.fuse-extra:fusemq-leveldb:jar:99-master-SNAPSHOT

----------
1 required artifact is missing.

for artifact:
  org.apache.activemq:activemq-core:bundle:5.6-SNAPSHOT

from the specified remote repositories:
  com.springsource.repository.bundles.external (http://repository.springsource.com/maven/bundles/external),
  central (http://repo1.maven.org/maven2),
  Nexus (http://repository.apache.org/snapshots)



[INFO] ------------------------------------------------------------------------
[INFO] Trace
org.apache.maven.lifecycle.LifecycleExecutionException: Missing:
----------
1) org.fusesource.fuse-extra:fusemq-leveldb:jar:99-master-SNAPSHOT

  Try downloading the file manually from the project website.

  Then, install it using the command:
      mvn install:install-file -DgroupId=org.fusesource.fuse-extra -DartifactId=fusemq-leveldb -Dversion=99-master-SNAPSHOT -Dpackaging=jar -Dfile=/path/to/file

  Alternatively, if you host your own repository you can deploy the file there:
      mvn deploy:deploy-file -DgroupId=org.fusesource.fuse-extra -DartifactId=fusemq-leveldb -Dversion=99-master-SNAPSHOT -Dpackaging=jar -Dfile=/path/to/file -Durl=[url] -DrepositoryId=[id]

  Path to dependency:
  1) org.apache.activemq:activemq-core:bundle:5.6-SNAPSHOT
  2) org.fusesource.fuse-extra:fusemq-leveldb:jar:99-master-SNAPSHOT

----------
1 required artifact is missing.

for artifact:
  org.apache.activemq:activemq-core:bundle:5.6-SNAPSHOT

from the specified remote repositories:
  com.springsource.repository.bundles.external (http://repository.springsource.com/maven/bundles/external),
  central (http://repo1.maven.org/maven2),
  Nexus (http://repository.apache.org/snapshots)


        at org.apache.maven.lifecycle.DefaultLifecycleExecutor.executeGoals(DefaultLifecycleExecutor.java:711)
        at org.apache.maven.lifecycle.DefaultLifecycleExecutor.executeGoalWithLifecycle(DefaultLifecycleExecutor.java:556)
        at org.apache.maven.lifecycle.DefaultLifecycleExecutor.forkProjectLifecycle(DefaultLifecycleExecutor.java:1205)
        at org.apache.maven.lifecycle.DefaultLifecycleExecutor.forkLifecycle(DefaultLifecycleExecutor.java:1038)
        at org.apache.maven.lifecycle.DefaultLifecycleExecutor.executeGoals(DefaultLifecycleExecutor.java:643)
        at org.apache.maven.lifecycle.DefaultLifecycleExecutor.executeStandaloneGoal(DefaultLifecycleExecutor.java:569)
        at org.apache.maven.lifecycle.DefaultLifecycleExecutor.executeGoal(DefaultLifecycleExecutor.java:539)
        at org.apache.maven.lifecycle.DefaultLifecycleExecutor.executeGoalAndHandleFailures(DefaultLifecycleExecutor.java:387)
        at org.apache.maven.lifecycle.DefaultLifecycleExecutor.executeTaskSegments(DefaultLifecycleExecutor.java:348)
        at org.apache.maven.lifecycle.DefaultLifecycleExecutor.execute(DefaultLifecycleExecutor.java:180)
        at org.apache.maven.lifecycle.LifecycleExecutorInterceptor.execute(LifecycleExecutorInterceptor.java:65)
        at org.apache.maven.DefaultMaven.doExecute(DefaultMaven.java:328)
        at org.apache.maven.DefaultMaven.execute(DefaultMaven.java:138)
        at org.apache.maven.cli.MavenCli.main(MavenCli.java:362)
        at sun.reflect.NativeMethodAccessorImpl.invoke0(Native Method)
        at sun.reflect.NativeMethodAccessorImpl.invoke(NativeMethodAccessorImpl.java:39)
        at sun.reflect.DelegatingMethodAccessorImpl.invoke(DelegatingMethodAccessorImpl.java:25)
        at java.lang.reflect.Method.invoke(Method.java:597)
        at org.codehaus.classworlds.Launcher.launchEnhanced(Launcher.java:315)
        at org.codehaus.classworlds.Launcher.launch(Launcher.java:255)
        at hudson.maven.agent.Main.launch(Main.java:185)
        at hudson.maven.MavenBuilder.call(MavenBuilder.java:151)
        at hudson.maven.Maven2Builder.call(Maven2Builder.java:77)
        at hudson.maven.Maven2Builder.call(Maven2Builder.java:53)
        at hudson.remoting.UserRequest.perform(UserRequest.java:118)
        at hudson.remoting.UserRequest.perform(UserRequest.java:48)
        at hudson.remoting.Request$2.run(Request.java:287)
        at hudson.remoting.InterceptingExecutorService$1.call(InterceptingExecutorService.java:72)
        at java.util.concurrent.FutureTask$Sync.innerRun(FutureTask.java:303)
        at java.util.concurrent.FutureTask.run(FutureTask.java:138)
        at java.util.concurrent.ThreadPoolExecutor$Worker.runTask(ThreadPoolExecutor.java:886)
        at java.util.concurrent.ThreadPoolExecutor$Worker.run(ThreadPoolExecutor.java:908)
        at java.lang.Thread.run(Thread.java:662)
Caused by: org.apache.maven.artifact.resolver.MultipleArtifactsNotFoundException: Missing:
----------
1) org.fusesource.fuse-extra:fusemq-leveldb:jar:99-master-SNAPSHOT

  Try downloading the file manually from the project website.

  Then, install it using the command:
      mvn install:install-file -DgroupId=org.fusesource.fuse-extra -DartifactId=fusemq-leveldb -Dversion=99-master-SNAPSHOT -Dpackaging=jar -Dfile=/path/to/file

  Alternatively, if you host your own repository you can deploy the file there:
      mvn deploy:deploy-file -DgroupId=org.fusesource.fuse-extra -DartifactId=fusemq-leveldb -Dversion=99-master-SNAPSHOT -Dpackaging=jar -Dfile=/path/to/file -Durl=[url] -DrepositoryId=[id]

  Path to dependency:
  1) org.apache.activemq:activemq-core:bundle:5.6-SNAPSHOT
  2) org.fusesource.fuse-extra:fusemq-leveldb:jar:99-master-SNAPSHOT

----------
1 required artifact is missing.

for artifact:
  org.apache.activemq:activemq-core:bundle:5.6-SNAPSHOT

from the specified remote repositories:
  com.springsource.repository.bundles.external (http://repository.springsource.com/maven/bundles/external),
  central (http://repo1.maven.org/maven2),
  Nexus (http://repository.apache.org/snapshots)


        at org.apache.maven.artifact.resolver.DefaultArtifactResolver.resolveTransitively(DefaultArtifactResolver.java:360)
        at org.apache.maven.artifact.resolver.DefaultArtifactResolver.resolveTransitively(DefaultArtifactResolver.java:304)
        at org.apache.maven.plugin.DefaultPluginManager.resolveTransitiveDependencies(DefaultPluginManager.java:1499)
        at org.apache.maven.plugin.DefaultPluginManager.executeMojo(DefaultPluginManager.java:442)
        at hudson.maven.agent.PluginManagerInterceptor.executeMojo(PluginManagerInterceptor.java:182)
        at org.apache.maven.lifecycle.DefaultLifecycleExecutor.executeGoals(DefaultLifecycleExecutor.java:694)
        ... 32 more
[INFO] ------------------------------------------------------------------------
[INFO] BUILD ERRORS
[INFO] ------------------------------------------------------------------------
[INFO] Total time: 8 minutes 38 seconds
[INFO] Finished at: Tue Mar 20 22:35:52 UTC 2012
[INFO] Final Memory: 86M/966M
[INFO] ------------------------------------------------------------------------
channel stopped
[locks-and-latches] Releasing all the locks
[locks-and-latches] All the locks released
Loading...