Build failed in Jenkins: ActiveMQ-Trunk-Deploy #1660

classic Classic list List threaded Threaded
3 messages Options
Reply | Threaded
Open this post in threaded view
|

Build failed in Jenkins: ActiveMQ-Trunk-Deploy #1660

Apache Jenkins Server-2
See <https://builds.apache.org/job/ActiveMQ-Trunk-Deploy/1660/changes>

Changes:

[christopher.l.shannon] https://issues.apache.org/jira/browse/AMQ-6377

[bloommi] AMQ-6379 - Add openwire properties for provider name, provider version,

[christopher.l.shannon] https://issues.apache.org/jira/browse/AMQ-6379

------------------------------------------
Started by an SCM change
[EnvInject] - Loading node environment variables.
Building remotely on H10 (docker Ubuntu ubuntu yahoo-not-h2) in workspace <https://builds.apache.org/job/ActiveMQ-Trunk-Deploy/ws/>
Cloning the remote Git repository
Cloning repository https://git-wip-us.apache.org/repos/asf/activemq.git
 > git init <https://builds.apache.org/job/ActiveMQ-Trunk-Deploy/ws/> # timeout=10
Fetching upstream changes from https://git-wip-us.apache.org/repos/asf/activemq.git
 > git --version # timeout=10
 > git -c core.askpass=true fetch --tags --progress https://git-wip-us.apache.org/repos/asf/activemq.git +refs/heads/*:refs/remotes/origin/*
 > git config remote.origin.url https://git-wip-us.apache.org/repos/asf/activemq.git # timeout=10
 > git config --add remote.origin.fetch +refs/heads/*:refs/remotes/origin/* # timeout=10
 > git config remote.origin.url https://git-wip-us.apache.org/repos/asf/activemq.git # timeout=10
Fetching upstream changes from https://git-wip-us.apache.org/repos/asf/activemq.git
 > git -c core.askpass=true fetch --tags --progress https://git-wip-us.apache.org/repos/asf/activemq.git +refs/heads/*:refs/remotes/origin/*
 > git rev-parse origin/master^{commit} # timeout=10
Checking out Revision 7118247b658335839bc792dde8f70eee2acc1f18 (origin/master)
 > git config core.sparsecheckout # timeout=10
 > git checkout -f 7118247b658335839bc792dde8f70eee2acc1f18
 > git rev-list 1bdcb4f96ffa7b08532f0ef76425416d9363c118 # timeout=10
Parsing POMs
Modules changed, recalculating dependency graph
Established TCP socket on 59435
maven32-agent.jar already up to date
maven32-interceptor.jar already up to date
maven3-interceptor-commons.jar already up to date
[ActiveMQ-Trunk-Deploy] $ /home/jenkins/tools/java/latest1.7/bin/java -Xmx2048m -Xms1024m -cp /home/jenkins/jenkins-slave/maven32-agent.jar:/home/jenkins/tools/maven/latest3/boot/plexus-classworlds-2.5.2.jar:/home/jenkins/tools/maven/latest3/conf/logging jenkins.maven3.agent.Maven32Main /home/jenkins/tools/maven/latest3/ /home/jenkins/jenkins-slave/slave.jar /home/jenkins/jenkins-slave/maven32-interceptor.jar /home/jenkins/jenkins-slave/maven3-interceptor-commons.jar 59435
Exception in thread "main" java.lang.ClassNotFoundException: hudson.remoting.Launcher
        at org.codehaus.plexus.classworlds.strategy.SelfFirstStrategy.loadClass(SelfFirstStrategy.java:50)
        at org.codehaus.plexus.classworlds.realm.ClassRealm.unsynchronizedLoadClass(ClassRealm.java:271)
        at org.codehaus.plexus.classworlds.realm.ClassRealm.loadClass(ClassRealm.java:247)
        at org.codehaus.plexus.classworlds.realm.ClassRealm.loadClass(ClassRealm.java:239)
        at jenkins.maven3.agent.Maven32Main.main(Maven32Main.java:143)
        at jenkins.maven3.agent.Maven32Main.main(Maven32Main.java:74)
ERROR: Failed to parse POMs
java.io.EOFException: unexpected stream termination
        at hudson.remoting.ChannelBuilder.negotiate(ChannelBuilder.java:365)
        at hudson.remoting.ChannelBuilder.build(ChannelBuilder.java:310)
        at hudson.slaves.Channels.forProcess(Channels.java:115)
        at hudson.maven.AbstractMavenProcessFactory.newProcess(AbstractMavenProcessFactory.java:297)
        at hudson.maven.ProcessCache.get(ProcessCache.java:236)
        at hudson.maven.MavenModuleSetBuild$MavenModuleSetBuildExecution.doRun(MavenModuleSetBuild.java:778)
        at hudson.model.AbstractBuild$AbstractBuildExecution.run(AbstractBuild.java:534)
        at hudson.model.Run.execute(Run.java:1738)
        at hudson.maven.MavenModuleSetBuild.run(MavenModuleSetBuild.java:531)
        at hudson.model.ResourceController.execute(ResourceController.java:98)
        at hudson.model.Executor.run(Executor.java:410)
Reply | Threaded
Open this post in threaded view
|

Build failed in Jenkins: ActiveMQ-Trunk-Deploy #1661

Apache Jenkins Server-2
See <https://builds.apache.org/job/ActiveMQ-Trunk-Deploy/1661/changes>

Changes:

[christopher.l.shannon] https://issues.apache.org/jira/browse/AMQ-6379

[christopher.l.shannon] https://issues.apache.org/jira/browse/AMQ-6381

------------------------------------------
Started by an SCM change
[EnvInject] - Loading node environment variables.
Building remotely on H10 (docker Ubuntu ubuntu yahoo-not-h2) in workspace <https://builds.apache.org/job/ActiveMQ-Trunk-Deploy/ws/>
 > git rev-parse --is-inside-work-tree # timeout=10
Fetching changes from the remote Git repository
 > git config remote.origin.url https://git-wip-us.apache.org/repos/asf/activemq.git # timeout=10
Fetching upstream changes from https://git-wip-us.apache.org/repos/asf/activemq.git
 > git --version # timeout=10
 > git -c core.askpass=true fetch --tags --progress https://git-wip-us.apache.org/repos/asf/activemq.git +refs/heads/*:refs/remotes/origin/*
 > git rev-parse origin/master^{commit} # timeout=10
Checking out Revision 82295fd2c6dea96433d15e00e00d53c6d41f5c0b (origin/master)
 > git config core.sparsecheckout # timeout=10
 > git checkout -f 82295fd2c6dea96433d15e00e00d53c6d41f5c0b
 > git rev-list 7118247b658335839bc792dde8f70eee2acc1f18 # timeout=10
Parsing POMs
Modules changed, recalculating dependency graph
Established TCP socket on 54483
maven32-agent.jar already up to date
maven32-interceptor.jar already up to date
maven3-interceptor-commons.jar already up to date
[ActiveMQ-Trunk-Deploy] $ /home/jenkins/tools/java/latest1.7/bin/java -Xmx2048m -Xms1024m -cp /home/jenkins/jenkins-slave/maven32-agent.jar:/home/jenkins/tools/maven/latest3/boot/plexus-classworlds-2.5.2.jar:/home/jenkins/tools/maven/latest3/conf/logging jenkins.maven3.agent.Maven32Main /home/jenkins/tools/maven/latest3/ /home/jenkins/jenkins-slave/slave.jar /home/jenkins/jenkins-slave/maven32-interceptor.jar /home/jenkins/jenkins-slave/maven3-interceptor-commons.jar 54483
Exception in thread "main" java.lang.ClassNotFoundException: hudson.remoting.Launcher
        at org.codehaus.plexus.classworlds.strategy.SelfFirstStrategy.loadClass(SelfFirstStrategy.java:50)
        at org.codehaus.plexus.classworlds.realm.ClassRealm.unsynchronizedLoadClass(ClassRealm.java:271)
        at org.codehaus.plexus.classworlds.realm.ClassRealm.loadClass(ClassRealm.java:247)
        at org.codehaus.plexus.classworlds.realm.ClassRealm.loadClass(ClassRealm.java:239)
        at jenkins.maven3.agent.Maven32Main.main(Maven32Main.java:143)
        at jenkins.maven3.agent.Maven32Main.main(Maven32Main.java:74)
ERROR: Failed to parse POMs
java.io.EOFException: unexpected stream termination
        at hudson.remoting.ChannelBuilder.negotiate(ChannelBuilder.java:365)
        at hudson.remoting.ChannelBuilder.build(ChannelBuilder.java:310)
        at hudson.slaves.Channels.forProcess(Channels.java:115)
        at hudson.maven.AbstractMavenProcessFactory.newProcess(AbstractMavenProcessFactory.java:297)
        at hudson.maven.ProcessCache.get(ProcessCache.java:236)
        at hudson.maven.MavenModuleSetBuild$MavenModuleSetBuildExecution.doRun(MavenModuleSetBuild.java:778)
        at hudson.model.AbstractBuild$AbstractBuildExecution.run(AbstractBuild.java:534)
        at hudson.model.Run.execute(Run.java:1738)
        at hudson.maven.MavenModuleSetBuild.run(MavenModuleSetBuild.java:531)
        at hudson.model.ResourceController.execute(ResourceController.java:98)
        at hudson.model.Executor.run(Executor.java:410)
Reply | Threaded
Open this post in threaded view
|

Jenkins build is back to normal : ActiveMQ-Trunk-Deploy #1662

Apache Jenkins Server-2