Build failed in Jenkins: ActiveMQ-Java8-All-UnitTests #780

Previous Topic Next Topic
 
classic Classic list List threaded Threaded
3 messages Options
Reply | Threaded
Open this post in threaded view
|

Build failed in Jenkins: ActiveMQ-Java8-All-UnitTests #780

Apache Jenkins Server-2
See <https://builds.apache.org/job/ActiveMQ-Java8-All-UnitTests/780/display/redirect?page=changes>

Changes:

[hadrian] AMQ-6327 - Remove System.out.println

------------------------------------------
Started by an SCM change
Started by an SCM change
Started by an SCM change
Started by an SCM change
[EnvInject] - Loading node environment variables.
Building remotely on H24 (ubuntu xenial) in workspace <https://builds.apache.org/job/ActiveMQ-Java8-All-UnitTests/ws/>
 > git rev-parse --is-inside-work-tree # timeout=10
Fetching changes from the remote Git repository
 > git config remote.origin.url https://git-wip-us.apache.org/repos/asf/activemq.git # timeout=10
Fetching upstream changes from https://git-wip-us.apache.org/repos/asf/activemq.git
 > git --version # timeout=10
 > git fetch --tags --progress https://git-wip-us.apache.org/repos/asf/activemq.git +refs/heads/*:refs/remotes/origin/*
 > git rev-parse origin/master^{commit} # timeout=10
Checking out Revision 12c649c2d9116a10d6157f02a6026acd5033e036 (origin/master)
 > git config core.sparsecheckout # timeout=10
 > git checkout -f 12c649c2d9116a10d6157f02a6026acd5033e036
Commit message: "This closes #85. Won't fix. Thanks @jwcarman for contribution, sorry for not picking it up in time."
 > git rev-list b06e26ca1e2fc50088bb6423403a802461b53879 # timeout=10
java.util.concurrent.TimeoutException: Timeout waiting for task.
        at com.google.common.util.concurrent.AbstractFuture$Sync.get(AbstractFuture.java:259)
        at com.google.common.util.concurrent.AbstractFuture.get(AbstractFuture.java:91)
        at com.google.common.util.concurrent.ForwardingFuture.get(ForwardingFuture.java:69)
        at com.atlassian.jira.rest.client.internal.async.DelegatingPromise.get(DelegatingPromise.java:107)
        at hudson.plugins.jira.JiraRestService.getIssuesFromJqlSearch(JiraRestService.java:177)
        at hudson.plugins.jira.JiraSession.getIssuesFromJqlSearch(JiraSession.java:135)
        at io.jenkins.blueocean.service.embedded.jira.JiraSCMListener.onChangeLogParsed(JiraSCMListener.java:43)
        at hudson.model.listeners.SCMListener.onChangeLogParsed(SCMListener.java:120)
        at hudson.model.AbstractBuild$AbstractBuildExecution.defaultCheckout(AbstractBuild.java:582)
Caused: java.io.IOException: Failed to parse changelog
        at hudson.model.AbstractBuild$AbstractBuildExecution.defaultCheckout(AbstractBuild.java:584)
        at jenkins.scm.SCMCheckoutStrategy.checkout(SCMCheckoutStrategy.java:86)
        at hudson.model.AbstractBuild$AbstractBuildExecution.run(AbstractBuild.java:491)
        at hudson.model.Run.execute(Run.java:1737)
        at hudson.maven.MavenModuleSetBuild.run(MavenModuleSetBuild.java:543)
        at hudson.model.ResourceController.execute(ResourceController.java:97)
        at hudson.model.Executor.run(Executor.java:419)
Retrying after 10 seconds
 > git rev-parse --is-inside-work-tree # timeout=10
Fetching changes from the remote Git repository
 > git config remote.origin.url https://git-wip-us.apache.org/repos/asf/activemq.git # timeout=10
Fetching upstream changes from https://git-wip-us.apache.org/repos/asf/activemq.git
 > git --version # timeout=10
 > git fetch --tags --progress https://git-wip-us.apache.org/repos/asf/activemq.git +refs/heads/*:refs/remotes/origin/*
 > git rev-parse origin/master^{commit} # timeout=10
Checking out Revision 12c649c2d9116a10d6157f02a6026acd5033e036 (origin/master)
 > git config core.sparsecheckout # timeout=10
 > git checkout -f 12c649c2d9116a10d6157f02a6026acd5033e036
Commit message: "This closes #85. Won't fix. Thanks @jwcarman for contribution, sorry for not picking it up in time."
java.util.concurrent.TimeoutException: Timeout waiting for task.
        at com.google.common.util.concurrent.AbstractFuture$Sync.get(AbstractFuture.java:259)
        at com.google.common.util.concurrent.AbstractFuture.get(AbstractFuture.java:91)
        at com.google.common.util.concurrent.ForwardingFuture.get(ForwardingFuture.java:69)
        at com.atlassian.jira.rest.client.internal.async.DelegatingPromise.get(DelegatingPromise.java:107)
        at hudson.plugins.jira.JiraRestService.getIssuesFromJqlSearch(JiraRestService.java:177)
        at hudson.plugins.jira.JiraSession.getIssuesFromJqlSearch(JiraSession.java:135)
        at io.jenkins.blueocean.service.embedded.jira.JiraSCMListener.onChangeLogParsed(JiraSCMListener.java:43)
        at hudson.model.listeners.SCMListener.onChangeLogParsed(SCMListener.java:120)
        at hudson.model.AbstractBuild$AbstractBuildExecution.defaultCheckout(AbstractBuild.java:582)
Caused: java.io.IOException: Failed to parse changelog
        at hudson.model.AbstractBuild$AbstractBuildExecution.defaultCheckout(AbstractBuild.java:584)
        at jenkins.scm.SCMCheckoutStrategy.checkout(SCMCheckoutStrategy.java:86)
        at hudson.model.AbstractBuild$AbstractBuildExecution.run(AbstractBuild.java:491)
        at hudson.model.Run.execute(Run.java:1737)
        at hudson.maven.MavenModuleSetBuild.run(MavenModuleSetBuild.java:543)
        at hudson.model.ResourceController.execute(ResourceController.java:97)
        at hudson.model.Executor.run(Executor.java:419)
Retrying after 10 seconds
 > git rev-parse --is-inside-work-tree # timeout=10
Fetching changes from the remote Git repository
 > git config remote.origin.url https://git-wip-us.apache.org/repos/asf/activemq.git # timeout=10
Fetching upstream changes from https://git-wip-us.apache.org/repos/asf/activemq.git
 > git --version # timeout=10
 > git fetch --tags --progress https://git-wip-us.apache.org/repos/asf/activemq.git +refs/heads/*:refs/remotes/origin/*
 > git rev-parse origin/master^{commit} # timeout=10
Checking out Revision 12c649c2d9116a10d6157f02a6026acd5033e036 (origin/master)
 > git config core.sparsecheckout # timeout=10
 > git checkout -f 12c649c2d9116a10d6157f02a6026acd5033e036
Commit message: "This closes #85. Won't fix. Thanks @jwcarman for contribution, sorry for not picking it up in time."
java.util.concurrent.TimeoutException: Timeout waiting for task.
        at com.google.common.util.concurrent.AbstractFuture$Sync.get(AbstractFuture.java:259)
        at com.google.common.util.concurrent.AbstractFuture.get(AbstractFuture.java:91)
        at com.google.common.util.concurrent.ForwardingFuture.get(ForwardingFuture.java:69)
        at com.atlassian.jira.rest.client.internal.async.DelegatingPromise.get(DelegatingPromise.java:107)
        at hudson.plugins.jira.JiraRestService.getIssuesFromJqlSearch(JiraRestService.java:177)
        at hudson.plugins.jira.JiraSession.getIssuesFromJqlSearch(JiraSession.java:135)
        at io.jenkins.blueocean.service.embedded.jira.JiraSCMListener.onChangeLogParsed(JiraSCMListener.java:43)
        at hudson.model.listeners.SCMListener.onChangeLogParsed(SCMListener.java:120)
        at hudson.model.AbstractBuild$AbstractBuildExecution.defaultCheckout(AbstractBuild.java:582)
Caused: java.io.IOException: Failed to parse changelog
        at hudson.model.AbstractBuild$AbstractBuildExecution.defaultCheckout(AbstractBuild.java:584)
        at jenkins.scm.SCMCheckoutStrategy.checkout(SCMCheckoutStrategy.java:86)
        at hudson.model.AbstractBuild$AbstractBuildExecution.run(AbstractBuild.java:491)
        at hudson.model.Run.execute(Run.java:1737)
        at hudson.maven.MavenModuleSetBuild.run(MavenModuleSetBuild.java:543)
        at hudson.model.ResourceController.execute(ResourceController.java:97)
        at hudson.model.Executor.run(Executor.java:419)
Reply | Threaded
Open this post in threaded view
|

Build failed in Jenkins: ActiveMQ-Java8-All-UnitTests #781

Apache Jenkins Server-2
See <https://builds.apache.org/job/ActiveMQ-Java8-All-UnitTests/781/display/redirect?page=changes>

Changes:

[gtully] [AMQ-6880] fix filter match logic when transport connector

------------------------------------------
[...truncated 273.52 KB...]
Running org.apache.activemq.bugs.AMQ6522Test
Tests run: 1, Failures: 0, Errors: 0, Skipped: 0, Time elapsed: 2.127 sec - in org.apache.activemq.bugs.AMQ6522Test
Running org.apache.activemq.bugs.AMQ6579Test
Tests run: 1, Failures: 0, Errors: 0, Skipped: 0, Time elapsed: 1.536 sec - in org.apache.activemq.bugs.AMQ6579Test
Running org.apache.activemq.bugs.AMQ6599Test
Tests run: 6, Failures: 0, Errors: 0, Skipped: 0, Time elapsed: 2.034 sec - in org.apache.activemq.bugs.AMQ6599Test
Running org.apache.activemq.bugs.ActiveMQSlowConsumerManualTest
Tests run: 4, Failures: 0, Errors: 0, Skipped: 0, Time elapsed: 7.17 sec - in org.apache.activemq.bugs.ActiveMQSlowConsumerManualTest
Running org.apache.activemq.bugs.ConnectionPerMessageTest
Tests run: 1, Failures: 0, Errors: 0, Skipped: 0, Time elapsed: 3.483 sec - in org.apache.activemq.bugs.ConnectionPerMessageTest
Running org.apache.activemq.bugs.CraigsBugTest
Tests run: 1, Failures: 0, Errors: 0, Skipped: 0, Time elapsed: 3.963 sec - in org.apache.activemq.bugs.CraigsBugTest
Running org.apache.activemq.bugs.CursorMemoryHighWaterMarkTest
Tests run: 1, Failures: 0, Errors: 0, Skipped: 0, Time elapsed: 6.601 sec - in org.apache.activemq.bugs.CursorMemoryHighWaterMarkTest
Running org.apache.activemq.bugs.DoubleExpireTest
Tests run: 1, Failures: 0, Errors: 0, Skipped: 0, Time elapsed: 60.988 sec - in org.apache.activemq.bugs.DoubleExpireTest
Running org.apache.activemq.bugs.DuplicateFromStoreTest
Tests run: 1, Failures: 0, Errors: 0, Skipped: 0, Time elapsed: 43.043 sec - in org.apache.activemq.bugs.DuplicateFromStoreTest
Running org.apache.activemq.bugs.DurableConsumerTest
Tests run: 6, Failures: 0, Errors: 0, Skipped: 0, Time elapsed: 24.81 sec - in org.apache.activemq.bugs.DurableConsumerTest
Running org.apache.activemq.bugs.JMSDurableTopicNoLocalTest
Tests run: 1, Failures: 0, Errors: 0, Skipped: 0, Time elapsed: 6.74 sec - in org.apache.activemq.bugs.JMSDurableTopicNoLocalTest
Running org.apache.activemq.bugs.JMSQueueBrowserPriorityTest
Tests run: 1, Failures: 0, Errors: 0, Skipped: 0, Time elapsed: 12.53 sec - in org.apache.activemq.bugs.JMSQueueBrowserPriorityTest
Running org.apache.activemq.bugs.JmsDurableTopicSlowReceiveTest
Tests run: 2, Failures: 0, Errors: 0, Skipped: 0, Time elapsed: 105.122 sec - in org.apache.activemq.bugs.JmsDurableTopicSlowReceiveTest
Running org.apache.activemq.bugs.JmsTimeoutTest
Tests run: 2, Failures: 0, Errors: 0, Skipped: 0, Time elapsed: 16.21 sec - in org.apache.activemq.bugs.JmsTimeoutTest
Running org.apache.activemq.bugs.MemoryUsageBlockResumeTest
Tests run: 1, Failures: 0, Errors: 0, Skipped: 0, Time elapsed: 2.348 sec - in org.apache.activemq.bugs.MemoryUsageBlockResumeTest
Running org.apache.activemq.bugs.MemoryUsageBrokerTest
Tests run: 1, Failures: 0, Errors: 0, Skipped: 0, Time elapsed: 12.594 sec - in org.apache.activemq.bugs.MemoryUsageBrokerTest
Running org.apache.activemq.bugs.MemoryUsageCleanupTest
Tests run: 1, Failures: 0, Errors: 0, Skipped: 0, Time elapsed: 210.501 sec - in org.apache.activemq.bugs.MemoryUsageCleanupTest
Running org.apache.activemq.bugs.MessageExpirationReaperTest
Tests run: 2, Failures: 0, Errors: 0, Skipped: 0, Time elapsed: 10.627 sec - in org.apache.activemq.bugs.MessageExpirationReaperTest
Running org.apache.activemq.bugs.MessageExpiryClientSideTest
Tests run: 4, Failures: 0, Errors: 0, Skipped: 0, Time elapsed: 1.812 sec - in org.apache.activemq.bugs.MessageExpiryClientSideTest
Running org.apache.activemq.bugs.MessageExpiryTimeDifferenceTest
Tests run: 1, Failures: 0, Errors: 0, Skipped: 0, Time elapsed: 1.892 sec - in org.apache.activemq.bugs.MessageExpiryTimeDifferenceTest
Running org.apache.activemq.bugs.MissingDataFileTest
Tests run: 1, Failures: 0, Errors: 0, Skipped: 0, Time elapsed: 28.485 sec - in org.apache.activemq.bugs.MissingDataFileTest
Running org.apache.activemq.bugs.OptimizeAcknowledgeWithExpiredMsgsTest
Tests run: 3, Failures: 0, Errors: 0, Skipped: 0, Time elapsed: 3.386 sec - in org.apache.activemq.bugs.OptimizeAcknowledgeWithExpiredMsgsTest
Running org.apache.activemq.bugs.PfcTimeoutTest
Tests run: 2, Failures: 0, Errors: 0, Skipped: 0, Time elapsed: 11.191 sec - in org.apache.activemq.bugs.PfcTimeoutTest
Running org.apache.activemq.bugs.QueueWorkerPrefetchTest
Tests run: 1, Failures: 0, Errors: 0, Skipped: 0, Time elapsed: 0.96 sec - in org.apache.activemq.bugs.QueueWorkerPrefetchTest
Running org.apache.activemq.bugs.RedeliveryPluginHeaderTest
Tests run: 1, Failures: 0, Errors: 0, Skipped: 0, Time elapsed: 6.562 sec - in org.apache.activemq.bugs.RedeliveryPluginHeaderTest
Running org.apache.activemq.bugs.SlowConsumerTest
Tests run: 1, Failures: 0, Errors: 0, Skipped: 0, Time elapsed: 15.738 sec - in org.apache.activemq.bugs.SlowConsumerTest
Running org.apache.activemq.bugs.SparseAckReplayAfterStoreCleanupLevelDBStoreTest
Tests run: 4, Failures: 0, Errors: 0, Skipped: 0, Time elapsed: 4.379 sec - in org.apache.activemq.bugs.SparseAckReplayAfterStoreCleanupLevelDBStoreTest
Running org.apache.activemq.bugs.TempQueueDeleteOnCloseTest
Tests run: 1, Failures: 0, Errors: 0, Skipped: 0, Time elapsed: 1.208 sec - in org.apache.activemq.bugs.TempQueueDeleteOnCloseTest
Running org.apache.activemq.bugs.TempStorageBlockedBrokerTest
Tests run: 2, Failures: 0, Errors: 0, Skipped: 0, Time elapsed: 134.23 sec - in org.apache.activemq.bugs.TempStorageBlockedBrokerTest
Running org.apache.activemq.bugs.TempStorageConfigBrokerTest
Tests run: 2, Failures: 0, Errors: 0, Skipped: 2, Time elapsed: 0.084 sec - in org.apache.activemq.bugs.TempStorageConfigBrokerTest
Running org.apache.activemq.bugs.TempStoreDataCleanupTest

Results :

Failed tests:
  AMQ2645Test>CombinationTestSupport.runBare:113->CombinationTestSupport.runBare:107->testWaitForTransportInterruptionProcessingHang:93 Consumer is deadlocked!
  AMQ4930Test.testWithStatsDisabled:72->doTestBrowsePending:120 No growth: 190667 >= 199000.8
  AMQ6463Test>CombinationTestSupport.runBare:113->CombinationTestSupport.runBare:107->testBlockedSechedulerSendNoError:76 got blocked event

Tests run: 2122, Failures: 3, Errors: 0, Skipped: 35

[JENKINS] Recording test results
[INFO] ------------------------------------------------------------------------
[INFO] Reactor Summary:
[INFO]
[INFO] ActiveMQ ........................................... SUCCESS [  5.332 s]
[INFO] ActiveMQ :: Client ................................. SUCCESS [02:39 min]
[INFO] ActiveMQ :: Openwire Legacy Support ................ SUCCESS [  6.536 s]
[INFO] ActiveMQ :: JAAS ................................... SUCCESS [ 27.265 s]
[INFO] ActiveMQ :: Broker ................................. SUCCESS [ 52.231 s]
[INFO] ActiveMQ :: KahaDB Store ........................... SUCCESS [03:24 min]
[INFO] ActiveMQ :: STOMP Protocol ......................... SUCCESS [14:57 min]
[INFO] ActiveMQ :: MQTT Protocol .......................... SUCCESS [20:35 min]
[INFO] ActiveMQ :: JDBC Store ............................. SUCCESS [  4.804 s]
[INFO] ActiveMQ :: LevelDB Store .......................... SUCCESS [05:24 min]
[INFO] ActiveMQ :: Generic JMS Pool ....................... SUCCESS [ 52.689 s]
[INFO] ActiveMQ :: Pool ................................... SUCCESS [  7.429 s]
[INFO] ActiveMQ :: RA ..................................... SUCCESS [01:36 min]
[INFO] ActiveMQ :: Spring ................................. SUCCESS [ 59.121 s]
[INFO] ActiveMQ :: Console ................................ SUCCESS [  9.055 s]
[INFO] ActiveMQ :: Partition Management ................... SUCCESS [ 20.194 s]
[INFO] ActiveMQ :: Runtime Configuration .................. SUCCESS [08:31 min]
[INFO] ActiveMQ :: Tooling ................................ SUCCESS [  1.425 s]
[INFO] ActiveMQ :: JUnit Rule ............................. SUCCESS [  5.979 s]
[INFO] ActiveMQ :: Unit Tests ............................. FAILURE [  02:55 h]
[INFO] ------------------------------------------------------------------------
[INFO] BUILD FAILURE
[INFO] ------------------------------------------------------------------------
[INFO] Total time: 03:57 h
[INFO] Finished at: 2018-01-04T02:48:46+00:00
[INFO] Final Memory: 125M/1111M
[INFO] ------------------------------------------------------------------------
Waiting for Jenkins to finish collecting data
[ERROR] Failed to execute goal org.apache.maven.plugins:maven-surefire-plugin:2.16:test (default-test) on project activemq-unit-tests: ExecutionException; nested exception is java.util.concurrent.ExecutionException: java.lang.RuntimeException: There was an error in the forked process
[ERROR] java.lang.OutOfMemoryError: Java heap space
[ERROR] -> [Help 1]
org.apache.maven.lifecycle.LifecycleExecutionException: Failed to execute goal org.apache.maven.plugins:maven-surefire-plugin:2.16:test (default-test) on project activemq-unit-tests: ExecutionException; nested exception is java.util.concurrent.ExecutionException: java.lang.RuntimeException: There was an error in the forked process
java.lang.OutOfMemoryError: Java heap space

        at org.apache.maven.lifecycle.internal.MojoExecutor.execute(MojoExecutor.java:212)
        at org.apache.maven.lifecycle.internal.MojoExecutor.execute(MojoExecutor.java:153)
        at org.apache.maven.lifecycle.internal.MojoExecutor.execute(MojoExecutor.java:145)
        at org.apache.maven.lifecycle.internal.LifecycleModuleBuilder.buildProject(LifecycleModuleBuilder.java:116)
        at org.apache.maven.lifecycle.internal.LifecycleModuleBuilder.buildProject(LifecycleModuleBuilder.java:80)
        at org.apache.maven.lifecycle.internal.builder.singlethreaded.SingleThreadedBuilder.build(SingleThreadedBuilder.java:51)
        at org.apache.maven.lifecycle.internal.LifecycleStarter.execute(LifecycleStarter.java:128)
        at org.apache.maven.DefaultMaven.doExecute(DefaultMaven.java:307)
        at org.apache.maven.DefaultMaven.doExecute(DefaultMaven.java:193)
        at org.apache.maven.DefaultMaven.execute(DefaultMaven.java:106)
        at org.jvnet.hudson.maven3.launcher.Maven33Launcher.main(Maven33Launcher.java:129)
        at sun.reflect.NativeMethodAccessorImpl.invoke0(Native Method)
        at sun.reflect.NativeMethodAccessorImpl.invoke(NativeMethodAccessorImpl.java:62)
        at sun.reflect.DelegatingMethodAccessorImpl.invoke(DelegatingMethodAccessorImpl.java:43)
        at java.lang.reflect.Method.invoke(Method.java:498)
        at org.codehaus.plexus.classworlds.launcher.Launcher.launchStandard(Launcher.java:330)
        at org.codehaus.plexus.classworlds.launcher.Launcher.launch(Launcher.java:238)
        at jenkins.maven3.agent.Maven33Main.launch(Maven33Main.java:176)
        at sun.reflect.NativeMethodAccessorImpl.invoke0(Native Method)
        at sun.reflect.NativeMethodAccessorImpl.invoke(NativeMethodAccessorImpl.java:62)
        at sun.reflect.DelegatingMethodAccessorImpl.invoke(DelegatingMethodAccessorImpl.java:43)
        at java.lang.reflect.Method.invoke(Method.java:498)
        at hudson.maven.Maven3Builder.call(Maven3Builder.java:139)
        at hudson.maven.Maven3Builder.call(Maven3Builder.java:70)
        at hudson.remoting.UserRequest.perform(UserRequest.java:207)
        at hudson.remoting.UserRequest.perform(UserRequest.java:53)
        at hudson.remoting.Request$2.run(Request.java:358)
        at hudson.remoting.InterceptingExecutorService$1.call(InterceptingExecutorService.java:72)
        at java.util.concurrent.FutureTask.run(FutureTask.java:266)
        at java.util.concurrent.ThreadPoolExecutor.runWorker(ThreadPoolExecutor.java:1149)
        at java.util.concurrent.ThreadPoolExecutor$Worker.run(ThreadPoolExecutor.java:624)
        at java.lang.Thread.run(Thread.java:748)
Caused by: org.apache.maven.plugin.MojoFailureException: ExecutionException; nested exception is java.util.concurrent.ExecutionException: java.lang.RuntimeException: There was an error in the forked process
java.lang.OutOfMemoryError: Java heap space

        at org.apache.maven.plugin.surefire.SurefirePlugin.assertNoException(SurefirePlugin.java:198)
        at org.apache.maven.plugin.surefire.SurefirePlugin.handleSummary(SurefirePlugin.java:188)
        at org.apache.maven.plugin.surefire.AbstractSurefireMojo.executeAfterPreconditionsChecked(AbstractSurefireMojo.java:852)
        at org.apache.maven.plugin.surefire.AbstractSurefireMojo.execute(AbstractSurefireMojo.java:720)
        at org.apache.maven.plugin.DefaultBuildPluginManager.executeMojo(DefaultBuildPluginManager.java:134)
        at org.apache.maven.lifecycle.internal.MojoExecutor.execute(MojoExecutor.java:207)
        ... 31 more
Caused by: org.apache.maven.surefire.booter.SurefireBooterForkException: ExecutionException; nested exception is java.util.concurrent.ExecutionException: java.lang.RuntimeException: There was an error in the forked process
java.lang.OutOfMemoryError: Java heap space

        at org.apache.maven.plugin.surefire.booterclient.ForkStarter.runSuitesForkPerTestSet(ForkStarter.java:316)
        at org.apache.maven.plugin.surefire.booterclient.ForkStarter.run(ForkStarter.java:169)
        at org.apache.maven.plugin.surefire.AbstractSurefireMojo.executeProvider(AbstractSurefireMojo.java:958)
        at org.apache.maven.plugin.surefire.AbstractSurefireMojo.executeAfterPreconditionsChecked(AbstractSurefireMojo.java:822)
        ... 34 more
Caused by: java.util.concurrent.ExecutionException: java.lang.RuntimeException: There was an error in the forked process
java.lang.OutOfMemoryError: Java heap space

        at java.util.concurrent.FutureTask.report(FutureTask.java:122)
        at java.util.concurrent.FutureTask.get(FutureTask.java:192)
        at org.apache.maven.plugin.surefire.booterclient.ForkStarter.runSuitesForkPerTestSet(ForkStarter.java:300)
        ... 37 more
Caused by: java.lang.RuntimeException: There was an error in the forked process
java.lang.OutOfMemoryError: Java heap space

        at org.apache.maven.plugin.surefire.booterclient.ForkStarter.fork(ForkStarter.java:479)
        at org.apache.maven.plugin.surefire.booterclient.ForkStarter.fork(ForkStarter.java:352)
        at org.apache.maven.plugin.surefire.booterclient.ForkStarter.access$300(ForkStarter.java:85)
        at org.apache.maven.plugin.surefire.booterclient.ForkStarter$2.call(ForkStarter.java:288)
        at org.apache.maven.plugin.surefire.booterclient.ForkStarter$2.call(ForkStarter.java:283)
        ... 4 more
[ERROR]
[ERROR] Re-run Maven using the -X switch to enable full debug logging.
[ERROR]
[ERROR] For more information about the errors and possible solutions, please read the following articles:
[ERROR] [Help 1] http://cwiki.apache.org/confluence/display/MAVEN/MojoFailureException
[ERROR]
[ERROR] After correcting the problems, you can resume the build with the command
[ERROR]   mvn <goals> -rf :activemq-unit-tests
[JENKINS] Archiving <https://builds.apache.org/job/ActiveMQ-Java8-All-UnitTests/ws/activemq-kahadb-store/pom.xml> to org.apache.activemq/activemq-kahadb-store/5.16.0-SNAPSHOT/activemq-kahadb-store-5.16.0-SNAPSHOT.pom
[JENKINS] Archiving <https://builds.apache.org/job/ActiveMQ-Java8-All-UnitTests/ws/activemq-kahadb-store/target/activemq-kahadb-store-5.16.0-SNAPSHOT.jar> to org.apache.activemq/activemq-kahadb-store/5.16.0-SNAPSHOT/activemq-kahadb-store-5.16.0-SNAPSHOT.jar
[Fast Archiver] No artifacts from ActiveMQ-Java8-All-UnitTests » ActiveMQ :: KahaDB Store #779 to compare, so performing full copy of artifacts
[JENKINS] Archiving <https://builds.apache.org/job/ActiveMQ-Java8-All-UnitTests/ws/activemq-unit-tests/pom.xml> to org.apache.activemq/activemq-unit-tests/5.16.0-SNAPSHOT/activemq-unit-tests-5.16.0-SNAPSHOT.pom
[Fast Archiver] Compressed 72.14 KB of artifacts by 44.4% relative to #777
[JENKINS] Archiving <https://builds.apache.org/job/ActiveMQ-Java8-All-UnitTests/ws/activemq-openwire-legacy/pom.xml> to org.apache.activemq/activemq-openwire-legacy/5.16.0-SNAPSHOT/activemq-openwire-legacy-5.16.0-SNAPSHOT.pom
[JENKINS] Archiving <https://builds.apache.org/job/ActiveMQ-Java8-All-UnitTests/ws/activemq-openwire-legacy/target/activemq-openwire-legacy-5.16.0-SNAPSHOT.jar> to org.apache.activemq/activemq-openwire-legacy/5.16.0-SNAPSHOT/activemq-openwire-legacy-5.16.0-SNAPSHOT.jar
[Fast Archiver] No artifacts from ActiveMQ-Java8-All-UnitTests » ActiveMQ :: Openwire Legacy Support #779 to compare, so performing full copy of artifacts
[JENKINS] Archiving <https://builds.apache.org/job/ActiveMQ-Java8-All-UnitTests/ws/activemq-client/pom.xml> to org.apache.activemq/activemq-client/5.16.0-SNAPSHOT/activemq-client-5.16.0-SNAPSHOT.pom
[JENKINS] Archiving <https://builds.apache.org/job/ActiveMQ-Java8-All-UnitTests/ws/activemq-client/target/activemq-client-5.16.0-SNAPSHOT.jar> to org.apache.activemq/activemq-client/5.16.0-SNAPSHOT/activemq-client-5.16.0-SNAPSHOT.jar
[Fast Archiver] No artifacts from ActiveMQ-Java8-All-UnitTests » ActiveMQ :: Client #779 to compare, so performing full copy of artifacts
[JENKINS] Archiving <https://builds.apache.org/job/ActiveMQ-Java8-All-UnitTests/ws/activemq-tooling/activemq-junit/pom.xml> to org.apache.activemq.tooling/activemq-junit/5.16.0-SNAPSHOT/activemq-junit-5.16.0-SNAPSHOT.pom
[JENKINS] Archiving <https://builds.apache.org/job/ActiveMQ-Java8-All-UnitTests/ws/activemq-tooling/activemq-junit/target/activemq-junit-5.16.0-SNAPSHOT.jar> to org.apache.activemq.tooling/activemq-junit/5.16.0-SNAPSHOT/activemq-junit-5.16.0-SNAPSHOT.jar
[Fast Archiver] No artifacts from ActiveMQ-Java8-All-UnitTests » ActiveMQ :: JUnit Rule #779 to compare, so performing full copy of artifacts
[JENKINS] Archiving <https://builds.apache.org/job/ActiveMQ-Java8-All-UnitTests/ws/activemq-tooling/pom.xml> to org.apache.activemq.tooling/activemq-tooling/5.16.0-SNAPSHOT/activemq-tooling-5.16.0-SNAPSHOT.pom
[Fast Archiver] No artifacts from ActiveMQ-Java8-All-UnitTests » ActiveMQ :: Tooling #779 to compare, so performing full copy of artifacts
[JENKINS] Archiving <https://builds.apache.org/job/ActiveMQ-Java8-All-UnitTests/ws/activemq-jms-pool/pom.xml> to org.apache.activemq/activemq-jms-pool/5.16.0-SNAPSHOT/activemq-jms-pool-5.16.0-SNAPSHOT.pom
[JENKINS] Archiving <https://builds.apache.org/job/ActiveMQ-Java8-All-UnitTests/ws/activemq-jms-pool/target/activemq-jms-pool-5.16.0-SNAPSHOT.jar> to org.apache.activemq/activemq-jms-pool/5.16.0-SNAPSHOT/activemq-jms-pool-5.16.0-SNAPSHOT.jar
[Fast Archiver] No artifacts from ActiveMQ-Java8-All-UnitTests » ActiveMQ :: Generic JMS Pool #779 to compare, so performing full copy of artifacts
[JENKINS] Archiving <https://builds.apache.org/job/ActiveMQ-Java8-All-UnitTests/ws/activemq-pool/pom.xml> to org.apache.activemq/activemq-pool/5.16.0-SNAPSHOT/activemq-pool-5.16.0-SNAPSHOT.pom
[JENKINS] Archiving <https://builds.apache.org/job/ActiveMQ-Java8-All-UnitTests/ws/activemq-pool/target/activemq-pool-5.16.0-SNAPSHOT.jar> to org.apache.activemq/activemq-pool/5.16.0-SNAPSHOT/activemq-pool-5.16.0-SNAPSHOT.jar
[Fast Archiver] No artifacts from ActiveMQ-Java8-All-UnitTests » ActiveMQ :: Pool #779 to compare, so performing full copy of artifacts
[JENKINS] Archiving <https://builds.apache.org/job/ActiveMQ-Java8-All-UnitTests/ws/activemq-jdbc-store/pom.xml> to org.apache.activemq/activemq-jdbc-store/5.16.0-SNAPSHOT/activemq-jdbc-store-5.16.0-SNAPSHOT.pom
[JENKINS] Archiving <https://builds.apache.org/job/ActiveMQ-Java8-All-UnitTests/ws/activemq-jdbc-store/target/activemq-jdbc-store-5.16.0-SNAPSHOT.jar> to org.apache.activemq/activemq-jdbc-store/5.16.0-SNAPSHOT/activemq-jdbc-store-5.16.0-SNAPSHOT.jar
[Fast Archiver] No artifacts from ActiveMQ-Java8-All-UnitTests » ActiveMQ :: JDBC Store #779 to compare, so performing full copy of artifacts
[JENKINS] Archiving <https://builds.apache.org/job/ActiveMQ-Java8-All-UnitTests/ws/activemq-runtime-config/pom.xml> to org.apache.activemq/activemq-runtime-config/5.16.0-SNAPSHOT/activemq-runtime-config-5.16.0-SNAPSHOT.pom
[JENKINS] Archiving <https://builds.apache.org/job/ActiveMQ-Java8-All-UnitTests/ws/activemq-runtime-config/target/activemq-runtime-config-5.16.0-SNAPSHOT.jar> to org.apache.activemq/activemq-runtime-config/5.16.0-SNAPSHOT/activemq-runtime-config-5.16.0-SNAPSHOT.jar
[Fast Archiver] No artifacts from ActiveMQ-Java8-All-UnitTests » ActiveMQ :: Runtime Configuration #779 to compare, so performing full copy of artifacts
[JENKINS] Archiving <https://builds.apache.org/job/ActiveMQ-Java8-All-UnitTests/ws/pom.xml> to org.apache.activemq/activemq-parent/5.16.0-SNAPSHOT/activemq-parent-5.16.0-SNAPSHOT.pom
[Fast Archiver] No artifacts from ActiveMQ-Java8-All-UnitTests » ActiveMQ #779 to compare, so performing full copy of artifacts
[JENKINS] Archiving <https://builds.apache.org/job/ActiveMQ-Java8-All-UnitTests/ws/activemq-stomp/pom.xml> to org.apache.activemq/activemq-stomp/5.16.0-SNAPSHOT/activemq-stomp-5.16.0-SNAPSHOT.pom
[JENKINS] Archiving <https://builds.apache.org/job/ActiveMQ-Java8-All-UnitTests/ws/activemq-stomp/target/activemq-stomp-5.16.0-SNAPSHOT.jar> to org.apache.activemq/activemq-stomp/5.16.0-SNAPSHOT/activemq-stomp-5.16.0-SNAPSHOT.jar
[Fast Archiver] No artifacts from ActiveMQ-Java8-All-UnitTests » ActiveMQ :: STOMP Protocol #779 to compare, so performing full copy of artifacts
[JENKINS] Archiving <https://builds.apache.org/job/ActiveMQ-Java8-All-UnitTests/ws/activemq-broker/pom.xml> to org.apache.activemq/activemq-broker/5.16.0-SNAPSHOT/activemq-broker-5.16.0-SNAPSHOT.pom
[JENKINS] Archiving <https://builds.apache.org/job/ActiveMQ-Java8-All-UnitTests/ws/activemq-broker/target/activemq-broker-5.16.0-SNAPSHOT.jar> to org.apache.activemq/activemq-broker/5.16.0-SNAPSHOT/activemq-broker-5.16.0-SNAPSHOT.jar
[JENKINS] Archiving <https://builds.apache.org/job/ActiveMQ-Java8-All-UnitTests/ws/activemq-broker/target/activemq-broker-5.16.0-SNAPSHOT-tests.jar> to org.apache.activemq/activemq-broker/5.16.0-SNAPSHOT/activemq-broker-5.16.0-SNAPSHOT-tests.jar
[Fast Archiver] No artifacts from ActiveMQ-Java8-All-UnitTests » ActiveMQ :: Broker #779 to compare, so performing full copy of artifacts
[JENKINS] Archiving <https://builds.apache.org/job/ActiveMQ-Java8-All-UnitTests/ws/activemq-mqtt/pom.xml> to org.apache.activemq/activemq-mqtt/5.16.0-SNAPSHOT/activemq-mqtt-5.16.0-SNAPSHOT.pom
[JENKINS] Archiving <https://builds.apache.org/job/ActiveMQ-Java8-All-UnitTests/ws/activemq-mqtt/target/activemq-mqtt-5.16.0-SNAPSHOT.jar> to org.apache.activemq/activemq-mqtt/5.16.0-SNAPSHOT/activemq-mqtt-5.16.0-SNAPSHOT.jar
[Fast Archiver] No artifacts from ActiveMQ-Java8-All-UnitTests » ActiveMQ :: MQTT Protocol #779 to compare, so performing full copy of artifacts
[JENKINS] Archiving <https://builds.apache.org/job/ActiveMQ-Java8-All-UnitTests/ws/activemq-jaas/pom.xml> to org.apache.activemq/activemq-jaas/5.16.0-SNAPSHOT/activemq-jaas-5.16.0-SNAPSHOT.pom
[JENKINS] Archiving <https://builds.apache.org/job/ActiveMQ-Java8-All-UnitTests/ws/activemq-jaas/target/activemq-jaas-5.16.0-SNAPSHOT.jar> to org.apache.activemq/activemq-jaas/5.16.0-SNAPSHOT/activemq-jaas-5.16.0-SNAPSHOT.jar
[Fast Archiver] No artifacts from ActiveMQ-Java8-All-UnitTests » ActiveMQ :: JAAS #779 to compare, so performing full copy of artifacts
[JENKINS] Archiving <https://builds.apache.org/job/ActiveMQ-Java8-All-UnitTests/ws/activemq-ra/pom.xml> to org.apache.activemq/activemq-ra/5.16.0-SNAPSHOT/activemq-ra-5.16.0-SNAPSHOT.pom
[JENKINS] Archiving <https://builds.apache.org/job/ActiveMQ-Java8-All-UnitTests/ws/activemq-ra/target/activemq-ra-5.16.0-SNAPSHOT.jar> to org.apache.activemq/activemq-ra/5.16.0-SNAPSHOT/activemq-ra-5.16.0-SNAPSHOT.jar
[JENKINS] Archiving <https://builds.apache.org/job/ActiveMQ-Java8-All-UnitTests/ws/activemq-ra/target/xbean/activemq-ra.xsd> to org.apache.activemq/activemq-ra/5.16.0-SNAPSHOT/activemq-ra-5.16.0-SNAPSHOT.xsd
[JENKINS] Archiving <https://builds.apache.org/job/ActiveMQ-Java8-All-UnitTests/ws/activemq-ra/target/xbean/activemq-ra.xsd.html> to org.apache.activemq/activemq-ra/5.16.0-SNAPSHOT/activemq-ra-5.16.0-SNAPSHOT-schema.html
[JENKINS] Archiving <https://builds.apache.org/job/ActiveMQ-Java8-All-UnitTests/ws/activemq-ra/target/xbean/activemq-ra.xsd.html> to org.apache.activemq/activemq-ra/5.16.0-SNAPSHOT/activemq-ra-5.16.0-SNAPSHOT.xsd.html
[Fast Archiver] No artifacts from ActiveMQ-Java8-All-UnitTests » ActiveMQ :: RA #779 to compare, so performing full copy of artifacts
[JENKINS] Archiving <https://builds.apache.org/job/ActiveMQ-Java8-All-UnitTests/ws/activemq-partition/pom.xml> to org.apache.activemq/activemq-partition/5.16.0-SNAPSHOT/activemq-partition-5.16.0-SNAPSHOT.pom
[JENKINS] Archiving <https://builds.apache.org/job/ActiveMQ-Java8-All-UnitTests/ws/activemq-partition/target/activemq-partition-5.16.0-SNAPSHOT.jar> to org.apache.activemq/activemq-partition/5.16.0-SNAPSHOT/activemq-partition-5.16.0-SNAPSHOT.jar
[Fast Archiver] No artifacts from ActiveMQ-Java8-All-UnitTests » ActiveMQ :: Partition Management #779 to compare, so performing full copy of artifacts
[JENKINS] Archiving <https://builds.apache.org/job/ActiveMQ-Java8-All-UnitTests/ws/activemq-console/pom.xml> to org.apache.activemq/activemq-console/5.16.0-SNAPSHOT/activemq-console-5.16.0-SNAPSHOT.pom
[JENKINS] Archiving <https://builds.apache.org/job/ActiveMQ-Java8-All-UnitTests/ws/activemq-console/target/activemq-console-5.16.0-SNAPSHOT.jar> to org.apache.activemq/activemq-console/5.16.0-SNAPSHOT/activemq-console-5.16.0-SNAPSHOT.jar
[Fast Archiver] No artifacts from ActiveMQ-Java8-All-UnitTests » ActiveMQ :: Console #779 to compare, so performing full copy of artifacts
[JENKINS] Archiving <https://builds.apache.org/job/ActiveMQ-Java8-All-UnitTests/ws/activemq-spring/pom.xml> to org.apache.activemq/activemq-spring/5.16.0-SNAPSHOT/activemq-spring-5.16.0-SNAPSHOT.pom
[JENKINS] Archiving <https://builds.apache.org/job/ActiveMQ-Java8-All-UnitTests/ws/activemq-spring/target/activemq-spring-5.16.0-SNAPSHOT.jar> to org.apache.activemq/activemq-spring/5.16.0-SNAPSHOT/activemq-spring-5.16.0-SNAPSHOT.jar
[JENKINS] Archiving <https://builds.apache.org/job/ActiveMQ-Java8-All-UnitTests/ws/activemq-spring/target/classes/activemq.xsd> to org.apache.activemq/activemq-spring/5.16.0-SNAPSHOT/activemq-spring-5.16.0-SNAPSHOT.xsd
[JENKINS] Archiving <https://builds.apache.org/job/ActiveMQ-Java8-All-UnitTests/ws/activemq-spring/target/classes/activemq.xsd.html> to org.apache.activemq/activemq-spring/5.16.0-SNAPSHOT/activemq-spring-5.16.0-SNAPSHOT-schema.html
[Fast Archiver] No artifacts from ActiveMQ-Java8-All-UnitTests » ActiveMQ :: Spring #779 to compare, so performing full copy of artifacts
[JENKINS] Archiving <https://builds.apache.org/job/ActiveMQ-Java8-All-UnitTests/ws/activemq-leveldb-store/pom.xml> to org.apache.activemq/activemq-leveldb-store/5.16.0-SNAPSHOT/activemq-leveldb-store-5.16.0-SNAPSHOT.pom
[JENKINS] Archiving <https://builds.apache.org/job/ActiveMQ-Java8-All-UnitTests/ws/activemq-leveldb-store/target/activemq-leveldb-store-5.16.0-SNAPSHOT.jar> to org.apache.activemq/activemq-leveldb-store/5.16.0-SNAPSHOT/activemq-leveldb-store-5.16.0-SNAPSHOT.jar
[Fast Archiver] No artifacts from ActiveMQ-Java8-All-UnitTests » ActiveMQ :: LevelDB Store #779 to compare, so performing full copy of artifacts
[locks-and-latches] Releasing all the locks
[locks-and-latches] All the locks released
channel stopped
Reply | Threaded
Open this post in threaded view
|

Build failed in Jenkins: ActiveMQ-Java8-All-UnitTests #782

Apache Jenkins Server-2
See <https://builds.apache.org/job/ActiveMQ-Java8-All-UnitTests/782/display/redirect?page=changes>

Changes:

[christopher.l.shannon] AMQ-6884 - Replacing printStackTrace() with logging statement

------------------------------------------
[...truncated 67.77 KB...]
[INFO] Compiling 25 source files to <https://builds.apache.org/job/ActiveMQ-Java8-All-UnitTests/ws/activemq-stomp/target/classes>
[INFO]
[INFO] --- maven-resources-plugin:2.7:testResources (default-testResources) @ activemq-stomp ---
[INFO] Using 'UTF-8' encoding to copy filtered resources.
[INFO] Copying 6 resources
[INFO] Copying 3 resources
[INFO]
[INFO] --- maven-compiler-plugin:3.3:testCompile (default-testCompile) @ activemq-stomp ---
[INFO] Changes detected - recompiling the module!
[INFO] Compiling 43 source files to <https://builds.apache.org/job/ActiveMQ-Java8-All-UnitTests/ws/activemq-stomp/target/test-classes>
[INFO]
[INFO] --- maven-surefire-plugin:2.16:test (default-test) @ activemq-stomp ---
[INFO] Surefire report directory: <https://builds.apache.org/job/ActiveMQ-Java8-All-UnitTests/ws/activemq-stomp/target/surefire-reports>

-------------------------------------------------------
 T E S T S
-------------------------------------------------------

-------------------------------------------------------
 T E S T S
-------------------------------------------------------
Running org.apache.activemq.transport.stomp.ConnectTest
Tests run: 3, Failures: 0, Errors: 0, Skipped: 0, Time elapsed: 15.275 sec - in org.apache.activemq.transport.stomp.ConnectTest
Running org.apache.activemq.transport.stomp.LegacyFrameTranslatorTest
Tests run: 10, Failures: 0, Errors: 0, Skipped: 0, Time elapsed: 0.489 sec - in org.apache.activemq.transport.stomp.LegacyFrameTranslatorTest
Running org.apache.activemq.transport.stomp.Stomp11NIOSSLTest
Tests run: 31, Failures: 0, Errors: 0, Skipped: 0, Time elapsed: 63.515 sec - in org.apache.activemq.transport.stomp.Stomp11NIOSSLTest
Running org.apache.activemq.transport.stomp.Stomp11NIOTest
Tests run: 31, Failures: 0, Errors: 0, Skipped: 0, Time elapsed: 60.167 sec - in org.apache.activemq.transport.stomp.Stomp11NIOTest
Running org.apache.activemq.transport.stomp.Stomp11SslAuthTest
Tests run: 31, Failures: 0, Errors: 0, Skipped: 0, Time elapsed: 65.656 sec - in org.apache.activemq.transport.stomp.Stomp11SslAuthTest
Running org.apache.activemq.transport.stomp.Stomp11Test
Tests run: 31, Failures: 0, Errors: 0, Skipped: 0, Time elapsed: 62.033 sec - in org.apache.activemq.transport.stomp.Stomp11Test
Running org.apache.activemq.transport.stomp.Stomp12NIOSSLTest
Tests run: 9, Failures: 0, Errors: 0, Skipped: 0, Time elapsed: 2.948 sec - in org.apache.activemq.transport.stomp.Stomp12NIOSSLTest
Running org.apache.activemq.transport.stomp.Stomp12NIOTest
Tests run: 9, Failures: 0, Errors: 0, Skipped: 0, Time elapsed: 1.753 sec - in org.apache.activemq.transport.stomp.Stomp12NIOTest
Running org.apache.activemq.transport.stomp.Stomp12SslAuthTest
Tests run: 9, Failures: 0, Errors: 0, Skipped: 0, Time elapsed: 2.999 sec - in org.apache.activemq.transport.stomp.Stomp12SslAuthTest
Running org.apache.activemq.transport.stomp.Stomp12Test
Tests run: 9, Failures: 0, Errors: 0, Skipped: 0, Time elapsed: 1.665 sec - in org.apache.activemq.transport.stomp.Stomp12Test
Running org.apache.activemq.transport.stomp.StompAdvisoryTest
Tests run: 11, Failures: 0, Errors: 0, Skipped: 0, Time elapsed: 3.796 sec - in org.apache.activemq.transport.stomp.StompAdvisoryTest
Running org.apache.activemq.transport.stomp.StompCompositeDestinationTest
Tests run: 6, Failures: 0, Errors: 0, Skipped: 0, Time elapsed: 1.825 sec - in org.apache.activemq.transport.stomp.StompCompositeDestinationTest
Running org.apache.activemq.transport.stomp.StompConnectTimeoutTest
Tests run: 4, Failures: 0, Errors: 0, Skipped: 0, Time elapsed: 6.64 sec - in org.apache.activemq.transport.stomp.StompConnectTimeoutTest
Running org.apache.activemq.transport.stomp.StompFrameTest
Tests run: 1, Failures: 0, Errors: 0, Skipped: 0, Time elapsed: 0.061 sec - in org.apache.activemq.transport.stomp.StompFrameTest
Running org.apache.activemq.transport.stomp.StompInactivityMonitorTest
Tests run: 4, Failures: 0, Errors: 0, Skipped: 0, Time elapsed: 14.732 sec - in org.apache.activemq.transport.stomp.StompInactivityMonitorTest
Running org.apache.activemq.transport.stomp.StompLoadTest
Tests run: 1, Failures: 0, Errors: 0, Skipped: 0, Time elapsed: 12.594 sec - in org.apache.activemq.transport.stomp.StompLoadTest
Running org.apache.activemq.transport.stomp.StompMaxDataSizeTest
Tests run: 4, Failures: 0, Errors: 0, Skipped: 0, Time elapsed: 1.85 sec - in org.apache.activemq.transport.stomp.StompMaxDataSizeTest
Running org.apache.activemq.transport.stomp.StompMaxFrameSizeTest
Tests run: 60, Failures: 0, Errors: 0, Skipped: 40, Time elapsed: 3.93 sec - in org.apache.activemq.transport.stomp.StompMaxFrameSizeTest
Running org.apache.activemq.transport.stomp.StompMissingMessageTest
Tests run: 2, Failures: 0, Errors: 0, Skipped: 0, Time elapsed: 45.784 sec - in org.apache.activemq.transport.stomp.StompMissingMessageTest
Running org.apache.activemq.transport.stomp.StompNIOLoadTest
Tests run: 1, Failures: 0, Errors: 0, Skipped: 0, Time elapsed: 12.779 sec - in org.apache.activemq.transport.stomp.StompNIOLoadTest
Running org.apache.activemq.transport.stomp.StompNIOSSLLargeMessageTest
Tests run: 1, Failures: 0, Errors: 0, Skipped: 0, Time elapsed: 6.782 sec - in org.apache.activemq.transport.stomp.StompNIOSSLLargeMessageTest
Running org.apache.activemq.transport.stomp.StompNIOSSLTest
Tests run: 76, Failures: 0, Errors: 0, Skipped: 0, Time elapsed: 31.316 sec - in org.apache.activemq.transport.stomp.StompNIOSSLTest
Running org.apache.activemq.transport.stomp.StompNIOTest
Tests run: 76, Failures: 0, Errors: 0, Skipped: 0, Time elapsed: 24.096 sec - in org.apache.activemq.transport.stomp.StompNIOTest
Running org.apache.activemq.transport.stomp.StompPrefetchTest
Tests run: 4, Failures: 0, Errors: 0, Skipped: 0, Time elapsed: 2.327 sec - in org.apache.activemq.transport.stomp.StompPrefetchTest
Running org.apache.activemq.transport.stomp.StompSSLLoadTest
Tests run: 1, Failures: 0, Errors: 0, Skipped: 0, Time elapsed: 71.612 sec - in org.apache.activemq.transport.stomp.StompSSLLoadTest
Running org.apache.activemq.transport.stomp.StompSslAuthTest
Tests run: 76, Failures: 0, Errors: 0, Skipped: 0, Time elapsed: 41.098 sec - in org.apache.activemq.transport.stomp.StompSslAuthTest
Running org.apache.activemq.transport.stomp.StompSslTest
Tests run: 76, Failures: 0, Errors: 0, Skipped: 0, Time elapsed: 34.025 sec - in org.apache.activemq.transport.stomp.StompSslTest
Running org.apache.activemq.transport.stomp.StompSubscriptionRemoveTest
Tests run: 1, Failures: 0, Errors: 0, Skipped: 0, Time elapsed: 3.64 sec - in org.apache.activemq.transport.stomp.StompSubscriptionRemoveTest
Running org.apache.activemq.transport.stomp.StompTelnetTest
Tests run: 2, Failures: 0, Errors: 0, Skipped: 0, Time elapsed: 0.963 sec - in org.apache.activemq.transport.stomp.StompTelnetTest
Running org.apache.activemq.transport.stomp.StompTest
Tests run: 76, Failures: 0, Errors: 0, Skipped: 0, Time elapsed: 24.331 sec - in org.apache.activemq.transport.stomp.StompTest
Running org.apache.activemq.transport.stomp.StompTimeStampingBrokerPluginTest
Tests run: 1, Failures: 0, Errors: 0, Skipped: 0, Time elapsed: 13.548 sec - in org.apache.activemq.transport.stomp.StompTimeStampingBrokerPluginTest
Running org.apache.activemq.transport.stomp.StompVirtualTopicTest
Tests run: 1, Failures: 0, Errors: 0, Skipped: 0, Time elapsed: 19.138 sec - in org.apache.activemq.transport.stomp.StompVirtualTopicTest
Running org.apache.activemq.transport.stomp.auto.AutoStompConnectTimeoutTest
Tests run: 4, Failures: 0, Errors: 0, Skipped: 0, Time elapsed: 8.147 sec - in org.apache.activemq.transport.stomp.auto.AutoStompConnectTimeoutTest
Running org.apache.activemq.transport.stomp.auto.StompAutoNioSslTest
Tests run: 76, Failures: 0, Errors: 0, Skipped: 0, Time elapsed: 31.238 sec - in org.apache.activemq.transport.stomp.auto.StompAutoNioSslTest
Running org.apache.activemq.transport.stomp.auto.StompAutoNioTest
Tests run: 76, Failures: 0, Errors: 0, Skipped: 0, Time elapsed: 24.486 sec - in org.apache.activemq.transport.stomp.auto.StompAutoNioTest
Running org.apache.activemq.transport.stomp.auto.StompAutoSslAuthTest
Tests run: 2, Failures: 0, Errors: 0, Skipped: 0, Time elapsed: 1.536 sec - in org.apache.activemq.transport.stomp.auto.StompAutoSslAuthTest
Running org.apache.activemq.transport.stomp.auto.StompAutoSslTest
Tests run: 76, Failures: 0, Errors: 0, Skipped: 0, Time elapsed: 34.273 sec - in org.apache.activemq.transport.stomp.auto.StompAutoSslTest
Running org.apache.activemq.transport.stomp.auto.StompAutoTest
Tests run: 76, Failures: 0, Errors: 0, Skipped: 0, Time elapsed: 23.855 sec - in org.apache.activemq.transport.stomp.auto.StompAutoTest

Results :

Tests run: 968, Failures: 0, Errors: 0, Skipped: 40

[JENKINS] Recording test results
[INFO]
[INFO] --- maven-jar-plugin:2.4:jar (default-jar) @ activemq-stomp ---
[INFO] Building jar: <https://builds.apache.org/job/ActiveMQ-Java8-All-UnitTests/ws/activemq-stomp/target/activemq-stomp-5.16.0-SNAPSHOT.jar>
[INFO]
[INFO] --- maven-site-plugin:3.5.1:attach-descriptor (attach-descriptor) @ activemq-stomp ---
[INFO]
[INFO] --- ianal-maven-plugin:1.0-alpha-1:verify-legal-files (default) @ activemq-stomp ---
[INFO] Checking legal files in: activemq-stomp-5.16.0-SNAPSHOT.jar
[INFO]
[INFO] --- maven-install-plugin:2.5.2:install (default-install) @ activemq-stomp ---
[INFO] Installing <https://builds.apache.org/job/ActiveMQ-Java8-All-UnitTests/ws/activemq-stomp/target/activemq-stomp-5.16.0-SNAPSHOT.jar> to /home/jenkins/jenkins-slave/maven-repositories/1/org/apache/activemq/activemq-stomp/5.16.0-SNAPSHOT/activemq-stomp-5.16.0-SNAPSHOT.jar
[INFO] Installing <https://builds.apache.org/job/ActiveMQ-Java8-All-UnitTests/ws/activemq-stomp/pom.xml> to /home/jenkins/jenkins-slave/maven-repositories/1/org/apache/activemq/activemq-stomp/5.16.0-SNAPSHOT/activemq-stomp-5.16.0-SNAPSHOT.pom
[INFO]                                                                        
[INFO] ------------------------------------------------------------------------
[INFO] Building ActiveMQ :: MQTT Protocol 5.16.0-SNAPSHOT
[INFO] ------------------------------------------------------------------------
[INFO]
[INFO] --- maven-clean-plugin:3.0.0:clean (default-clean) @ activemq-mqtt ---
[INFO] Deleting <https://builds.apache.org/job/ActiveMQ-Java8-All-UnitTests/ws/activemq-mqtt/target>
[INFO]
[INFO] --- maven-bundle-plugin:2.3.7:cleanVersions (cleanVersions) @ activemq-mqtt ---
[INFO]
[INFO] --- activemq-protobuf:1.1:compile (default) @ activemq-mqtt ---
[WARNING] No proto files found in directory: <https://builds.apache.org/job/ActiveMQ-Java8-All-UnitTests/ws/activemq-mqtt/src/main/proto>
[INFO]
[INFO] --- maven-remote-resources-plugin:1.5:process (process-resource-bundles) @ activemq-mqtt ---
[INFO]
[INFO] --- maven-resources-plugin:2.7:resources (default-resources) @ activemq-mqtt ---
[INFO] Using 'UTF-8' encoding to copy filtered resources.
[INFO] Copying 7 resources
[INFO] skip non existing resourceDirectory <https://builds.apache.org/job/ActiveMQ-Java8-All-UnitTests/ws/activemq-mqtt/src/main/filtered-resources>
[INFO] Copying 3 resources
[INFO]
[INFO] --- maven-compiler-plugin:3.3:compile (default-compile) @ activemq-mqtt ---
[INFO] Changes detected - recompiling the module!
[INFO] Compiling 22 source files to <https://builds.apache.org/job/ActiveMQ-Java8-All-UnitTests/ws/activemq-mqtt/target/classes>
[INFO]
[INFO] --- maven-resources-plugin:2.7:testResources (default-testResources) @ activemq-mqtt ---
[INFO] Using 'UTF-8' encoding to copy filtered resources.
[INFO] Copying 3 resources
[INFO] Copying 3 resources
[INFO]
[INFO] --- maven-compiler-plugin:3.3:testCompile (default-testCompile) @ activemq-mqtt ---
[INFO] Changes detected - recompiling the module!
[INFO] Compiling 29 source files to <https://builds.apache.org/job/ActiveMQ-Java8-All-UnitTests/ws/activemq-mqtt/target/test-classes>
[INFO] <https://builds.apache.org/job/ActiveMQ-Java8-All-UnitTests/ws/activemq-mqtt/src/test/java/org/apache/activemq/transport/mqtt/PahoMQTTTest.java>: <https://builds.apache.org/job/ActiveMQ-Java8-All-UnitTests/ws/activemq-mqtt/src/test/java/org/apache/activemq/transport/mqtt/PahoMQTTTest.java> uses unchecked or unsafe operations.
[INFO] <https://builds.apache.org/job/ActiveMQ-Java8-All-UnitTests/ws/activemq-mqtt/src/test/java/org/apache/activemq/transport/mqtt/PahoMQTTTest.java>: Recompile with -Xlint:unchecked for details.
[INFO]
[INFO] --- maven-surefire-plugin:2.16:test (default-test) @ activemq-mqtt ---
[INFO] Surefire report directory: <https://builds.apache.org/job/ActiveMQ-Java8-All-UnitTests/ws/activemq-mqtt/target/surefire-reports>

-------------------------------------------------------
 T E S T S
-------------------------------------------------------

-------------------------------------------------------
 T E S T S
-------------------------------------------------------
Running org.apache.activemq.transport.mqtt.MQTTAuthTest
Tests run: 28, Failures: 0, Errors: 0, Skipped: 0, Time elapsed: 12.003 sec - in org.apache.activemq.transport.mqtt.MQTTAuthTest
Running org.apache.activemq.transport.mqtt.MQTTCodecTest
Tests run: 7, Failures: 0, Errors: 0, Skipped: 0, Time elapsed: 1.334 sec - in org.apache.activemq.transport.mqtt.MQTTCodecTest
Running org.apache.activemq.transport.mqtt.MQTTCompositeQueueRetainedTest
Tests run: 1, Failures: 0, Errors: 0, Skipped: 0, Time elapsed: 7.013 sec - in org.apache.activemq.transport.mqtt.MQTTCompositeQueueRetainedTest
Running org.apache.activemq.transport.mqtt.MQTTConnectTest
Tests run: 8, Failures: 0, Errors: 0, Skipped: 0, Time elapsed: 7.607 sec - in org.apache.activemq.transport.mqtt.MQTTConnectTest
Running org.apache.activemq.transport.mqtt.MQTTMaxFrameSizeTest
Tests run: 8, Failures: 0, Errors: 0, Skipped: 0, Time elapsed: 1.609 sec - in org.apache.activemq.transport.mqtt.MQTTMaxFrameSizeTest
Running org.apache.activemq.transport.mqtt.MQTTNIOSSLTest
Tests run: 55, Failures: 1, Errors: 0, Skipped: 0, Time elapsed: 132.673 sec <<< FAILURE! - in org.apache.activemq.transport.mqtt.MQTTNIOSSLTest
testReceiveMessageSentWhileOffline(org.apache.activemq.transport.mqtt.MQTTNIOSSLTest)  Time elapsed: 0.445 sec  <<< FAILURE!
java.lang.AssertionError: Should have received 202 messages expected:<202> but was:<16>
        at org.junit.Assert.fail(Assert.java:88)
        at org.junit.Assert.failNotEquals(Assert.java:834)
        at org.junit.Assert.assertEquals(Assert.java:645)
        at org.apache.activemq.transport.mqtt.MQTTTest.testReceiveMessageSentWhileOffline(MQTTTest.java:1698)
        at sun.reflect.NativeMethodAccessorImpl.invoke0(Native Method)
        at sun.reflect.NativeMethodAccessorImpl.invoke(NativeMethodAccessorImpl.java:62)
        at sun.reflect.DelegatingMethodAccessorImpl.invoke(DelegatingMethodAccessorImpl.java:43)
        at java.lang.reflect.Method.invoke(Method.java:498)
        at org.junit.runners.model.FrameworkMethod$1.runReflectiveCall(FrameworkMethod.java:50)
        at org.junit.internal.runners.model.ReflectiveCallable.run(ReflectiveCallable.java:12)
        at org.junit.runners.model.FrameworkMethod.invokeExplosively(FrameworkMethod.java:47)
        at org.junit.internal.runners.statements.InvokeMethod.evaluate(InvokeMethod.java:17)
        at org.junit.internal.runners.statements.FailOnTimeout$CallableStatement.call(FailOnTimeout.java:298)
        at org.junit.internal.runners.statements.FailOnTimeout$CallableStatement.call(FailOnTimeout.java:292)
        at java.util.concurrent.FutureTask.run(FutureTask.java:266)
        at java.lang.Thread.run(Thread.java:748)

Running org.apache.activemq.transport.mqtt.MQTTNIOTest
Tests run: 55, Failures: 0, Errors: 0, Skipped: 0, Time elapsed: 111.933 sec - in org.apache.activemq.transport.mqtt.MQTTNIOTest
Running org.apache.activemq.transport.mqtt.MQTTOverlapedSubscriptionsTest
Tests run: 1, Failures: 0, Errors: 0, Skipped: 0, Time elapsed: 1.201 sec - in org.apache.activemq.transport.mqtt.MQTTOverlapedSubscriptionsTest
Running org.apache.activemq.transport.mqtt.MQTTPingReqTest
Tests run: 4, Failures: 0, Errors: 0, Skipped: 0, Time elapsed: 1.292 sec - in org.apache.activemq.transport.mqtt.MQTTPingReqTest
Running org.apache.activemq.transport.mqtt.MQTTProtocolConverterTest
Tests run: 2, Failures: 0, Errors: 0, Skipped: 0, Time elapsed: 0.545 sec - in org.apache.activemq.transport.mqtt.MQTTProtocolConverterTest
Running org.apache.activemq.transport.mqtt.MQTTSSLTest
Tests run: 55, Failures: 0, Errors: 0, Skipped: 0, Time elapsed: 123.034 sec - in org.apache.activemq.transport.mqtt.MQTTSSLTest
Running org.apache.activemq.transport.mqtt.MQTTSubscriptionRecoveryTest
Tests run: 2, Failures: 0, Errors: 0, Skipped: 0, Time elapsed: 4.293 sec - in org.apache.activemq.transport.mqtt.MQTTSubscriptionRecoveryTest
Running org.apache.activemq.transport.mqtt.MQTTTest
Tests run: 55, Failures: 0, Errors: 0, Skipped: 0, Time elapsed: 112.913 sec - in org.apache.activemq.transport.mqtt.MQTTTest
Running org.apache.activemq.transport.mqtt.MQTTVirtualTopicSubscriptionsTest
Tests run: 57, Failures: 0, Errors: 0, Skipped: 0, Time elapsed: 114.355 sec - in org.apache.activemq.transport.mqtt.MQTTVirtualTopicSubscriptionsTest
Running org.apache.activemq.transport.mqtt.MQTTWillTest
Tests run: 2, Failures: 0, Errors: 0, Skipped: 0, Time elapsed: 3.094 sec - in org.apache.activemq.transport.mqtt.MQTTWillTest
Running org.apache.activemq.transport.mqtt.PahoMQTTNIOTest
Tests run: 7, Failures: 0, Errors: 0, Skipped: 0, Time elapsed: 23.928 sec - in org.apache.activemq.transport.mqtt.PahoMQTTNIOTest
Running org.apache.activemq.transport.mqtt.PahoMQTTTest
Tests run: 7, Failures: 0, Errors: 0, Skipped: 0, Time elapsed: 23.861 sec - in org.apache.activemq.transport.mqtt.PahoMQTTTest
Running org.apache.activemq.transport.mqtt.PahoVirtualTopicMQTTTest
Tests run: 8, Failures: 0, Errors: 0, Skipped: 0, Time elapsed: 23.999 sec - in org.apache.activemq.transport.mqtt.PahoVirtualTopicMQTTTest
Running org.apache.activemq.transport.mqtt.auto.MQTTAutoNioSslTest
[locks-and-latches] Releasing all the locks
[locks-and-latches] All the locks released
Build was aborted
Aborted by gtully
channel stopped
FATAL: null
java.nio.channels.ClosedChannelException
        at sun.nio.ch.FileChannelImpl.ensureOpen(FileChannelImpl.java:110)
        at sun.nio.ch.FileChannelImpl.write(FileChannelImpl.java:199)
        at java.nio.channels.Channels.writeFullyImpl(Channels.java:78)
        at java.nio.channels.Channels.writeFully(Channels.java:101)
        at java.nio.channels.Channels.access$000(Channels.java:61)
        at java.nio.channels.Channels$1.write(Channels.java:174)
        at sun.nio.cs.StreamEncoder.writeBytes(StreamEncoder.java:221)
        at sun.nio.cs.StreamEncoder.implClose(StreamEncoder.java:316)
        at sun.nio.cs.StreamEncoder.close(StreamEncoder.java:149)
        at java.io.OutputStreamWriter.close(OutputStreamWriter.java:233)
        at java.io.BufferedWriter.close(BufferedWriter.java:266)
        at hudson.util.AtomicFileWriter.close(AtomicFileWriter.java:101)
        at hudson.util.AtomicFileWriter.commit(AtomicFileWriter.java:116)
        at hudson.model.Fingerprint.save(Fingerprint.java:1295)
        at hudson.model.Fingerprint.save(Fingerprint.java:1245)
        at hudson.model.Fingerprint.add(Fingerprint.java:1031)
        at hudson.model.Fingerprint.addFor(Fingerprint.java:1023)
        at hudson.model.Fingerprint.add(Fingerprint.java:1014)
        at hudson.maven.reporters.MavenFingerprinter.aggregate(MavenFingerprinter.java:250)
        at hudson.maven.MavenModuleSetBuild$MavenModuleSetBuildExecution.post2(MavenModuleSetBuild.java:1084)
        at hudson.model.AbstractBuild$AbstractBuildExecution.post(AbstractBuild.java:635)
        at hudson.model.Run.execute(Run.java:1749)
        at hudson.maven.MavenModuleSetBuild.run(MavenModuleSetBuild.java:543)
        at hudson.model.ResourceController.execute(ResourceController.java:97)
        at hudson.model.Executor.run(Executor.java:421)