Build failed in Jenkins: ActiveMQ-Java8-All-UnitTests #708

Previous Topic Next Topic
 
classic Classic list List threaded Threaded
6 messages Options
Reply | Threaded
Open this post in threaded view
|  
Report Content as Inappropriate

Build failed in Jenkins: ActiveMQ-Java8-All-UnitTests #708

Apache Jenkins Server-2
See <https://builds.apache.org/job/ActiveMQ-Java8-All-UnitTests/708/display/redirect?page=changes>

Changes:

[clebertsuconic] NO-JIRA: Adding 2 new resized logo submissions to the README

------------------------------------------
[...truncated 246.95 KB...]
Running org.apache.activemq.broker.policy.AbortSlowAckConsumer1Test
Tests run: 12, Failures: 0, Errors: 0, Skipped: 0, Time elapsed: 81.978 sec - in org.apache.activemq.broker.policy.AbortSlowAckConsumer1Test
Running org.apache.activemq.broker.policy.AbortSlowAckConsumer2Test
Tests run: 2, Failures: 0, Errors: 0, Skipped: 0, Time elapsed: 10.92 sec - in org.apache.activemq.broker.policy.AbortSlowAckConsumer2Test
Running org.apache.activemq.broker.policy.AbortSlowConsumer0Test
Tests run: 10, Failures: 0, Errors: 0, Skipped: 0, Time elapsed: 176.138 sec - in org.apache.activemq.broker.policy.AbortSlowConsumer0Test
Running org.apache.activemq.broker.policy.AbortSlowConsumer1Test
Tests run: 12, Failures: 0, Errors: 0, Skipped: 0, Time elapsed: 225.724 sec - in org.apache.activemq.broker.policy.AbortSlowConsumer1Test
Running org.apache.activemq.broker.policy.AbortSlowConsumer2Test
Tests run: 2, Failures: 0, Errors: 0, Skipped: 0, Time elapsed: 12.764 sec - in org.apache.activemq.broker.policy.AbortSlowConsumer2Test
Running org.apache.activemq.broker.policy.DeadLetterExpiryTest
Tests run: 6, Failures: 0, Errors: 0, Skipped: 0, Time elapsed: 93.326 sec - in org.apache.activemq.broker.policy.DeadLetterExpiryTest
Running org.apache.activemq.broker.policy.DeadLetterTest
Tests run: 4, Failures: 0, Errors: 0, Skipped: 0, Time elapsed: 82.6 sec - in org.apache.activemq.broker.policy.DeadLetterTest
Running org.apache.activemq.broker.policy.DestinationCursorConfigTest
Tests run: 2, Failures: 0, Errors: 0, Skipped: 0, Time elapsed: 1.325 sec - in org.apache.activemq.broker.policy.DestinationCursorConfigTest
Running org.apache.activemq.broker.policy.DestinationWildcardTest
Tests run: 3, Failures: 0, Errors: 0, Skipped: 0, Time elapsed: 0.968 sec - in org.apache.activemq.broker.policy.DestinationWildcardTest
Running org.apache.activemq.broker.policy.DiscardingDeadLetterPolicyTest
Tests run: 4, Failures: 0, Errors: 0, Skipped: 0, Time elapsed: 122.37 sec - in org.apache.activemq.broker.policy.DiscardingDeadLetterPolicyTest
Running org.apache.activemq.broker.policy.IndividualDeadLetterTest
Tests run: 5, Failures: 0, Errors: 0, Skipped: 0, Time elapsed: 114.122 sec - in org.apache.activemq.broker.policy.IndividualDeadLetterTest
Running org.apache.activemq.broker.policy.IndividualDeadLetterViaXmlTest
Tests run: 4, Failures: 0, Errors: 0, Skipped: 0, Time elapsed: 83.81 sec - in org.apache.activemq.broker.policy.IndividualDeadLetterViaXmlTest
Running org.apache.activemq.broker.policy.MaxDestinationsPolicyTest
Tests run: 9, Failures: 0, Errors: 0, Skipped: 0, Time elapsed: 5.443 sec - in org.apache.activemq.broker.policy.MaxDestinationsPolicyTest
Running org.apache.activemq.broker.policy.MessageGroupConfigTest
Tests run: 5, Failures: 0, Errors: 0, Skipped: 0, Time elapsed: 1.152 sec - in org.apache.activemq.broker.policy.MessageGroupConfigTest
Running org.apache.activemq.broker.policy.MessageListenerDeadLetterTest
Tests run: 4, Failures: 0, Errors: 0, Skipped: 0, Time elapsed: 2.703 sec - in org.apache.activemq.broker.policy.MessageListenerDeadLetterTest
Running org.apache.activemq.broker.policy.NoConsumerDeadLetterTest
Tests run: 5, Failures: 0, Errors: 0, Skipped: 0, Time elapsed: 1.985 sec - in org.apache.activemq.broker.policy.NoConsumerDeadLetterTest
Running org.apache.activemq.broker.policy.NoRetryDeadLetterTest
Tests run: 4, Failures: 0, Errors: 0, Skipped: 0, Time elapsed: 1.209 sec - in org.apache.activemq.broker.policy.NoRetryDeadLetterTest
Running org.apache.activemq.broker.policy.PerDurableConsumerDeadLetterTest
Tests run: 4, Failures: 0, Errors: 0, Skipped: 0, Time elapsed: 82.036 sec - in org.apache.activemq.broker.policy.PerDurableConsumerDeadLetterTest
Running org.apache.activemq.broker.policy.PriorityNetworkDispatchPolicyTest
Tests run: 1, Failures: 0, Errors: 0, Skipped: 0, Time elapsed: 0.627 sec - in org.apache.activemq.broker.policy.PriorityNetworkDispatchPolicyTest
Running org.apache.activemq.broker.policy.SecureDLQTest
Tests run: 4, Failures: 0, Errors: 0, Skipped: 0, Time elapsed: 5.111 sec - in org.apache.activemq.broker.policy.SecureDLQTest
Running org.apache.activemq.broker.policy.StrictOrderDispatchPolicyTest
Tests run: 8, Failures: 0, Errors: 0, Skipped: 0, Time elapsed: 4.694 sec - in org.apache.activemq.broker.policy.StrictOrderDispatchPolicyTest
Running org.apache.activemq.broker.region.DestinationGCStressTest
Tests run: 3, Failures: 0, Errors: 0, Skipped: 0, Time elapsed: 12.872 sec - in org.apache.activemq.broker.region.DestinationGCStressTest
Running org.apache.activemq.broker.region.DestinationGCTest
Tests run: 4, Failures: 0, Errors: 0, Skipped: 0, Time elapsed: 26.919 sec - in org.apache.activemq.broker.region.DestinationGCTest
Running org.apache.activemq.broker.region.DestinationRemoveRestartTest
Tests run: 2, Failures: 0, Errors: 0, Skipped: 0, Time elapsed: 1.735 sec - in org.apache.activemq.broker.region.DestinationRemoveRestartTest
Running org.apache.activemq.broker.region.QueueDuplicatesFromStoreTest
Tests run: 2, Failures: 0, Errors: 0, Skipped: 0, Time elapsed: 20.685 sec - in org.apache.activemq.broker.region.QueueDuplicatesFromStoreTest
Running org.apache.activemq.broker.region.QueueOptimizedDispatchExceptionTest
Tests run: 1, Failures: 0, Errors: 0, Skipped: 0, Time elapsed: 0.572 sec - in org.apache.activemq.broker.region.QueueOptimizedDispatchExceptionTest
Running org.apache.activemq.broker.region.QueuePurgeTest
Tests run: 7, Failures: 0, Errors: 0, Skipped: 0, Time elapsed: 495.594 sec - in org.apache.activemq.broker.region.QueuePurgeTest
Running org.apache.activemq.broker.region.QueueResendDuringShutdownTest
Tests run: 3, Failures: 0, Errors: 0, Skipped: 0, Time elapsed: 10.365 sec - in org.apache.activemq.broker.region.QueueResendDuringShutdownTest
Running org.apache.activemq.broker.region.SubscriptionAddRemoveQueueTest
Tests run: 1, Failures: 0, Errors: 0, Skipped: 0, Time elapsed: 2.772 sec - in org.apache.activemq.broker.region.SubscriptionAddRemoveQueueTest
Running org.apache.activemq.broker.region.UniquePropertyMessageEvictionStrategyTest
Tests run: 1, Failures: 0, Errors: 0, Skipped: 0, Time elapsed: 11.896 sec - in org.apache.activemq.broker.region.UniquePropertyMessageEvictionStrategyTest
Running org.apache.activemq.broker.region.cursors.AbstractStoreCursorNpeTest
Tests run: 1, Failures: 0, Errors: 0, Skipped: 0, Time elapsed: 1.848 sec - in org.apache.activemq.broker.region.cursors.AbstractStoreCursorNpeTest
Running org.apache.activemq.broker.region.cursors.CursorDurableTest
Tests run: 2, Failures: 0, Errors: 0, Skipped: 0, Time elapsed: 2.637 sec - in org.apache.activemq.broker.region.cursors.CursorDurableTest
Running org.apache.activemq.broker.region.cursors.CursorQueueStoreTest
Tests run: 5, Failures: 0, Errors: 0, Skipped: 0, Time elapsed: 94.862 sec - in org.apache.activemq.broker.region.cursors.CursorQueueStoreTest
Running org.apache.activemq.broker.region.cursors.KahaDBPendingMessageCursorTest

Results :

Tests in error:
  RedeliveryPolicyTest>CombinationTestSupport.runBare:107->testRepeatedRedeliveryReceiveBrokerCloseNoPreDispatchCheck:572 » JMS

Tests run: 1269, Failures: 0, Errors: 1, Skipped: 1

[JENKINS] Recording test results
Tests run: 72, Failures: 0, Errors: 0, Skipped: 12, Time elapsed: 80.331 sec - in org.apache.activemq.broker.region.cursors.KahaDBPendingMessageCursorTest
[INFO] ------------------------------------------------------------------------
[INFO] Reactor Summary:
[INFO]
[INFO] ActiveMQ ........................................... SUCCESS [  7.187 s]
[INFO] ActiveMQ :: Client ................................. SUCCESS [03:09 min]
[INFO] ActiveMQ :: Openwire Legacy Support ................ SUCCESS [  7.104 s]
[INFO] ActiveMQ :: JAAS ................................... SUCCESS [ 19.129 s]
[INFO] ActiveMQ :: Broker ................................. SUCCESS [01:23 min]
[INFO] ActiveMQ :: KahaDB Store ........................... SUCCESS [03:03 min]
[INFO] ActiveMQ :: STOMP Protocol ......................... SUCCESS [13:02 min]
[INFO] ActiveMQ :: MQTT Protocol .......................... SUCCESS [22:26 min]
[INFO] ActiveMQ :: JDBC Store ............................. SUCCESS [  5.036 s]
[INFO] ActiveMQ :: LevelDB Store .......................... SUCCESS [03:55 min]
[INFO] ActiveMQ :: Generic JMS Pool ....................... SUCCESS [01:07 min]
[INFO] ActiveMQ :: Pool ................................... SUCCESS [  8.539 s]
[INFO] ActiveMQ :: RA ..................................... SUCCESS [01:52 min]
[INFO] ActiveMQ :: Spring ................................. SUCCESS [01:00 min]
[INFO] ActiveMQ :: Console ................................ SUCCESS [  8.031 s]
[INFO] ActiveMQ :: Partition Management ................... SUCCESS [ 20.882 s]
[INFO] ActiveMQ :: Runtime Configuration .................. SUCCESS [08:24 min]
[INFO] ActiveMQ :: Tooling ................................ SUCCESS [  1.414 s]
[INFO] ActiveMQ :: JUnit Rule ............................. SUCCESS [  6.378 s]
[INFO] ActiveMQ :: Unit Tests ............................. FAILURE [  01:08 h]
[INFO] ------------------------------------------------------------------------
[INFO] BUILD FAILURE
[INFO] ------------------------------------------------------------------------
[INFO] Total time: 02:10 h
[INFO] Finished at: 2017-06-29T01:59:40+00:00
[INFO] Final Memory: 115M/1502M
[INFO] ------------------------------------------------------------------------
Waiting for Jenkins to finish collecting data
[ERROR] Failed to execute goal org.apache.maven.plugins:maven-surefire-plugin:2.16:test (default-test) on project activemq-unit-tests: ExecutionException; nested exception is java.util.concurrent.ExecutionException: java.lang.RuntimeException: The forked VM terminated without saying properly goodbye. VM crash or System.exit called ?
[ERROR] Command was/bin/sh -c cd <https://builds.apache.org/job/ActiveMQ-Java8-All-UnitTests/ws/activemq-unit-tests> && /usr/local/asfpackages/java/jdk1.8.0_131/jre/bin/java -Xmx512m -jar <https://builds.apache.org/job/ActiveMQ-Java8-All-UnitTests/ws/activemq-unit-tests/target/surefire/surefirebooter5900510965791124677.jar> <https://builds.apache.org/job/ActiveMQ-Java8-All-UnitTests/ws/activemq-unit-tests/target/surefire/surefire7371238389512015388tmp> <https://builds.apache.org/job/ActiveMQ-Java8-All-UnitTests/ws/activemq-unit-tests/target/surefire/surefire_228614733073523790015tmp>
[ERROR] -> [Help 1]
org.apache.maven.lifecycle.LifecycleExecutionException: Failed to execute goal org.apache.maven.plugins:maven-surefire-plugin:2.16:test (default-test) on project activemq-unit-tests: ExecutionException; nested exception is java.util.concurrent.ExecutionException: java.lang.RuntimeException: The forked VM terminated without saying properly goodbye. VM crash or System.exit called ?
Command was/bin/sh -c cd <https://builds.apache.org/job/ActiveMQ-Java8-All-UnitTests/ws/activemq-unit-tests> && /usr/local/asfpackages/java/jdk1.8.0_131/jre/bin/java -Xmx512m -jar <https://builds.apache.org/job/ActiveMQ-Java8-All-UnitTests/ws/activemq-unit-tests/target/surefire/surefirebooter5900510965791124677.jar> <https://builds.apache.org/job/ActiveMQ-Java8-All-UnitTests/ws/activemq-unit-tests/target/surefire/surefire7371238389512015388tmp> <https://builds.apache.org/job/ActiveMQ-Java8-All-UnitTests/ws/activemq-unit-tests/target/surefire/surefire_228614733073523790015tmp>
        at org.apache.maven.lifecycle.internal.MojoExecutor.execute(MojoExecutor.java:212)
        at org.apache.maven.lifecycle.internal.MojoExecutor.execute(MojoExecutor.java:153)
        at org.apache.maven.lifecycle.internal.MojoExecutor.execute(MojoExecutor.java:145)
        at org.apache.maven.lifecycle.internal.LifecycleModuleBuilder.buildProject(LifecycleModuleBuilder.java:116)
        at org.apache.maven.lifecycle.internal.LifecycleModuleBuilder.buildProject(LifecycleModuleBuilder.java:80)
        at org.apache.maven.lifecycle.internal.builder.singlethreaded.SingleThreadedBuilder.build(SingleThreadedBuilder.java:51)
        at org.apache.maven.lifecycle.internal.LifecycleStarter.execute(LifecycleStarter.java:128)
        at org.apache.maven.DefaultMaven.doExecute(DefaultMaven.java:307)
        at org.apache.maven.DefaultMaven.doExecute(DefaultMaven.java:193)
        at org.apache.maven.DefaultMaven.execute(DefaultMaven.java:106)
        at org.jvnet.hudson.maven3.launcher.Maven33Launcher.main(Maven33Launcher.java:129)
        at sun.reflect.NativeMethodAccessorImpl.invoke0(Native Method)
        at sun.reflect.NativeMethodAccessorImpl.invoke(NativeMethodAccessorImpl.java:62)
        at sun.reflect.DelegatingMethodAccessorImpl.invoke(DelegatingMethodAccessorImpl.java:43)
        at java.lang.reflect.Method.invoke(Method.java:498)
        at org.codehaus.plexus.classworlds.launcher.Launcher.launchStandard(Launcher.java:330)
        at org.codehaus.plexus.classworlds.launcher.Launcher.launch(Launcher.java:238)
        at jenkins.maven3.agent.Maven33Main.launch(Maven33Main.java:176)
        at sun.reflect.NativeMethodAccessorImpl.invoke0(Native Method)
        at sun.reflect.NativeMethodAccessorImpl.invoke(NativeMethodAccessorImpl.java:62)
        at sun.reflect.DelegatingMethodAccessorImpl.invoke(DelegatingMethodAccessorImpl.java:43)
        at java.lang.reflect.Method.invoke(Method.java:498)
        at hudson.maven.Maven3Builder.call(Maven3Builder.java:139)
        at hudson.maven.Maven3Builder.call(Maven3Builder.java:70)
        at hudson.remoting.UserRequest.perform(UserRequest.java:153)
        at hudson.remoting.UserRequest.perform(UserRequest.java:50)
        at hudson.remoting.Request$2.run(Request.java:336)
        at hudson.remoting.InterceptingExecutorService$1.call(InterceptingExecutorService.java:68)
        at java.util.concurrent.FutureTask.run(FutureTask.java:266)
        at java.util.concurrent.ThreadPoolExecutor.runWorker(ThreadPoolExecutor.java:1142)
        at java.util.concurrent.ThreadPoolExecutor$Worker.run(ThreadPoolExecutor.java:617)
        at java.lang.Thread.run(Thread.java:748)
Caused by: org.apache.maven.plugin.MojoFailureException: ExecutionException; nested exception is java.util.concurrent.ExecutionException: java.lang.RuntimeException: The forked VM terminated without saying properly goodbye. VM crash or System.exit called ?
Command was/bin/sh -c cd <https://builds.apache.org/job/ActiveMQ-Java8-All-UnitTests/ws/activemq-unit-tests> && /usr/local/asfpackages/java/jdk1.8.0_131/jre/bin/java -Xmx512m -jar <https://builds.apache.org/job/ActiveMQ-Java8-All-UnitTests/ws/activemq-unit-tests/target/surefire/surefirebooter5900510965791124677.jar> <https://builds.apache.org/job/ActiveMQ-Java8-All-UnitTests/ws/activemq-unit-tests/target/surefire/surefire7371238389512015388tmp> <https://builds.apache.org/job/ActiveMQ-Java8-All-UnitTests/ws/activemq-unit-tests/target/surefire/surefire_228614733073523790015tmp>
        at org.apache.maven.plugin.surefire.SurefirePlugin.assertNoException(SurefirePlugin.java:198)
        at org.apache.maven.plugin.surefire.SurefirePlugin.handleSummary(SurefirePlugin.java:188)
        at org.apache.maven.plugin.surefire.AbstractSurefireMojo.executeAfterPreconditionsChecked(AbstractSurefireMojo.java:852)
        at org.apache.maven.plugin.surefire.AbstractSurefireMojo.execute(AbstractSurefireMojo.java:720)
        at org.apache.maven.plugin.DefaultBuildPluginManager.executeMojo(DefaultBuildPluginManager.java:134)
        at org.apache.maven.lifecycle.internal.MojoExecutor.execute(MojoExecutor.java:207)
        ... 31 more
Caused by: org.apache.maven.surefire.booter.SurefireBooterForkException: ExecutionException; nested exception is java.util.concurrent.ExecutionException: java.lang.RuntimeException: The forked VM terminated without saying properly goodbye. VM crash or System.exit called ?
Command was/bin/sh -c cd <https://builds.apache.org/job/ActiveMQ-Java8-All-UnitTests/ws/activemq-unit-tests> && /usr/local/asfpackages/java/jdk1.8.0_131/jre/bin/java -Xmx512m -jar <https://builds.apache.org/job/ActiveMQ-Java8-All-UnitTests/ws/activemq-unit-tests/target/surefire/surefirebooter5900510965791124677.jar> <https://builds.apache.org/job/ActiveMQ-Java8-All-UnitTests/ws/activemq-unit-tests/target/surefire/surefire7371238389512015388tmp> <https://builds.apache.org/job/ActiveMQ-Java8-All-UnitTests/ws/activemq-unit-tests/target/surefire/surefire_228614733073523790015tmp>
        at org.apache.maven.plugin.surefire.booterclient.ForkStarter.runSuitesForkPerTestSet(ForkStarter.java:316)
        at org.apache.maven.plugin.surefire.booterclient.ForkStarter.run(ForkStarter.java:169)
        at org.apache.maven.plugin.surefire.AbstractSurefireMojo.executeProvider(AbstractSurefireMojo.java:958)
        at org.apache.maven.plugin.surefire.AbstractSurefireMojo.executeAfterPreconditionsChecked(AbstractSurefireMojo.java:822)
        ... 34 more
Caused by: java.util.concurrent.ExecutionException: java.lang.RuntimeException: The forked VM terminated without saying properly goodbye. VM crash or System.exit called ?
Command was/bin/sh -c cd <https://builds.apache.org/job/ActiveMQ-Java8-All-UnitTests/ws/activemq-unit-tests> && /usr/local/asfpackages/java/jdk1.8.0_131/jre/bin/java -Xmx512m -jar <https://builds.apache.org/job/ActiveMQ-Java8-All-UnitTests/ws/activemq-unit-tests/target/surefire/surefirebooter5900510965791124677.jar> <https://builds.apache.org/job/ActiveMQ-Java8-All-UnitTests/ws/activemq-unit-tests/target/surefire/surefire7371238389512015388tmp> <https://builds.apache.org/job/ActiveMQ-Java8-All-UnitTests/ws/activemq-unit-tests/target/surefire/surefire_228614733073523790015tmp>
        at java.util.concurrent.FutureTask.report(FutureTask.java:122)
        at java.util.concurrent.FutureTask.get(FutureTask.java:192)
        at org.apache.maven.plugin.surefire.booterclient.ForkStarter.runSuitesForkPerTestSet(ForkStarter.java:300)
        ... 37 more
Caused by: java.lang.RuntimeException: The forked VM terminated without saying properly goodbye. VM crash or System.exit called ?
Command was/bin/sh -c cd <https://builds.apache.org/job/ActiveMQ-Java8-All-UnitTests/ws/activemq-unit-tests> && /usr/local/asfpackages/java/jdk1.8.0_131/jre/bin/java -Xmx512m -jar <https://builds.apache.org/job/ActiveMQ-Java8-All-UnitTests/ws/activemq-unit-tests/target/surefire/surefirebooter5900510965791124677.jar> <https://builds.apache.org/job/ActiveMQ-Java8-All-UnitTests/ws/activemq-unit-tests/target/surefire/surefire7371238389512015388tmp> <https://builds.apache.org/job/ActiveMQ-Java8-All-UnitTests/ws/activemq-unit-tests/target/surefire/surefire_228614733073523790015tmp>
        at org.apache.maven.plugin.surefire.booterclient.ForkStarter.fork(ForkStarter.java:485)
        at org.apache.maven.plugin.surefire.booterclient.ForkStarter.fork(ForkStarter.java:352)
        at org.apache.maven.plugin.surefire.booterclient.ForkStarter.access$300(ForkStarter.java:85)
        at org.apache.maven.plugin.surefire.booterclient.ForkStarter$2.call(ForkStarter.java:288)
        at org.apache.maven.plugin.surefire.booterclient.ForkStarter$2.call(ForkStarter.java:283)
        ... 4 more
[ERROR]
[ERROR] Re-run Maven using the -X switch to enable full debug logging.
[ERROR]
[ERROR] For more information about the errors and possible solutions, please read the following articles:
[ERROR] [Help 1] http://cwiki.apache.org/confluence/display/MAVEN/MojoFailureException
[ERROR]
[ERROR] After correcting the problems, you can resume the build with the command
[ERROR]   mvn <goals> -rf :activemq-unit-tests
[JENKINS] Archiving <https://builds.apache.org/job/ActiveMQ-Java8-All-UnitTests/ws/activemq-kahadb-store/pom.xml> to org.apache.activemq/activemq-kahadb-store/5.16.0-SNAPSHOT/activemq-kahadb-store-5.16.0-SNAPSHOT.pom
[JENKINS] Archiving <https://builds.apache.org/job/ActiveMQ-Java8-All-UnitTests/ws/activemq-kahadb-store/target/activemq-kahadb-store-5.16.0-SNAPSHOT.jar> to org.apache.activemq/activemq-kahadb-store/5.16.0-SNAPSHOT/activemq-kahadb-store-5.16.0-SNAPSHOT.jar
No artifacts from ActiveMQ-Java8-All-UnitTests » ActiveMQ :: KahaDB Store #707 to compare, so performing full copy of artifacts
[JENKINS] Archiving <https://builds.apache.org/job/ActiveMQ-Java8-All-UnitTests/ws/activemq-unit-tests/pom.xml> to org.apache.activemq/activemq-unit-tests/5.16.0-SNAPSHOT/activemq-unit-tests-5.16.0-SNAPSHOT.pom
Compressed 72.14 KB of artifacts by 44.4% relative to #706
[JENKINS] Archiving <https://builds.apache.org/job/ActiveMQ-Java8-All-UnitTests/ws/activemq-openwire-legacy/pom.xml> to org.apache.activemq/activemq-openwire-legacy/5.16.0-SNAPSHOT/activemq-openwire-legacy-5.16.0-SNAPSHOT.pom
[JENKINS] Archiving <https://builds.apache.org/job/ActiveMQ-Java8-All-UnitTests/ws/activemq-openwire-legacy/target/activemq-openwire-legacy-5.16.0-SNAPSHOT.jar> to org.apache.activemq/activemq-openwire-legacy/5.16.0-SNAPSHOT/activemq-openwire-legacy-5.16.0-SNAPSHOT.jar
No artifacts from ActiveMQ-Java8-All-UnitTests » ActiveMQ :: Openwire Legacy Support #707 to compare, so performing full copy of artifacts
[JENKINS] Archiving <https://builds.apache.org/job/ActiveMQ-Java8-All-UnitTests/ws/activemq-client/pom.xml> to org.apache.activemq/activemq-client/5.16.0-SNAPSHOT/activemq-client-5.16.0-SNAPSHOT.pom
[JENKINS] Archiving <https://builds.apache.org/job/ActiveMQ-Java8-All-UnitTests/ws/activemq-client/target/activemq-client-5.16.0-SNAPSHOT.jar> to org.apache.activemq/activemq-client/5.16.0-SNAPSHOT/activemq-client-5.16.0-SNAPSHOT.jar
No artifacts from ActiveMQ-Java8-All-UnitTests » ActiveMQ :: Client #707 to compare, so performing full copy of artifacts
[JENKINS] Archiving <https://builds.apache.org/job/ActiveMQ-Java8-All-UnitTests/ws/activemq-tooling/activemq-junit/pom.xml> to org.apache.activemq.tooling/activemq-junit/5.16.0-SNAPSHOT/activemq-junit-5.16.0-SNAPSHOT.pom
[JENKINS] Archiving <https://builds.apache.org/job/ActiveMQ-Java8-All-UnitTests/ws/activemq-tooling/activemq-junit/target/activemq-junit-5.16.0-SNAPSHOT.jar> to org.apache.activemq.tooling/activemq-junit/5.16.0-SNAPSHOT/activemq-junit-5.16.0-SNAPSHOT.jar
No artifacts from ActiveMQ-Java8-All-UnitTests » ActiveMQ :: JUnit Rule #707 to compare, so performing full copy of artifacts
[JENKINS] Archiving <https://builds.apache.org/job/ActiveMQ-Java8-All-UnitTests/ws/activemq-tooling/pom.xml> to org.apache.activemq.tooling/activemq-tooling/5.16.0-SNAPSHOT/activemq-tooling-5.16.0-SNAPSHOT.pom
No artifacts from ActiveMQ-Java8-All-UnitTests » ActiveMQ :: Tooling #707 to compare, so performing full copy of artifacts
[JENKINS] Archiving <https://builds.apache.org/job/ActiveMQ-Java8-All-UnitTests/ws/activemq-jms-pool/pom.xml> to org.apache.activemq/activemq-jms-pool/5.16.0-SNAPSHOT/activemq-jms-pool-5.16.0-SNAPSHOT.pom
[JENKINS] Archiving <https://builds.apache.org/job/ActiveMQ-Java8-All-UnitTests/ws/activemq-jms-pool/target/activemq-jms-pool-5.16.0-SNAPSHOT.jar> to org.apache.activemq/activemq-jms-pool/5.16.0-SNAPSHOT/activemq-jms-pool-5.16.0-SNAPSHOT.jar
No artifacts from ActiveMQ-Java8-All-UnitTests » ActiveMQ :: Generic JMS Pool #707 to compare, so performing full copy of artifacts
[JENKINS] Archiving <https://builds.apache.org/job/ActiveMQ-Java8-All-UnitTests/ws/activemq-pool/pom.xml> to org.apache.activemq/activemq-pool/5.16.0-SNAPSHOT/activemq-pool-5.16.0-SNAPSHOT.pom
[JENKINS] Archiving <https://builds.apache.org/job/ActiveMQ-Java8-All-UnitTests/ws/activemq-pool/target/activemq-pool-5.16.0-SNAPSHOT.jar> to org.apache.activemq/activemq-pool/5.16.0-SNAPSHOT/activemq-pool-5.16.0-SNAPSHOT.jar
No artifacts from ActiveMQ-Java8-All-UnitTests » ActiveMQ :: Pool #707 to compare, so performing full copy of artifacts
[JENKINS] Archiving <https://builds.apache.org/job/ActiveMQ-Java8-All-UnitTests/ws/activemq-jdbc-store/pom.xml> to org.apache.activemq/activemq-jdbc-store/5.16.0-SNAPSHOT/activemq-jdbc-store-5.16.0-SNAPSHOT.pom
[JENKINS] Archiving <https://builds.apache.org/job/ActiveMQ-Java8-All-UnitTests/ws/activemq-jdbc-store/target/activemq-jdbc-store-5.16.0-SNAPSHOT.jar> to org.apache.activemq/activemq-jdbc-store/5.16.0-SNAPSHOT/activemq-jdbc-store-5.16.0-SNAPSHOT.jar
No artifacts from ActiveMQ-Java8-All-UnitTests » ActiveMQ :: JDBC Store #707 to compare, so performing full copy of artifacts
[JENKINS] Archiving <https://builds.apache.org/job/ActiveMQ-Java8-All-UnitTests/ws/activemq-runtime-config/pom.xml> to org.apache.activemq/activemq-runtime-config/5.16.0-SNAPSHOT/activemq-runtime-config-5.16.0-SNAPSHOT.pom
[JENKINS] Archiving <https://builds.apache.org/job/ActiveMQ-Java8-All-UnitTests/ws/activemq-runtime-config/target/activemq-runtime-config-5.16.0-SNAPSHOT.jar> to org.apache.activemq/activemq-runtime-config/5.16.0-SNAPSHOT/activemq-runtime-config-5.16.0-SNAPSHOT.jar
No artifacts from ActiveMQ-Java8-All-UnitTests » ActiveMQ :: Runtime Configuration #707 to compare, so performing full copy of artifacts
[JENKINS] Archiving <https://builds.apache.org/job/ActiveMQ-Java8-All-UnitTests/ws/pom.xml> to org.apache.activemq/activemq-parent/5.16.0-SNAPSHOT/activemq-parent-5.16.0-SNAPSHOT.pom
No artifacts from ActiveMQ-Java8-All-UnitTests » ActiveMQ #707 to compare, so performing full copy of artifacts
[JENKINS] Archiving <https://builds.apache.org/job/ActiveMQ-Java8-All-UnitTests/ws/activemq-stomp/pom.xml> to org.apache.activemq/activemq-stomp/5.16.0-SNAPSHOT/activemq-stomp-5.16.0-SNAPSHOT.pom
[JENKINS] Archiving <https://builds.apache.org/job/ActiveMQ-Java8-All-UnitTests/ws/activemq-stomp/target/activemq-stomp-5.16.0-SNAPSHOT.jar> to org.apache.activemq/activemq-stomp/5.16.0-SNAPSHOT/activemq-stomp-5.16.0-SNAPSHOT.jar
No artifacts from ActiveMQ-Java8-All-UnitTests » ActiveMQ :: STOMP Protocol #707 to compare, so performing full copy of artifacts
[JENKINS] Archiving <https://builds.apache.org/job/ActiveMQ-Java8-All-UnitTests/ws/activemq-broker/pom.xml> to org.apache.activemq/activemq-broker/5.16.0-SNAPSHOT/activemq-broker-5.16.0-SNAPSHOT.pom
[JENKINS] Archiving <https://builds.apache.org/job/ActiveMQ-Java8-All-UnitTests/ws/activemq-broker/target/activemq-broker-5.16.0-SNAPSHOT.jar> to org.apache.activemq/activemq-broker/5.16.0-SNAPSHOT/activemq-broker-5.16.0-SNAPSHOT.jar
[JENKINS] Archiving <https://builds.apache.org/job/ActiveMQ-Java8-All-UnitTests/ws/activemq-broker/target/activemq-broker-5.16.0-SNAPSHOT-tests.jar> to org.apache.activemq/activemq-broker/5.16.0-SNAPSHOT/activemq-broker-5.16.0-SNAPSHOT-tests.jar
No artifacts from ActiveMQ-Java8-All-UnitTests » ActiveMQ :: Broker #707 to compare, so performing full copy of artifacts
[JENKINS] Archiving <https://builds.apache.org/job/ActiveMQ-Java8-All-UnitTests/ws/activemq-mqtt/pom.xml> to org.apache.activemq/activemq-mqtt/5.16.0-SNAPSHOT/activemq-mqtt-5.16.0-SNAPSHOT.pom
[JENKINS] Archiving <https://builds.apache.org/job/ActiveMQ-Java8-All-UnitTests/ws/activemq-mqtt/target/activemq-mqtt-5.16.0-SNAPSHOT.jar> to org.apache.activemq/activemq-mqtt/5.16.0-SNAPSHOT/activemq-mqtt-5.16.0-SNAPSHOT.jar
No artifacts from ActiveMQ-Java8-All-UnitTests » ActiveMQ :: MQTT Protocol #707 to compare, so performing full copy of artifacts
[JENKINS] Archiving <https://builds.apache.org/job/ActiveMQ-Java8-All-UnitTests/ws/activemq-jaas/pom.xml> to org.apache.activemq/activemq-jaas/5.16.0-SNAPSHOT/activemq-jaas-5.16.0-SNAPSHOT.pom
[JENKINS] Archiving <https://builds.apache.org/job/ActiveMQ-Java8-All-UnitTests/ws/activemq-jaas/target/activemq-jaas-5.16.0-SNAPSHOT.jar> to org.apache.activemq/activemq-jaas/5.16.0-SNAPSHOT/activemq-jaas-5.16.0-SNAPSHOT.jar
No artifacts from ActiveMQ-Java8-All-UnitTests » ActiveMQ :: JAAS #707 to compare, so performing full copy of artifacts
[JENKINS] Archiving <https://builds.apache.org/job/ActiveMQ-Java8-All-UnitTests/ws/activemq-ra/pom.xml> to org.apache.activemq/activemq-ra/5.16.0-SNAPSHOT/activemq-ra-5.16.0-SNAPSHOT.pom
[JENKINS] Archiving <https://builds.apache.org/job/ActiveMQ-Java8-All-UnitTests/ws/activemq-ra/target/activemq-ra-5.16.0-SNAPSHOT.jar> to org.apache.activemq/activemq-ra/5.16.0-SNAPSHOT/activemq-ra-5.16.0-SNAPSHOT.jar
[JENKINS] Archiving <https://builds.apache.org/job/ActiveMQ-Java8-All-UnitTests/ws/activemq-ra/target/xbean/activemq-ra.xsd> to org.apache.activemq/activemq-ra/5.16.0-SNAPSHOT/activemq-ra-5.16.0-SNAPSHOT.xsd
[JENKINS] Archiving <https://builds.apache.org/job/ActiveMQ-Java8-All-UnitTests/ws/activemq-ra/target/xbean/activemq-ra.xsd.html> to org.apache.activemq/activemq-ra/5.16.0-SNAPSHOT/activemq-ra-5.16.0-SNAPSHOT-schema.html
[JENKINS] Archiving <https://builds.apache.org/job/ActiveMQ-Java8-All-UnitTests/ws/activemq-ra/target/xbean/activemq-ra.xsd.html> to org.apache.activemq/activemq-ra/5.16.0-SNAPSHOT/activemq-ra-5.16.0-SNAPSHOT.xsd.html
No artifacts from ActiveMQ-Java8-All-UnitTests » ActiveMQ :: RA #707 to compare, so performing full copy of artifacts
[JENKINS] Archiving <https://builds.apache.org/job/ActiveMQ-Java8-All-UnitTests/ws/activemq-partition/pom.xml> to org.apache.activemq/activemq-partition/5.16.0-SNAPSHOT/activemq-partition-5.16.0-SNAPSHOT.pom
[JENKINS] Archiving <https://builds.apache.org/job/ActiveMQ-Java8-All-UnitTests/ws/activemq-partition/target/activemq-partition-5.16.0-SNAPSHOT.jar> to org.apache.activemq/activemq-partition/5.16.0-SNAPSHOT/activemq-partition-5.16.0-SNAPSHOT.jar
No artifacts from ActiveMQ-Java8-All-UnitTests » ActiveMQ :: Partition Management #707 to compare, so performing full copy of artifacts
[JENKINS] Archiving <https://builds.apache.org/job/ActiveMQ-Java8-All-UnitTests/ws/activemq-console/pom.xml> to org.apache.activemq/activemq-console/5.16.0-SNAPSHOT/activemq-console-5.16.0-SNAPSHOT.pom
[JENKINS] Archiving <https://builds.apache.org/job/ActiveMQ-Java8-All-UnitTests/ws/activemq-console/target/activemq-console-5.16.0-SNAPSHOT.jar> to org.apache.activemq/activemq-console/5.16.0-SNAPSHOT/activemq-console-5.16.0-SNAPSHOT.jar
No artifacts from ActiveMQ-Java8-All-UnitTests » ActiveMQ :: Console #707 to compare, so performing full copy of artifacts
[JENKINS] Archiving <https://builds.apache.org/job/ActiveMQ-Java8-All-UnitTests/ws/activemq-spring/pom.xml> to org.apache.activemq/activemq-spring/5.16.0-SNAPSHOT/activemq-spring-5.16.0-SNAPSHOT.pom
[JENKINS] Archiving <https://builds.apache.org/job/ActiveMQ-Java8-All-UnitTests/ws/activemq-spring/target/activemq-spring-5.16.0-SNAPSHOT.jar> to org.apache.activemq/activemq-spring/5.16.0-SNAPSHOT/activemq-spring-5.16.0-SNAPSHOT.jar
[JENKINS] Archiving <https://builds.apache.org/job/ActiveMQ-Java8-All-UnitTests/ws/activemq-spring/target/classes/activemq.xsd> to org.apache.activemq/activemq-spring/5.16.0-SNAPSHOT/activemq-spring-5.16.0-SNAPSHOT.xsd
[JENKINS] Archiving <https://builds.apache.org/job/ActiveMQ-Java8-All-UnitTests/ws/activemq-spring/target/classes/activemq.xsd.html> to org.apache.activemq/activemq-spring/5.16.0-SNAPSHOT/activemq-spring-5.16.0-SNAPSHOT-schema.html
No artifacts from ActiveMQ-Java8-All-UnitTests » ActiveMQ :: Spring #707 to compare, so performing full copy of artifacts
[JENKINS] Archiving <https://builds.apache.org/job/ActiveMQ-Java8-All-UnitTests/ws/activemq-leveldb-store/pom.xml> to org.apache.activemq/activemq-leveldb-store/5.16.0-SNAPSHOT/activemq-leveldb-store-5.16.0-SNAPSHOT.pom
[JENKINS] Archiving <https://builds.apache.org/job/ActiveMQ-Java8-All-UnitTests/ws/activemq-leveldb-store/target/activemq-leveldb-store-5.16.0-SNAPSHOT.jar> to org.apache.activemq/activemq-leveldb-store/5.16.0-SNAPSHOT/activemq-leveldb-store-5.16.0-SNAPSHOT.jar
No artifacts from ActiveMQ-Java8-All-UnitTests » ActiveMQ :: LevelDB Store #707 to compare, so performing full copy of artifacts
[locks-and-latches] Releasing all the locks
[locks-and-latches] All the locks released
channel stopped
Reply | Threaded
Open this post in threaded view
|  
Report Content as Inappropriate

Jenkins build is unstable: ActiveMQ-Java8-All-UnitTests #709

Apache Jenkins Server-2
Reply | Threaded
Open this post in threaded view
|  
Report Content as Inappropriate

Jenkins build is still unstable: ActiveMQ-Java8-All-UnitTests #710

Apache Jenkins Server-2
Reply | Threaded
Open this post in threaded view
|  
Report Content as Inappropriate

Build failed in Jenkins: ActiveMQ-Java8-All-UnitTests #711

Apache Jenkins Server-2
See <https://builds.apache.org/job/ActiveMQ-Java8-All-UnitTests/711/display/redirect?page=changes>

Changes:

[tabish121] AMQ-6765 Add trace logging of start failure exception

------------------------------------------
[...truncated 362.32 KB...]
Tests run: 1, Failures: 0, Errors: 0, Skipped: 0, Time elapsed: 0.308 sec - in org.apache.activemq.openwire.v7.JournalTopicAckTest
Running org.apache.activemq.openwire.v7.JournalTraceTest
Tests run: 1, Failures: 0, Errors: 0, Skipped: 0, Time elapsed: 0.26 sec - in org.apache.activemq.openwire.v7.JournalTraceTest
Running org.apache.activemq.openwire.v7.JournalTransactionTest
Tests run: 1, Failures: 0, Errors: 0, Skipped: 0, Time elapsed: 0.264 sec - in org.apache.activemq.openwire.v7.JournalTransactionTest
Running org.apache.activemq.openwire.v7.KeepAliveInfoTest
Tests run: 1, Failures: 0, Errors: 0, Skipped: 0, Time elapsed: 0.271 sec - in org.apache.activemq.openwire.v7.KeepAliveInfoTest
Running org.apache.activemq.openwire.v7.LastPartialCommandTest
Tests run: 1, Failures: 0, Errors: 0, Skipped: 0, Time elapsed: 0.289 sec - in org.apache.activemq.openwire.v7.LastPartialCommandTest
Running org.apache.activemq.openwire.v7.LocalTransactionIdTest
Tests run: 1, Failures: 0, Errors: 0, Skipped: 0, Time elapsed: 0.216 sec - in org.apache.activemq.openwire.v7.LocalTransactionIdTest
Running org.apache.activemq.openwire.v7.MessageAckTest
Tests run: 1, Failures: 0, Errors: 0, Skipped: 0, Time elapsed: 0.316 sec - in org.apache.activemq.openwire.v7.MessageAckTest
Running org.apache.activemq.openwire.v7.MessageDispatchNotificationTest
Tests run: 1, Failures: 0, Errors: 0, Skipped: 0, Time elapsed: 0.331 sec - in org.apache.activemq.openwire.v7.MessageDispatchNotificationTest
Running org.apache.activemq.openwire.v7.MessageDispatchTest
Tests run: 1, Failures: 0, Errors: 0, Skipped: 0, Time elapsed: 0.229 sec - in org.apache.activemq.openwire.v7.MessageDispatchTest
Running org.apache.activemq.openwire.v7.MessageIdTest
Tests run: 1, Failures: 0, Errors: 0, Skipped: 0, Time elapsed: 0.216 sec - in org.apache.activemq.openwire.v7.MessageIdTest
Running org.apache.activemq.openwire.v7.MessagePullTest
Tests run: 1, Failures: 0, Errors: 0, Skipped: 0, Time elapsed: 0.224 sec - in org.apache.activemq.openwire.v7.MessagePullTest
Running org.apache.activemq.openwire.v7.NetworkBridgeFilterTest
Tests run: 1, Failures: 0, Errors: 0, Skipped: 0, Time elapsed: 0.3 sec - in org.apache.activemq.openwire.v7.NetworkBridgeFilterTest
Running org.apache.activemq.openwire.v7.PartialCommandTest
Tests run: 1, Failures: 0, Errors: 0, Skipped: 0, Time elapsed: 0.311 sec - in org.apache.activemq.openwire.v7.PartialCommandTest
Running org.apache.activemq.openwire.v7.ProducerAckTest
Tests run: 1, Failures: 0, Errors: 0, Skipped: 0, Time elapsed: 0.252 sec - in org.apache.activemq.openwire.v7.ProducerAckTest
Running org.apache.activemq.openwire.v7.ProducerIdTest
Tests run: 1, Failures: 0, Errors: 0, Skipped: 0, Time elapsed: 0.252 sec - in org.apache.activemq.openwire.v7.ProducerIdTest
Running org.apache.activemq.openwire.v7.ProducerInfoTest
Tests run: 1, Failures: 0, Errors: 0, Skipped: 0, Time elapsed: 0.269 sec - in org.apache.activemq.openwire.v7.ProducerInfoTest
Running org.apache.activemq.openwire.v7.RemoveInfoTest
Tests run: 1, Failures: 0, Errors: 0, Skipped: 0, Time elapsed: 0.213 sec - in org.apache.activemq.openwire.v7.RemoveInfoTest
Running org.apache.activemq.openwire.v7.RemoveSubscriptionInfoTest
Tests run: 1, Failures: 0, Errors: 0, Skipped: 0, Time elapsed: 0.276 sec - in org.apache.activemq.openwire.v7.RemoveSubscriptionInfoTest
Running org.apache.activemq.openwire.v7.ReplayCommandTest
Tests run: 1, Failures: 0, Errors: 0, Skipped: 0, Time elapsed: 0.246 sec - in org.apache.activemq.openwire.v7.ReplayCommandTest
Running org.apache.activemq.openwire.v7.ResponseTest
Tests run: 1, Failures: 0, Errors: 0, Skipped: 0, Time elapsed: 0.243 sec - in org.apache.activemq.openwire.v7.ResponseTest
Running org.apache.activemq.openwire.v7.SessionIdTest
Tests run: 1, Failures: 0, Errors: 0, Skipped: 0, Time elapsed: 0.284 sec - in org.apache.activemq.openwire.v7.SessionIdTest
Running org.apache.activemq.openwire.v7.SessionInfoTest
Tests run: 1, Failures: 0, Errors: 0, Skipped: 0, Time elapsed: 0.253 sec - in org.apache.activemq.openwire.v7.SessionInfoTest
Running org.apache.activemq.openwire.v7.ShutdownInfoTest
Tests run: 1, Failures: 0, Errors: 0, Skipped: 0, Time elapsed: 0.23 sec - in org.apache.activemq.openwire.v7.ShutdownInfoTest
Running org.apache.activemq.openwire.v7.SubscriptionInfoTest
Tests run: 1, Failures: 0, Errors: 0, Skipped: 0, Time elapsed: 0.236 sec - in org.apache.activemq.openwire.v7.SubscriptionInfoTest
Running org.apache.activemq.openwire.v7.TransactionInfoTest
Tests run: 1, Failures: 0, Errors: 0, Skipped: 0, Time elapsed: 0.259 sec - in org.apache.activemq.openwire.v7.TransactionInfoTest
Running org.apache.activemq.openwire.v7.XATransactionIdTest
Tests run: 1, Failures: 0, Errors: 0, Skipped: 0, Time elapsed: 0.222 sec - in org.apache.activemq.openwire.v7.XATransactionIdTest
Running org.apache.activemq.openwire.v8.BrokerIdTest
Tests run: 1, Failures: 0, Errors: 0, Skipped: 0, Time elapsed: 0.232 sec - in org.apache.activemq.openwire.v8.BrokerIdTest
Running org.apache.activemq.openwire.v8.BrokerInfoTest
Tests run: 1, Failures: 0, Errors: 0, Skipped: 0, Time elapsed: 0.259 sec - in org.apache.activemq.openwire.v8.BrokerInfoTest
Running org.apache.activemq.openwire.v8.ConnectionControlTest
Tests run: 1, Failures: 0, Errors: 0, Skipped: 0, Time elapsed: 0.292 sec - in org.apache.activemq.openwire.v8.ConnectionControlTest
Running org.apache.activemq.openwire.v8.ConnectionErrorTest
Tests run: 1, Failures: 0, Errors: 0, Skipped: 0, Time elapsed: 0.243 sec - in org.apache.activemq.openwire.v8.ConnectionErrorTest
Running org.apache.activemq.openwire.v8.ConnectionIdTest
Tests run: 1, Failures: 0, Errors: 0, Skipped: 0, Time elapsed: 0.251 sec - in org.apache.activemq.openwire.v8.ConnectionIdTest
Running org.apache.activemq.openwire.v8.ConnectionInfoTest
Tests run: 1, Failures: 0, Errors: 0, Skipped: 0, Time elapsed: 0.241 sec - in org.apache.activemq.openwire.v8.ConnectionInfoTest
Running org.apache.activemq.openwire.v8.ConsumerControlTest
Tests run: 1, Failures: 0, Errors: 0, Skipped: 0, Time elapsed: 0.316 sec - in org.apache.activemq.openwire.v8.ConsumerControlTest
Running org.apache.activemq.openwire.v8.ConsumerIdTest
Tests run: 1, Failures: 0, Errors: 0, Skipped: 0, Time elapsed: 0.248 sec - in org.apache.activemq.openwire.v8.ConsumerIdTest
Running org.apache.activemq.openwire.v8.ConsumerInfoTest
Tests run: 1, Failures: 0, Errors: 0, Skipped: 0, Time elapsed: 0.282 sec - in org.apache.activemq.openwire.v8.ConsumerInfoTest
Running org.apache.activemq.openwire.v8.ControlCommandTest
Tests run: 1, Failures: 0, Errors: 0, Skipped: 0, Time elapsed: 0.237 sec - in org.apache.activemq.openwire.v8.ControlCommandTest
Running org.apache.activemq.openwire.v8.DataArrayResponseTest
Tests run: 1, Failures: 0, Errors: 0, Skipped: 0, Time elapsed: 0.243 sec - in org.apache.activemq.openwire.v8.DataArrayResponseTest
Running org.apache.activemq.openwire.v8.DataResponseTest
Tests run: 1, Failures: 0, Errors: 0, Skipped: 0, Time elapsed: 0.241 sec - in org.apache.activemq.openwire.v8.DataResponseTest
Running org.apache.activemq.openwire.v8.DestinationInfoTest
Tests run: 1, Failures: 0, Errors: 0, Skipped: 0, Time elapsed: 0.238 sec - in org.apache.activemq.openwire.v8.DestinationInfoTest
Running org.apache.activemq.openwire.v8.DiscoveryEventTest
Tests run: 1, Failures: 0, Errors: 0, Skipped: 0, Time elapsed: 0.243 sec - in org.apache.activemq.openwire.v8.DiscoveryEventTest
Running org.apache.activemq.openwire.v8.ExceptionResponseTest
Tests run: 1, Failures: 0, Errors: 0, Skipped: 0, Time elapsed: 0.227 sec - in org.apache.activemq.openwire.v8.ExceptionResponseTest
Running org.apache.activemq.openwire.v8.FlushCommandTest
Tests run: 1, Failures: 0, Errors: 0, Skipped: 0, Time elapsed: 0.238 sec - in org.apache.activemq.openwire.v8.FlushCommandTest
Running org.apache.activemq.openwire.v8.IntegerResponseTest
Tests run: 1, Failures: 0, Errors: 0, Skipped: 0, Time elapsed: 0.273 sec - in org.apache.activemq.openwire.v8.IntegerResponseTest
Running org.apache.activemq.openwire.v8.JournalQueueAckTest
Tests run: 1, Failures: 0, Errors: 0, Skipped: 0, Time elapsed: 0.282 sec - in org.apache.activemq.openwire.v8.JournalQueueAckTest
Running org.apache.activemq.openwire.v8.JournalTopicAckTest
Tests run: 1, Failures: 0, Errors: 0, Skipped: 0, Time elapsed: 0.319 sec - in org.apache.activemq.openwire.v8.JournalTopicAckTest
Running org.apache.activemq.openwire.v8.JournalTraceTest
Tests run: 1, Failures: 0, Errors: 0, Skipped: 0, Time elapsed: 0.244 sec - in org.apache.activemq.openwire.v8.JournalTraceTest
Running org.apache.activemq.openwire.v8.JournalTransactionTest
Tests run: 1, Failures: 0, Errors: 0, Skipped: 0, Time elapsed: 0.298 sec - in org.apache.activemq.openwire.v8.JournalTransactionTest
Running org.apache.activemq.openwire.v8.KeepAliveInfoTest
Tests run: 1, Failures: 0, Errors: 0, Skipped: 0, Time elapsed: 0.262 sec - in org.apache.activemq.openwire.v8.KeepAliveInfoTest
Running org.apache.activemq.openwire.v8.LastPartialCommandTest
Tests run: 1, Failures: 0, Errors: 0, Skipped: 0, Time elapsed: 0.239 sec - in org.apache.activemq.openwire.v8.LastPartialCommandTest
Running org.apache.activemq.openwire.v8.LocalTransactionIdTest
Tests run: 1, Failures: 0, Errors: 0, Skipped: 0, Time elapsed: 0.209 sec - in org.apache.activemq.openwire.v8.LocalTransactionIdTest
Running org.apache.activemq.openwire.v8.MessageAckTest
Tests run: 1, Failures: 0, Errors: 0, Skipped: 0, Time elapsed: 0.276 sec - in org.apache.activemq.openwire.v8.MessageAckTest
Running org.apache.activemq.openwire.v8.MessageDispatchNotificationTest
Tests run: 1, Failures: 0, Errors: 0, Skipped: 0, Time elapsed: 0.348 sec - in org.apache.activemq.openwire.v8.MessageDispatchNotificationTest
Running org.apache.activemq.openwire.v8.MessageDispatchTest
Tests run: 1, Failures: 0, Errors: 0, Skipped: 0, Time elapsed: 0.307 sec - in org.apache.activemq.openwire.v8.MessageDispatchTest
Running org.apache.activemq.openwire.v8.MessageIdTest
Tests run: 1, Failures: 0, Errors: 0, Skipped: 0, Time elapsed: 0.281 sec - in org.apache.activemq.openwire.v8.MessageIdTest
Running org.apache.activemq.openwire.v8.MessagePullTest
Tests run: 1, Failures: 0, Errors: 0, Skipped: 0, Time elapsed: 0.278 sec - in org.apache.activemq.openwire.v8.MessagePullTest
Running org.apache.activemq.openwire.v8.NetworkBridgeFilterTest
Tests run: 1, Failures: 0, Errors: 0, Skipped: 0, Time elapsed: 0.35 sec - in org.apache.activemq.openwire.v8.NetworkBridgeFilterTest
Running org.apache.activemq.openwire.v8.PartialCommandTest
Tests run: 1, Failures: 0, Errors: 0, Skipped: 0, Time elapsed: 0.288 sec - in org.apache.activemq.openwire.v8.PartialCommandTest
Running org.apache.activemq.openwire.v8.ProducerAckTest
Tests run: 1, Failures: 0, Errors: 0, Skipped: 0, Time elapsed: 0.321 sec - in org.apache.activemq.openwire.v8.ProducerAckTest
Running org.apache.activemq.openwire.v8.ProducerIdTest
Tests run: 1, Failures: 0, Errors: 0, Skipped: 0, Time elapsed: 0.315 sec - in org.apache.activemq.openwire.v8.ProducerIdTest
Running org.apache.activemq.openwire.v8.ProducerInfoTest
Tests run: 1, Failures: 0, Errors: 0, Skipped: 0, Time elapsed: 0.296 sec - in org.apache.activemq.openwire.v8.ProducerInfoTest
Running org.apache.activemq.openwire.v8.RemoveInfoTest
Tests run: 1, Failures: 0, Errors: 0, Skipped: 0, Time elapsed: 0.247 sec - in org.apache.activemq.openwire.v8.RemoveInfoTest
Running org.apache.activemq.openwire.v8.RemoveSubscriptionInfoTest
Tests run: 1, Failures: 0, Errors: 0, Skipped: 0, Time elapsed: 0.314 sec - in org.apache.activemq.openwire.v8.RemoveSubscriptionInfoTest
Running org.apache.activemq.openwire.v8.ReplayCommandTest
Tests run: 1, Failures: 0, Errors: 0, Skipped: 0, Time elapsed: 0.292 sec - in org.apache.activemq.openwire.v8.ReplayCommandTest
Running org.apache.activemq.openwire.v8.ResponseTest
Tests run: 1, Failures: 0, Errors: 0, Skipped: 0, Time elapsed: 0.289 sec - in org.apache.activemq.openwire.v8.ResponseTest
Running org.apache.activemq.openwire.v8.SessionIdTest
Tests run: 1, Failures: 0, Errors: 0, Skipped: 0, Time elapsed: 0.315 sec - in org.apache.activemq.openwire.v8.SessionIdTest
Running org.apache.activemq.openwire.v8.SessionInfoTest
Tests run: 1, Failures: 0, Errors: 0, Skipped: 0, Time elapsed: 0.278 sec - in org.apache.activemq.openwire.v8.SessionInfoTest
Running org.apache.activemq.openwire.v8.ShutdownInfoTest
Tests run: 1, Failures: 0, Errors: 0, Skipped: 0, Time elapsed: 0.221 sec - in org.apache.activemq.openwire.v8.ShutdownInfoTest
Running org.apache.activemq.openwire.v8.SubscriptionInfoTest
Tests run: 1, Failures: 0, Errors: 0, Skipped: 0, Time elapsed: 0.312 sec - in org.apache.activemq.openwire.v8.SubscriptionInfoTest
Running org.apache.activemq.openwire.v8.TransactionInfoTest
Tests run: 1, Failures: 0, Errors: 0, Skipped: 0, Time elapsed: 0.297 sec - in org.apache.activemq.openwire.v8.TransactionInfoTest
Running org.apache.activemq.openwire.v8.XATransactionIdTest
Tests run: 1, Failures: 0, Errors: 0, Skipped: 0, Time elapsed: 0.321 sec - in org.apache.activemq.openwire.v8.XATransactionIdTest
Running org.apache.activemq.openwire.v9.BrokerIdTest
Tests run: 1, Failures: 0, Errors: 0, Skipped: 0, Time elapsed: 0.224 sec - in org.apache.activemq.openwire.v9.BrokerIdTest
Running org.apache.activemq.openwire.v9.BrokerInfoTest
Tests run: 1, Failures: 0, Errors: 0, Skipped: 0, Time elapsed: 0.315 sec - in org.apache.activemq.openwire.v9.BrokerInfoTest
Running org.apache.activemq.openwire.v9.ConnectionControlTest
Tests run: 1, Failures: 0, Errors: 0, Skipped: 0, Time elapsed: 0.256 sec - in org.apache.activemq.openwire.v9.ConnectionControlTest
Running org.apache.activemq.openwire.v9.ConnectionErrorTest
Tests run: 1, Failures: 0, Errors: 0, Skipped: 0, Time elapsed: 0.321 sec - in org.apache.activemq.openwire.v9.ConnectionErrorTest
Running org.apache.activemq.openwire.v9.ConnectionIdTest
Tests run: 1, Failures: 0, Errors: 0, Skipped: 0, Time elapsed: 0.29 sec - in org.apache.activemq.openwire.v9.ConnectionIdTest
Running org.apache.activemq.openwire.v9.ConnectionInfoTest
Tests run: 1, Failures: 0, Errors: 0, Skipped: 0, Time elapsed: 0.296 sec - in org.apache.activemq.openwire.v9.ConnectionInfoTest
Running org.apache.activemq.openwire.v9.ConsumerControlTest
Tests run: 1, Failures: 0, Errors: 0, Skipped: 0, Time elapsed: 0.265 sec - in org.apache.activemq.openwire.v9.ConsumerControlTest
Running org.apache.activemq.openwire.v9.ConsumerIdTest
Tests run: 1, Failures: 0, Errors: 0, Skipped: 0, Time elapsed: 0.227 sec - in org.apache.activemq.openwire.v9.ConsumerIdTest
Running org.apache.activemq.openwire.v9.ConsumerInfoTest
Tests run: 1, Failures: 0, Errors: 0, Skipped: 0, Time elapsed: 0.365 sec - in org.apache.activemq.openwire.v9.ConsumerInfoTest
Running org.apache.activemq.openwire.v9.ControlCommandTest
Tests run: 1, Failures: 0, Errors: 0, Skipped: 0, Time elapsed: 0.281 sec - in org.apache.activemq.openwire.v9.ControlCommandTest
Running org.apache.activemq.openwire.v9.DataArrayResponseTest
Tests run: 1, Failures: 0, Errors: 0, Skipped: 0, Time elapsed: 0.323 sec - in org.apache.activemq.openwire.v9.DataArrayResponseTest
Running org.apache.activemq.openwire.v9.DataResponseTest
Tests run: 1, Failures: 0, Errors: 0, Skipped: 0, Time elapsed: 0.251 sec - in org.apache.activemq.openwire.v9.DataResponseTest
Running org.apache.activemq.openwire.v9.DestinationInfoTest
Tests run: 1, Failures: 0, Errors: 0, Skipped: 0, Time elapsed: 0.286 sec - in org.apache.activemq.openwire.v9.DestinationInfoTest
Running org.apache.activemq.openwire.v9.DiscoveryEventTest
Tests run: 1, Failures: 0, Errors: 0, Skipped: 0, Time elapsed: 0.268 sec - in org.apache.activemq.openwire.v9.DiscoveryEventTest
Running org.apache.activemq.openwire.v9.ExceptionResponseTest
Tests run: 1, Failures: 0, Errors: 0, Skipped: 0, Time elapsed: 0.227 sec - in org.apache.activemq.openwire.v9.ExceptionResponseTest
Running org.apache.activemq.openwire.v9.FlushCommandTest
Tests run: 1, Failures: 0, Errors: 0, Skipped: 0, Time elapsed: 0.327 sec - in org.apache.activemq.openwire.v9.FlushCommandTest
Running org.apache.activemq.openwire.v9.IntegerResponseTest
Tests run: 1, Failures: 0, Errors: 0, Skipped: 0, Time elapsed: 0.307 sec - in org.apache.activemq.openwire.v9.IntegerResponseTest
Running org.apache.activemq.openwire.v9.JournalQueueAckTest
Tests run: 1, Failures: 0, Errors: 0, Skipped: 0, Time elapsed: 0.366 sec - in org.apache.activemq.openwire.v9.JournalQueueAckTest
Running org.apache.activemq.openwire.v9.JournalTopicAckTest
Tests run: 1, Failures: 0, Errors: 0, Skipped: 0, Time elapsed: 0.253 sec - in org.apache.activemq.openwire.v9.JournalTopicAckTest
Running org.apache.activemq.openwire.v9.JournalTraceTest
Tests run: 1, Failures: 0, Errors: 0, Skipped: 0, Time elapsed: 0.291 sec - in org.apache.activemq.openwire.v9.JournalTraceTest
Running org.apache.activemq.openwire.v9.JournalTransactionTest
Tests run: 1, Failures: 0, Errors: 0, Skipped: 0, Time elapsed: 0.35 sec - in org.apache.activemq.openwire.v9.JournalTransactionTest
Running org.apache.activemq.openwire.v9.KeepAliveInfoTest
Tests run: 1, Failures: 0, Errors: 0, Skipped: 0, Time elapsed: 0.235 sec - in org.apache.activemq.openwire.v9.KeepAliveInfoTest
Running org.apache.activemq.openwire.v9.LastPartialCommandTest
Tests run: 1, Failures: 0, Errors: 0, Skipped: 0, Time elapsed: 0.277 sec - in org.apache.activemq.openwire.v9.LastPartialCommandTest
Running org.apache.activemq.openwire.v9.LocalTransactionIdTest
Tests run: 1, Failures: 0, Errors: 0, Skipped: 0, Time elapsed: 0.298 sec - in org.apache.activemq.openwire.v9.LocalTransactionIdTest
Running org.apache.activemq.openwire.v9.MessageAckTest
Tests run: 1, Failures: 0, Errors: 0, Skipped: 0, Time elapsed: 0.382 sec - in org.apache.activemq.openwire.v9.MessageAckTest
Running org.apache.activemq.openwire.v9.MessageDispatchNotificationTest
Tests run: 1, Failures: 0, Errors: 0, Skipped: 0, Time elapsed: 0.316 sec - in org.apache.activemq.openwire.v9.MessageDispatchNotificationTest
Running org.apache.activemq.openwire.v9.MessageDispatchTest
Tests run: 1, Failures: 0, Errors: 0, Skipped: 0, Time elapsed: 0.325 sec - in org.apache.activemq.openwire.v9.MessageDispatchTest
Running org.apache.activemq.openwire.v9.MessageIdTest
Tests run: 1, Failures: 0, Errors: 0, Skipped: 0, Time elapsed: 0.252 sec - in org.apache.activemq.openwire.v9.MessageIdTest
Running org.apache.activemq.openwire.v9.MessagePullTest
Tests run: 1, Failures: 0, Errors: 0, Skipped: 0, Time elapsed: 0.313 sec - in org.apache.activemq.openwire.v9.MessagePullTest
Running org.apache.activemq.openwire.v9.NetworkBridgeFilterTest
Tests run: 1, Failures: 0, Errors: 0, Skipped: 0, Time elapsed: 0.341 sec - in org.apache.activemq.openwire.v9.NetworkBridgeFilterTest
Running org.apache.activemq.openwire.v9.PartialCommandTest
Tests run: 1, Failures: 0, Errors: 0, Skipped: 0, Time elapsed: 0.236 sec - in org.apache.activemq.openwire.v9.PartialCommandTest
Running org.apache.activemq.openwire.v9.ProducerAckTest
Tests run: 1, Failures: 0, Errors: 0, Skipped: 0, Time elapsed: 0.268 sec - in org.apache.activemq.openwire.v9.ProducerAckTest
Running org.apache.activemq.openwire.v9.ProducerIdTest
Tests run: 1, Failures: 0, Errors: 0, Skipped: 0, Time elapsed: 0.223 sec - in org.apache.activemq.openwire.v9.ProducerIdTest
Running org.apache.activemq.openwire.v9.ProducerInfoTest
Tests run: 1, Failures: 0, Errors: 0, Skipped: 0, Time elapsed: 0.279 sec - in org.apache.activemq.openwire.v9.ProducerInfoTest
Running org.apache.activemq.openwire.v9.RemoveInfoTest
Tests run: 1, Failures: 0, Errors: 0, Skipped: 0, Time elapsed: 0.255 sec - in org.apache.activemq.openwire.v9.RemoveInfoTest
Running org.apache.activemq.openwire.v9.RemoveSubscriptionInfoTest
Tests run: 1, Failures: 0, Errors: 0, Skipped: 0, Time elapsed: 0.275 sec - in org.apache.activemq.openwire.v9.RemoveSubscriptionInfoTest
Running org.apache.activemq.openwire.v9.ReplayCommandTest
Tests run: 1, Failures: 0, Errors: 0, Skipped: 0, Time elapsed: 0.302 sec - in org.apache.activemq.openwire.v9.ReplayCommandTest
Running org.apache.activemq.openwire.v9.ResponseTest
Tests run: 1, Failures: 0, Errors: 0, Skipped: 0, Time elapsed: 0.276 sec - in org.apache.activemq.openwire.v9.ResponseTest
Running org.apache.activemq.openwire.v9.SessionIdTest
Tests run: 1, Failures: 0, Errors: 0, Skipped: 0, Time elapsed: 0.307 sec - in org.apache.activemq.openwire.v9.SessionIdTest
[locks-and-latches] Releasing all the locks
[locks-and-latches] All the locks released
ERROR: Failed to parse POMs
java.io.IOException: Backing channel 'H24' is disconnected.
        at hudson.remoting.RemoteInvocationHandler.channelOrFail(RemoteInvocationHandler.java:192)
        at hudson.remoting.RemoteInvocationHandler.invoke(RemoteInvocationHandler.java:257)
        at com.sun.proxy.$Proxy197.isAlive(Unknown Source)
        at hudson.Launcher$RemoteLauncher$ProcImpl.isAlive(Launcher.java:1043)
        at hudson.maven.ProcessCache$MavenProcess.call(ProcessCache.java:166)
        at hudson.maven.MavenModuleSetBuild$MavenModuleSetBuildExecution.doRun(MavenModuleSetBuild.java:878)
        at hudson.model.AbstractBuild$AbstractBuildExecution.run(AbstractBuild.java:534)
        at hudson.model.Run.execute(Run.java:1728)
        at hudson.maven.MavenModuleSetBuild.run(MavenModuleSetBuild.java:542)
        at hudson.model.ResourceController.execute(ResourceController.java:98)
        at hudson.model.Executor.run(Executor.java:405)
Caused by: hudson.remoting.Channel$OrderlyShutdown: hudson.remoting.ProxyException: java.util.concurrent.TimeoutException: Ping started at 1499848746290 hasn't completed by 1499848986291
        at hudson.remoting.Channel$CloseCommand.execute(Channel.java:1129)
        at hudson.remoting.Channel$1.handle(Channel.java:527)
        at hudson.remoting.SynchronousCommandTransport$ReaderThread.run(SynchronousCommandTransport.java:83)
Caused by: Command close created at
        at hudson.remoting.Command.<init>(Command.java:60)
        at hudson.remoting.Channel$CloseCommand.<init>(Channel.java:1123)
        at hudson.remoting.Channel$CloseCommand.<init>(Channel.java:1121)
        at hudson.remoting.Channel.close(Channel.java:1281)
        at hudson.slaves.ChannelPinger$1.onDead(ChannelPinger.java:180)
        at hudson.remoting.PingThread.ping(PingThread.java:130)
        at hudson.remoting.PingThread.run(PingThread.java:86)
Caused by: hudson.remoting.ProxyException: java.util.concurrent.TimeoutException: Ping started at 1499848746290 hasn't completed by 1499848986291
        ... 2 more
ERROR: H24 is offline; cannot locate JDK 1.8 (latest)
ERROR: H24 is offline; cannot locate Maven 3.3.9

Reply | Threaded
Open this post in threaded view
|  
Report Content as Inappropriate

Jenkins build is unstable: ActiveMQ-Java8-All-UnitTests #712

Apache Jenkins Server-2
Reply | Threaded
Open this post in threaded view
|  
Report Content as Inappropriate

Jenkins build is still unstable: ActiveMQ-Java8-All-UnitTests #713

Apache Jenkins Server-2
Loading...