Build failed in Jenkins: ActiveMQ-Java8 #1037

Previous Topic Next Topic
 
classic Classic list List threaded Threaded
7 messages Options
Reply | Threaded
Open this post in threaded view
|  
Report Content as Inappropriate

Build failed in Jenkins: ActiveMQ-Java8 #1037

Apache Jenkins Server-2
See <https://builds.apache.org/job/ActiveMQ-Java8/1037/display/redirect?page=changes>

Changes:

[christopher.l.shannon] AMQ-6704 - update Jackson to latest bug fix release

[christopher.l.shannon] AMQ-6704 - update javase javadoc url to java 8

[christopher.l.shannon] AMQ-6704 - updating xstream and slf4j

------------------------------------------
[...truncated 320.26 KB...]
Tests run: 2, Failures: 0, Errors: 0, Skipped: 0, Time elapsed: 0.38 sec - in org.apache.activemq.transport.tcp.SslTransportServerTest
Running org.apache.activemq.transport.tcp.SslTransportTest
Tests run: 1, Failures: 0, Errors: 0, Skipped: 0, Time elapsed: 0.222 sec - in org.apache.activemq.transport.tcp.SslTransportTest
Running org.apache.activemq.transport.tcp.TcpTransportBindTest
Tests run: 2, Failures: 0, Errors: 0, Skipped: 0, Time elapsed: 2.69 sec - in org.apache.activemq.transport.tcp.TcpTransportBindTest
Running org.apache.activemq.transport.tcp.TcpTransportCloseSocketTest
Tests run: 4, Failures: 0, Errors: 0, Skipped: 0, Time elapsed: 13.848 sec - in org.apache.activemq.transport.tcp.TcpTransportCloseSocketTest
Running org.apache.activemq.transport.tcp.TcpTransportServerTest
Tests run: 1, Failures: 0, Errors: 0, Skipped: 0, Time elapsed: 0.464 sec - in org.apache.activemq.transport.tcp.TcpTransportServerTest
Running org.apache.activemq.transport.tcp.TransportConnectorInvalidSocketOptionsTest
Tests run: 2, Failures: 0, Errors: 0, Skipped: 0, Time elapsed: 1.667 sec - in org.apache.activemq.transport.tcp.TransportConnectorInvalidSocketOptionsTest
Running org.apache.activemq.transport.tcp.TransportUriTest
Tests run: 14, Failures: 0, Errors: 0, Skipped: 0, Time elapsed: 3.354 sec - in org.apache.activemq.transport.tcp.TransportUriTest
Running org.apache.activemq.transport.tcp.WireformatNegociationTest
Tests run: 5, Failures: 0, Errors: 0, Skipped: 0, Time elapsed: 0.95 sec - in org.apache.activemq.transport.tcp.WireformatNegociationTest
Running org.apache.activemq.transport.udp.UdpSendReceiveWithTwoConnectionsAndLargeMessagesTest
Tests run: 1, Failures: 0, Errors: 0, Skipped: 0, Time elapsed: 1.746 sec - in org.apache.activemq.transport.udp.UdpSendReceiveWithTwoConnectionsAndLargeMessagesTest
Running org.apache.activemq.transport.udp.UdpSendReceiveWithTwoConnectionsTest
Tests run: 1, Failures: 0, Errors: 0, Skipped: 0, Time elapsed: 2.045 sec - in org.apache.activemq.transport.udp.UdpSendReceiveWithTwoConnectionsTest
Running org.apache.activemq.transport.udp.UdpTransportTest
Tests run: 3, Failures: 0, Errors: 0, Skipped: 0, Time elapsed: 0.712 sec - in org.apache.activemq.transport.udp.UdpTransportTest
Running org.apache.activemq.transport.udp.UdpTransportUsingServerTest
Tests run: 4, Failures: 0, Errors: 0, Skipped: 0, Time elapsed: 0.633 sec - in org.apache.activemq.transport.udp.UdpTransportUsingServerTest
Running org.apache.activemq.transport.udp.UpdTransportBindTest
Tests run: 1, Failures: 0, Errors: 0, Skipped: 0, Time elapsed: 2.128 sec - in org.apache.activemq.transport.udp.UpdTransportBindTest
Running org.apache.activemq.transport.vm.VMTransportBrokerTest
Tests run: 127, Failures: 0, Errors: 0, Skipped: 0, Time elapsed: 23.295 sec - in org.apache.activemq.transport.vm.VMTransportBrokerTest
Running org.apache.activemq.transport.vm.VMTransportEmbeddedBrokerTest
Tests run: 1, Failures: 0, Errors: 0, Skipped: 0, Time elapsed: 1.889 sec - in org.apache.activemq.transport.vm.VMTransportEmbeddedBrokerTest
Running org.apache.activemq.transport.vm.VMTransportThreadSafeTest
Tests run: 19, Failures: 0, Errors: 0, Skipped: 0, Time elapsed: 88.141 sec - in org.apache.activemq.transport.vm.VMTransportThreadSafeTest
Running org.apache.activemq.usage.CompositeMessageCursorUsageTest
Tests run: 1, Failures: 0, Errors: 0, Skipped: 0, Time elapsed: 1.904 sec - in org.apache.activemq.usage.CompositeMessageCursorUsageTest
Running org.apache.activemq.usage.JobSchedulerStoreUsageTest
Tests run: 1, Failures: 0, Errors: 0, Skipped: 0, Time elapsed: 5.587 sec - in org.apache.activemq.usage.JobSchedulerStoreUsageTest
Running org.apache.activemq.usage.PercentDiskUsageLimitTest
Tests run: 4, Failures: 0, Errors: 0, Skipped: 0, Time elapsed: 5.681 sec - in org.apache.activemq.usage.PercentDiskUsageLimitTest
Running org.apache.activemq.usage.PeriodicDiskUsageLimitTest
Tests run: 6, Failures: 0, Errors: 0, Skipped: 0, Time elapsed: 35.217 sec - in org.apache.activemq.usage.PeriodicDiskUsageLimitTest
Running org.apache.activemq.usage.StoreUsageLimitsTest
Tests run: 2, Failures: 0, Errors: 0, Skipped: 0, Time elapsed: 1.504 sec - in org.apache.activemq.usage.StoreUsageLimitsTest
Running org.apache.activemq.usecases.AMQ5153LevelDBSubscribedDestTest
Tests run: 1, Failures: 0, Errors: 0, Skipped: 0, Time elapsed: 3.511 sec - in org.apache.activemq.usecases.AMQ5153LevelDBSubscribedDestTest
Running org.apache.activemq.usecases.AMQ6366Test
Tests run: 2, Failures: 0, Errors: 0, Skipped: 0, Time elapsed: 23.137 sec - in org.apache.activemq.usecases.AMQ6366Test
Running org.apache.activemq.usecases.AMQ6446Test
Tests run: 2, Failures: 0, Errors: 0, Skipped: 0, Time elapsed: 1.914 sec - in org.apache.activemq.usecases.AMQ6446Test
Running org.apache.activemq.usecases.AMQ6477Test
Tests run: 6, Failures: 0, Errors: 0, Skipped: 0, Time elapsed: 5.453 sec - in org.apache.activemq.usecases.AMQ6477Test
Running org.apache.activemq.usecases.AdvisoryTopicDeletionTest
Tests run: 2, Failures: 0, Errors: 0, Skipped: 0, Time elapsed: 2.055 sec - in org.apache.activemq.usecases.AdvisoryTopicDeletionTest
Running org.apache.activemq.usecases.AdvisoryViaNetworkTest
Tests run: 10, Failures: 0, Errors: 0, Skipped: 0, Time elapsed: 26.013 sec - in org.apache.activemq.usecases.AdvisoryViaNetworkTest
Running org.apache.activemq.usecases.AuthorizationFromAdminViewTest
Tests run: 1, Failures: 0, Errors: 0, Skipped: 0, Time elapsed: 1.742 sec - in org.apache.activemq.usecases.AuthorizationFromAdminViewTest
Running org.apache.activemq.usecases.BacklogNetworkCrossTalkTest
Tests run: 1, Failures: 0, Errors: 0, Skipped: 0, Time elapsed: 9.491 sec - in org.apache.activemq.usecases.BacklogNetworkCrossTalkTest
Running org.apache.activemq.usecases.BatchedMessagePriorityConsumerTest
Tests run: 2, Failures: 0, Errors: 0, Skipped: 0, Time elapsed: 4.304 sec - in org.apache.activemq.usecases.BatchedMessagePriorityConsumerTest
Running org.apache.activemq.usecases.BrokerQueueNetworkWithDisconnectTest
Tests run: 4, Failures: 0, Errors: 0, Skipped: 0, Time elapsed: 80.819 sec - in org.apache.activemq.usecases.BrokerQueueNetworkWithDisconnectTest
Running org.apache.activemq.usecases.BrowseDLQTest
Tests run: 1, Failures: 0, Errors: 0, Skipped: 0, Time elapsed: 5.663 sec - in org.apache.activemq.usecases.BrowseDLQTest
Running org.apache.activemq.usecases.ChangeSentMessageTest
Tests run: 1, Failures: 0, Errors: 0, Skipped: 0, Time elapsed: 2.236 sec - in org.apache.activemq.usecases.ChangeSentMessageTest
Running org.apache.activemq.usecases.ChangeSessionDeliveryModeTest
Tests run: 1, Failures: 0, Errors: 0, Skipped: 0, Time elapsed: 1.66 sec - in org.apache.activemq.usecases.ChangeSessionDeliveryModeTest
Running org.apache.activemq.usecases.CompositeConsumeTest
Tests run: 1, Failures: 0, Errors: 0, Skipped: 0, Time elapsed: 1.968 sec - in org.apache.activemq.usecases.CompositeConsumeTest
Running org.apache.activemq.usecases.ConsumeQueuePrefetchTest
Tests run: 4, Failures: 0, Errors: 0, Skipped: 0, Time elapsed: 3.008 sec - in org.apache.activemq.usecases.ConsumeQueuePrefetchTest
Running org.apache.activemq.usecases.ConsumeTopicPrefetchTest
Tests run: 3, Failures: 0, Errors: 0, Skipped: 0, Time elapsed: 3.769 sec - in org.apache.activemq.usecases.ConsumeTopicPrefetchTest
Running org.apache.activemq.usecases.CreateTemporaryQueueBeforeStartTest
Tests run: 3, Failures: 0, Errors: 0, Skipped: 0, Time elapsed: 2.61 sec - in org.apache.activemq.usecases.CreateTemporaryQueueBeforeStartTest
Running org.apache.activemq.usecases.DuplexAdvisoryRaceTest
Tests run: 1, Failures: 0, Errors: 0, Skipped: 0, Time elapsed: 165.447 sec - in org.apache.activemq.usecases.DuplexAdvisoryRaceTest
Running org.apache.activemq.usecases.DurableSubCacheTest
Tests run: 2, Failures: 0, Errors: 0, Skipped: 0, Time elapsed: 3.511 sec - in org.apache.activemq.usecases.DurableSubCacheTest
Running org.apache.activemq.usecases.DurableSubInBrokerNetworkTest
Tests run: 2, Failures: 0, Errors: 0, Skipped: 0, Time elapsed: 2.809 sec - in org.apache.activemq.usecases.DurableSubInBrokerNetworkTest
Running org.apache.activemq.usecases.DurableSubProcessConcurrentCommitActivateNoDuplicateTest
Tests run: 1, Failures: 0, Errors: 0, Skipped: 1, Time elapsed: 0.305 sec - in org.apache.activemq.usecases.DurableSubProcessConcurrentCommitActivateNoDuplicateTest
Running org.apache.activemq.usecases.DurableSubProcessWithRestartTest
Tests run: 1, Failures: 0, Errors: 0, Skipped: 1, Time elapsed: 0.239 sec - in org.apache.activemq.usecases.DurableSubProcessWithRestartTest
Running org.apache.activemq.usecases.DurableSubsOfflineSelectorConcurrentConsumeIndexUseTest
Tests run: 1, Failures: 0, Errors: 0, Skipped: 0, Time elapsed: 17.533 sec - in org.apache.activemq.usecases.DurableSubsOfflineSelectorConcurrentConsumeIndexUseTest
Running org.apache.activemq.usecases.DurableSubsOfflineSelectorIndexUseTest
Tests run: 3, Failures: 0, Errors: 0, Skipped: 0, Time elapsed: 25.636 sec - in org.apache.activemq.usecases.DurableSubsOfflineSelectorIndexUseTest
Running org.apache.activemq.usecases.DurableSubscriberWithNetworkRestartTest
Tests run: 2, Failures: 0, Errors: 0, Skipped: 0, Time elapsed: 14.818 sec - in org.apache.activemq.usecases.DurableSubscriberWithNetworkRestartTest
Running org.apache.activemq.usecases.DurableSubscriptionOffline1Test
Tests run: 18, Failures: 0, Errors: 0, Skipped: 0, Time elapsed: 122.994 sec - in org.apache.activemq.usecases.DurableSubscriptionOffline1Test
Running org.apache.activemq.usecases.DurableSubscriptionOffline2Test
Tests run: 2, Failures: 0, Errors: 0, Skipped: 0, Time elapsed: 5.749 sec - in org.apache.activemq.usecases.DurableSubscriptionOffline2Test
Running org.apache.activemq.usecases.DurableSubscriptionOffline3Test
Tests run: 12, Failures: 0, Errors: 0, Skipped: 0, Time elapsed: 123.742 sec - in org.apache.activemq.usecases.DurableSubscriptionOffline3Test
Running org.apache.activemq.usecases.DurableSubscriptionOffline4Test
Tests run: 2, Failures: 0, Errors: 0, Skipped: 0, Time elapsed: 7.265 sec - in org.apache.activemq.usecases.DurableSubscriptionOffline4Test
Running org.apache.activemq.usecases.DurableSubscriptionOfflineBrowseRemoveTest
Tests run: 4, Failures: 0, Errors: 0, Skipped: 0, Time elapsed: 9.616 sec - in org.apache.activemq.usecases.DurableSubscriptionOfflineBrowseRemoveTest
Running org.apache.activemq.usecases.DurableSubscriptionUpdatesTest
Tests run: 3, Failures: 0, Errors: 0, Skipped: 0, Time elapsed: 11.71 sec - in org.apache.activemq.usecases.DurableSubscriptionUpdatesTest
Running org.apache.activemq.usecases.DurableSubscriptionWithNoLocalTest
Tests run: 14, Failures: 0, Errors: 0, Skipped: 0, Time elapsed: 49.124 sec - in org.apache.activemq.usecases.DurableSubscriptionWithNoLocalTest
Running org.apache.activemq.usecases.ExceptionListenerTest
Tests run: 2, Failures: 0, Errors: 0, Skipped: 0, Time elapsed: 3.973 sec - in org.apache.activemq.usecases.ExceptionListenerTest
Running org.apache.activemq.usecases.LevelDBDurableSubscriptionTest
Tests run: 12, Failures: 0, Errors: 0, Skipped: 0, Time elapsed: 29.73 sec - in org.apache.activemq.usecases.LevelDBDurableSubscriptionTest
Running org.apache.activemq.usecases.ManagedDurableSubscriptionTest
Tests run: 1, Failures: 0, Errors: 0, Skipped: 0, Time elapsed: 3.036 sec - in org.apache.activemq.usecases.ManagedDurableSubscriptionTest
Running org.apache.activemq.usecases.MemoryLimitTest
Tests run: 9, Failures: 0, Errors: 0, Skipped: 3, Time elapsed: 34.967 sec - in org.apache.activemq.usecases.MemoryLimitTest
Running org.apache.activemq.usecases.MessageGroupLateArrivalsTest
Tests run: 2, Failures: 0, Errors: 0, Skipped: 0, Time elapsed: 3.066 sec - in org.apache.activemq.usecases.MessageGroupLateArrivalsTest
Running org.apache.activemq.usecases.MessageGroupReconnectDistributionTest
Tests run: 2, Failures: 0, Errors: 0, Skipped: 0, Time elapsed: 37.426 sec - in org.apache.activemq.usecases.MessageGroupReconnectDistributionTest
Running org.apache.activemq.usecases.NetworkBrokerNameColonTest
Tests run: 1, Failures: 0, Errors: 0, Skipped: 0, Time elapsed: 3.717 sec - in org.apache.activemq.usecases.NetworkBrokerNameColonTest
Running org.apache.activemq.usecases.NewConsumerCreatesDestinationTest
Tests run: 1, Failures: 0, Errors: 0, Skipped: 0, Time elapsed: 2.017 sec - in org.apache.activemq.usecases.NewConsumerCreatesDestinationTest
Running org.apache.activemq.usecases.ObjectMessageNotSerializableTest
Tests run: 2, Failures: 0, Errors: 0, Skipped: 0, Time elapsed: 1.922 sec - in org.apache.activemq.usecases.ObjectMessageNotSerializableTest
Running org.apache.activemq.usecases.OfflineDurableSubscriberTimeoutTest
Tests run: 1, Failures: 0, Errors: 0, Skipped: 0, Time elapsed: 12.358 sec - in org.apache.activemq.usecases.OfflineDurableSubscriberTimeoutTest
Running org.apache.activemq.usecases.PriorityRedeliveryOrderTest
Tests run: 1, Failures: 0, Errors: 0, Skipped: 0, Time elapsed: 6.685 sec - in org.apache.activemq.usecases.PriorityRedeliveryOrderTest
Running org.apache.activemq.usecases.PublishOnDurableTopicConsumedMessageTest
Tests run: 1, Failures: 0, Errors: 0, Skipped: 0, Time elapsed: 2.379 sec - in org.apache.activemq.usecases.PublishOnDurableTopicConsumedMessageTest
Running org.apache.activemq.usecases.PublishOnQueueConsumedMessageTest
Tests run: 1, Failures: 0, Errors: 0, Skipped: 0, Time elapsed: 2.145 sec - in org.apache.activemq.usecases.PublishOnQueueConsumedMessageTest
Running org.apache.activemq.usecases.PublishOnTemporaryQueueConsumedMessageTest
Tests run: 1, Failures: 0, Errors: 0, Skipped: 0, Time elapsed: 2.525 sec - in org.apache.activemq.usecases.PublishOnTemporaryQueueConsumedMessageTest
Running org.apache.activemq.usecases.QueueBrowsingLevelDBTest
Tests run: 3, Failures: 0, Errors: 0, Skipped: 0, Time elapsed: 7.629 sec - in org.apache.activemq.usecases.QueueBrowsingLevelDBTest
Running org.apache.activemq.usecases.QueueBrowsingLimitTest
Tests run: 1, Failures: 0, Errors: 0, Skipped: 0, Time elapsed: 4.308 sec - in org.apache.activemq.usecases.QueueBrowsingLimitTest
Running org.apache.activemq.usecases.QueueBrowsingTest
Tests run: 3, Failures: 0, Errors: 0, Skipped: 0, Time elapsed: 7.275 sec - in org.apache.activemq.usecases.QueueBrowsingTest
Running org.apache.activemq.usecases.QueueOrderSingleTransactedConsumerTest
Tests run: 4, Failures: 0, Errors: 0, Skipped: 0, Time elapsed: 6.441 sec - in org.apache.activemq.usecases.QueueOrderSingleTransactedConsumerTest
Running org.apache.activemq.usecases.QueueRepeaterTest
Tests run: 1, Failures: 0, Errors: 0, Skipped: 0, Time elapsed: 1.939 sec - in org.apache.activemq.usecases.QueueRepeaterTest
Running org.apache.activemq.usecases.QueueZeroPrefetchLazyDispatchPriorityTest
Tests run: 5, Failures: 0, Errors: 1, Skipped: 0, Time elapsed: 54.127 sec <<< FAILURE! - in org.apache.activemq.usecases.QueueZeroPrefetchLazyDispatchPriorityTest
testPriorityMessages(org.apache.activemq.usecases.QueueZeroPrefetchLazyDispatchPriorityTest)  Time elapsed: 9.859 sec  <<< ERROR!
java.lang.IndexOutOfBoundsException: Index: 0, Size: 0
        at java.util.ArrayList.rangeCheck(ArrayList.java:653)
        at java.util.ArrayList.get(ArrayList.java:429)
        at org.apache.activemq.usecases.QueueZeroPrefetchLazyDispatchPriorityTest.testPriorityMessages(QueueZeroPrefetchLazyDispatchPriorityTest.java:90)

Running org.apache.activemq.usecases.RequestReplyTempDestRemovalAdvisoryRaceTest
Tests run: 8, Failures: 0, Errors: 0, Skipped: 0, Time elapsed: 123.061 sec - in org.apache.activemq.usecases.RequestReplyTempDestRemovalAdvisoryRaceTest
Running org.apache.activemq.usecases.RequestReplyToTopicViaThreeNetworkHopsTest
Tests run: 1, Failures: 0, Errors: 0, Skipped: 0, Time elapsed: 13.466 sec - in org.apache.activemq.usecases.RequestReplyToTopicViaThreeNetworkHopsTest
Running org.apache.activemq.usecases.SingleBrokerVirtualDestinationsWithWildcardLevelDBTest
Tests run: 4, Failures: 1, Errors: 0, Skipped: 0, Time elapsed: 45.401 sec <<< FAILURE! - in org.apache.activemq.usecases.SingleBrokerVirtualDestinationsWithWildcardLevelDBTest
testVirtualDestinationsWithWildcardWithVirtualQueuePreCreated(org.apache.activemq.usecases.SingleBrokerVirtualDestinationsWithWildcardLevelDBTest)  Time elapsed: 11.035 sec  <<< FAILURE!
junit.framework.AssertionFailedError: expected:<1> but was:<0>
        at junit.framework.Assert.fail(Assert.java:57)
        at junit.framework.Assert.failNotEquals(Assert.java:329)
        at junit.framework.Assert.assertEquals(Assert.java:78)
        at junit.framework.Assert.assertEquals(Assert.java:234)
        at junit.framework.Assert.assertEquals(Assert.java:241)
        at junit.framework.TestCase.assertEquals(TestCase.java:409)
        at org.apache.activemq.usecases.SingleBrokerVirtualDestinationsWithWildcardTest.sendReceive(SingleBrokerVirtualDestinationsWithWildcardTest.java:96)
        at org.apache.activemq.usecases.SingleBrokerVirtualDestinationsWithWildcardTest.testVirtualDestinationsWithWildcardWithVirtualQueuePreCreated(SingleBrokerVirtualDestinationsWithWildcardTest.java:85)
        at sun.reflect.NativeMethodAccessorImpl.invoke0(Native Method)
        at sun.reflect.NativeMethodAccessorImpl.invoke(NativeMethodAccessorImpl.java:62)
        at sun.reflect.DelegatingMethodAccessorImpl.invoke(DelegatingMethodAccessorImpl.java:43)
        at java.lang.reflect.Method.invoke(Method.java:498)
        at junit.framework.TestCase.runTest(TestCase.java:176)
        at junit.framework.TestCase.runBare(TestCase.java:141)
        at org.apache.activemq.CombinationTestSupport.runBare(CombinationTestSupport.java:107)
        at org.apache.activemq.CombinationTestSupport.runBare(CombinationTestSupport.java:113)
        at junit.framework.TestResult$1.protect(TestResult.java:122)
        at junit.framework.TestResult.runProtected(TestResult.java:142)
        at junit.framework.TestResult.run(TestResult.java:125)
        at junit.framework.TestCase.run(TestCase.java:129)
        at junit.framework.TestSuite.runTest(TestSuite.java:252)
        at junit.framework.TestSuite.run(TestSuite.java:247)
        at org.junit.internal.runners.JUnit38ClassRunner.run(JUnit38ClassRunner.java:86)
        at org.apache.maven.surefire.junit4.JUnit4Provider.execute(JUnit4Provider.java:264)
        at org.apache.maven.surefire.junit4.JUnit4Provider.executeTestSet(JUnit4Provider.java:153)
        at org.apache.maven.surefire.junit4.JUnit4Provider.invoke(JUnit4Provider.java:124)
        at org.apache.maven.surefire.booter.ForkedBooter.invokeProviderInSameClassLoader(ForkedBooter.java:200)
        at org.apache.maven.surefire.booter.ForkedBooter.runSuitesInProcess(ForkedBooter.java:153)
        at org.apache.maven.surefire.booter.ForkedBooter.main(ForkedBooter.java:103)

Running org.apache.activemq.usecases.StartAndConcurrentStopBrokerTest
Tests run: 1, Failures: 0, Errors: 0, Skipped: 0, Time elapsed: 2.429 sec - in org.apache.activemq.usecases.StartAndConcurrentStopBrokerTest
Running org.apache.activemq.usecases.SubscribeClosePublishThenConsumeTest
Tests run: 1, Failures: 0, Errors: 0, Skipped: 0, Time elapsed: 3.097 sec - in org.apache.activemq.usecases.SubscribeClosePublishThenConsumeTest
Running org.apache.activemq.usecases.ThreeBrokerTempDestDemandSubscriptionCleanupTest
Tests run: 2, Failures: 0, Errors: 0, Skipped: 0, Time elapsed: 15.37 sec - in org.apache.activemq.usecases.ThreeBrokerTempDestDemandSubscriptionCleanupTest
Running org.apache.activemq.usecases.ThreeBrokerVirtualTopicNetworkLevelDBTest
Tests run: 1, Failures: 0, Errors: 0, Skipped: 0, Time elapsed: 24.016 sec - in org.apache.activemq.usecases.ThreeBrokerVirtualTopicNetworkLevelDBTest
Running org.apache.activemq.usecases.TopicDurableConnectStatsTest
Tests run: 1, Failures: 0, Errors: 0, Skipped: 0, Time elapsed: 4.098 sec - in org.apache.activemq.usecases.TopicDurableConnectStatsTest
Running org.apache.activemq.usecases.TopicProducerDurableSubFlowControlTest
Tests run: 1, Failures: 0, Errors: 0, Skipped: 0, Time elapsed: 14.014 sec - in org.apache.activemq.usecases.TopicProducerDurableSubFlowControlTest
Running org.apache.activemq.usecases.TopicProducerToSubFileCursorTest
Tests run: 1, Failures: 0, Errors: 0, Skipped: 0, Time elapsed: 23.492 sec - in org.apache.activemq.usecases.TopicProducerToSubFileCursorTest
Running org.apache.activemq.usecases.TopicSubscriptionZeroPrefetchTest
Tests run: 11, Failures: 0, Errors: 0, Skipped: 0, Time elapsed: 11.889 sec - in org.apache.activemq.usecases.TopicSubscriptionZeroPrefetchTest
Running org.apache.activemq.usecases.TransactionRollbackOrderTest
Tests run: 1, Failures: 0, Errors: 0, Skipped: 0, Time elapsed: 2.972 sec - in org.apache.activemq.usecases.TransactionRollbackOrderTest
Running org.apache.activemq.usecases.TransactionTest
Tests run: 1, Failures: 0, Errors: 0, Skipped: 0, Time elapsed: 1.855 sec - in org.apache.activemq.usecases.TransactionTest
Running org.apache.activemq.usecases.TwoBrokerDurableForwardStaticRestartTest
Tests run: 1, Failures: 0, Errors: 0, Skipped: 0, Time elapsed: 13.232 sec - in org.apache.activemq.usecases.TwoBrokerDurableForwardStaticRestartTest
Running org.apache.activemq.usecases.TwoBrokerVirtualTopicForwardingTest
Tests run: 3, Failures: 0, Errors: 0, Skipped: 0, Time elapsed: 20.622 sec - in org.apache.activemq.usecases.TwoBrokerVirtualTopicForwardingTest
Running org.apache.activemq.usecases.TwoBrokerVirtualTopicSelectorAwareForwardingTest
Tests run: 6, Failures: 0, Errors: 0, Skipped: 0, Time elapsed: 48.901 sec - in org.apache.activemq.usecases.TwoBrokerVirtualTopicSelectorAwareForwardingTest
Running org.apache.activemq.usecases.TwoSecureBrokerRequestReplyTest
Sending e-mails to: [hidden email]
Sending e-mails to: [hidden email]
Sending e-mails to: [hidden email]
[locks-and-latches] Releasing all the locks
[locks-and-latches] All the locks released
ERROR: Failed to parse POMs
java.io.IOException: Backing channel 'ubuntu-4' is disconnected.
        at hudson.remoting.RemoteInvocationHandler.channelOrFail(RemoteInvocationHandler.java:192)
        at hudson.remoting.RemoteInvocationHandler.invoke(RemoteInvocationHandler.java:257)
        at com.sun.proxy.$Proxy197.isAlive(Unknown Source)
        at hudson.Launcher$RemoteLauncher$ProcImpl.isAlive(Launcher.java:1043)
        at hudson.maven.ProcessCache$MavenProcess.call(ProcessCache.java:166)
        at hudson.maven.MavenModuleSetBuild$MavenModuleSetBuildExecution.doRun(MavenModuleSetBuild.java:878)
        at hudson.model.AbstractBuild$AbstractBuildExecution.run(AbstractBuild.java:534)
        at hudson.model.Run.execute(Run.java:1728)
        at hudson.maven.MavenModuleSetBuild.run(MavenModuleSetBuild.java:542)
        at hudson.model.ResourceController.execute(ResourceController.java:98)
        at hudson.model.Executor.run(Executor.java:405)
Caused by: hudson.remoting.Channel$OrderlyShutdown
        at hudson.remoting.Channel$CloseCommand.execute(Channel.java:1129)
        at hudson.remoting.Channel$1.handle(Channel.java:527)
        at hudson.remoting.SynchronousCommandTransport$ReaderThread.run(SynchronousCommandTransport.java:83)
Caused by: Command close created at
        at hudson.remoting.Command.<init>(Command.java:60)
        at hudson.remoting.Channel$CloseCommand.<init>(Channel.java:1123)
        at hudson.remoting.Channel$CloseCommand.<init>(Channel.java:1121)
        at hudson.remoting.Channel.close(Channel.java:1281)
        at hudson.remoting.Channel.close(Channel.java:1263)
        at hudson.remoting.Channel$CloseCommand.execute(Channel.java:1128)
        ... 2 more
ERROR: ubuntu-4 is offline; cannot locate JDK 1.8 (latest)
ERROR: ubuntu-4 is offline; cannot locate Maven 3.3.9

Reply | Threaded
Open this post in threaded view
|  
Report Content as Inappropriate

Jenkins build is unstable: ActiveMQ-Java8 #1038

Apache Jenkins Server-2
Reply | Threaded
Open this post in threaded view
|  
Report Content as Inappropriate

Jenkins build is still unstable: ActiveMQ-Java8 #1039

Apache Jenkins Server-2
Reply | Threaded
Open this post in threaded view
|  
Report Content as Inappropriate

Jenkins build is still unstable: ActiveMQ-Java8 #1040

Apache Jenkins Server-2
Reply | Threaded
Open this post in threaded view
|  
Report Content as Inappropriate

Jenkins build is still unstable: ActiveMQ-Java8 #1041

Apache Jenkins Server-2
Reply | Threaded
Open this post in threaded view
|  
Report Content as Inappropriate

Jenkins build is still unstable: ActiveMQ-Java8 #1042

Apache Jenkins Server-2
Reply | Threaded
Open this post in threaded view
|  
Report Content as Inappropriate

Jenkins build is still unstable: ActiveMQ-Java8 #1043

Apache Jenkins Server-2
Loading...