Build failed in Jenkins: ActiveMQ-Artemis-Master #997

Previous Topic Next Topic
 
classic Classic list List threaded Threaded
3 messages Options
Reply | Threaded
Open this post in threaded view
|  
Report Content as Inappropriate

Build failed in Jenkins: ActiveMQ-Artemis-Master #997

Apache Jenkins Server-2
See <https://builds.apache.org/job/ActiveMQ-Artemis-Master/997/display/redirect?page=changes>

Changes:

[andy.tayls67] ARTEMIS-1107 test AddressControl.sendMessage

------------------------------------------
[...truncated 3.39 MB...]
[INFO] 3 resources included (use -debug for more details)
[INFO] Rat check: Summary over all files. Unapproved: 0, unknown: 0, generated: 0, approved: 3 licenses.
[INFO]
[INFO] --- maven-site-plugin:3.3:attach-descriptor (attach-descriptor) @ artemis-features ---
[INFO]
[INFO] >>> maven-source-plugin:2.2.1:jar (attach-sources) > generate-sources @ artemis-features >>>
[INFO]
[INFO] --- maven-enforcer-plugin:1.4:enforce (enforce-maven) @ artemis-features ---
[INFO]
[INFO] --- maven-enforcer-plugin:1.4:enforce (enforce-java) @ artemis-features ---
[INFO]
[INFO] <<< maven-source-plugin:2.2.1:jar (attach-sources) < generate-sources @ artemis-features <<<
[INFO]
[INFO] --- maven-source-plugin:2.2.1:jar (attach-sources) @ artemis-features ---
[INFO]
[INFO] --- build-helper-maven-plugin:1.8:attach-artifact (attach-artifacts) @ artemis-features ---
[INFO]
[INFO] >>> maven-source-plugin:2.2.1:jar (default) > generate-sources @ artemis-features >>>
[INFO]
[INFO] --- maven-enforcer-plugin:1.4:enforce (enforce-maven) @ artemis-features ---
[INFO]
[INFO] --- maven-enforcer-plugin:1.4:enforce (enforce-java) @ artemis-features ---
[INFO]
[INFO] <<< maven-source-plugin:2.2.1:jar (default) < generate-sources @ artemis-features <<<
[INFO]
[INFO] --- maven-source-plugin:2.2.1:jar (default) @ artemis-features ---
[INFO]
[INFO] --- dependency-check-maven:1.4.3:check (default) @ artemis-features ---
[INFO] Skipping dependency-check
[INFO]
[INFO] --- maven-install-plugin:2.4:install (default-install) @ artemis-features ---
[INFO] Installing <https://builds.apache.org/job/ActiveMQ-Artemis-Master/ws/artemis-features/pom.xml> to /home/jenkins/.m2/repository/org/apache/activemq/artemis-features/2.1.0-SNAPSHOT/artemis-features-2.1.0-SNAPSHOT.pom
[INFO] Installing <https://builds.apache.org/job/ActiveMQ-Artemis-Master/ws/artemis-features/target/classes/features.xml> to /home/jenkins/.m2/repository/org/apache/activemq/artemis-features/2.1.0-SNAPSHOT/artemis-features-2.1.0-SNAPSHOT-features.xml
[INFO] Installing <https://builds.apache.org/job/ActiveMQ-Artemis-Master/ws/artemis-features/target/classes/artemis.xml> to /home/jenkins/.m2/repository/org/apache/activemq/artemis-features/2.1.0-SNAPSHOT/artemis-features-2.1.0-SNAPSHOT-artemis.xml
[INFO] Installing <https://builds.apache.org/job/ActiveMQ-Artemis-Master/ws/artemis-features/target/classes/org.apache.activemq.artemis.cfg> to /home/jenkins/.m2/repository/org/apache/activemq/artemis-features/2.1.0-SNAPSHOT/artemis-features-2.1.0-SNAPSHOT.cfg
[INFO]                                                                        
[INFO] ------------------------------------------------------------------------
[INFO] Building ActiveMQ Artemis Test Support 2.1.0-SNAPSHOT
[INFO] ------------------------------------------------------------------------
[INFO]
[INFO] --- maven-enforcer-plugin:1.4:enforce (enforce-maven) @ artemis-test-support ---
[INFO]
[INFO] --- maven-enforcer-plugin:1.4:enforce (enforce-java) @ artemis-test-support ---
[INFO]
[INFO] --- maven-remote-resources-plugin:1.5:process (process-resource-bundles) @ artemis-test-support ---
[INFO]
[INFO] --- maven-resources-plugin:2.6:resources (default-resources) @ artemis-test-support ---
[INFO] Using 'UTF-8' encoding to copy filtered resources.
[INFO] skip non existing resourceDirectory <https://builds.apache.org/job/ActiveMQ-Artemis-Master/ws/tests/artemis-test-support/src/main/resources>
[INFO] Copying 3 resources
[INFO]
[INFO] --- maven-compiler-plugin:3.1:compile (default-compile) @ artemis-test-support ---
[INFO] Changes detected - recompiling the module!
[INFO] Compiling 57 source files to <https://builds.apache.org/job/ActiveMQ-Artemis-Master/ws/tests/artemis-test-support/target/classes>
Note: Some input files use or override a deprecated API.
Note: Recompile with -Xlint:deprecation for details.
[INFO]
[INFO] --- maven-checkstyle-plugin:2.17:check (default) @ artemis-test-support ---
[INFO] Starting audit...
Audit done.
[INFO]
[INFO] --- apache-rat-plugin:0.12:check (default) @ artemis-test-support ---
[INFO] Enabled default license matchers.
[INFO] Will parse SCM ignores for exclusions...
[INFO] Finished adding exclusions from SCM ignore files.
[INFO] 61 implicit excludes (use -debug for more details).
[INFO] Exclude: **/*.txt
[INFO] Exclude: **/*.md
[INFO] Exclude: etc/ide-settings/**
[INFO] Exclude: docs/**/*.json
[INFO] Exclude: docs/**/_book/
[INFO] Exclude: **/target/
[INFO] Exclude: **/META-INF/services/*
[INFO] Exclude: **/META-INF/MANIFEST.MF
[INFO] Exclude: **/*.iml
[INFO] Exclude: **/*.jceks
[INFO] Exclude: **/*.jks
[INFO] Exclude: **/org/apache/activemq/artemis/utils/json/**
[INFO] Exclude: **/org/apache/activemq/artemis/utils/Base64.java
[INFO] Exclude: **/.settings/**
[INFO] Exclude: **/.project
[INFO] Exclude: **/.classpath
[INFO] Exclude: **/.editorconfig
[INFO] Exclude: **/.checkstyle
[INFO] Exclude: **/.factorypath
[INFO] Exclude: **/org.apache.activemq.artemis.cfg
[INFO] Exclude: **/nb-configuration.xml
[INFO] Exclude: **/*.data
[INFO] Exclude: **/*.bin
[INFO] Exclude: **/src/test/resources/keystore
[INFO] Exclude: **/*.log
[INFO] Exclude: **/*.redo
[INFO] Exclude: **/node/**
[INFO] Exclude: **/node_modules/**
[INFO] Exclude: **/package.json
[INFO] Exclude: **/npm-shrinkwrap.json
[INFO] Exclude: **/CMakeFiles/
[INFO] Exclude: **/Makefile
[INFO] Exclude: **/cmake_install.cmake
[INFO] Exclude: artemis-native/src/main/c/org_apache_activemq_artemis_jlibaio_LibaioContext.h
[INFO] 58 resources included (use -debug for more details)
[INFO] Rat check: Summary over all files. Unapproved: 0, unknown: 0, generated: 0, approved: 58 licenses.
[INFO]
[INFO] --- maven-resources-plugin:2.6:testResources (default-testResources) @ artemis-test-support ---
[INFO] Using 'UTF-8' encoding to copy filtered resources.
[INFO] skip non existing resourceDirectory <https://builds.apache.org/job/ActiveMQ-Artemis-Master/ws/tests/artemis-test-support/src/test/resources>
[INFO] Copying 3 resources
[INFO]
[INFO] --- maven-compiler-plugin:3.1:testCompile (default-testCompile) @ artemis-test-support ---
[INFO] No sources to compile
[INFO]
[INFO] --- maven-surefire-plugin:2.18.1:test (default-test) @ artemis-test-support ---
[INFO]
[INFO] --- maven-jar-plugin:2.4:jar (default-jar) @ artemis-test-support ---
[INFO] Building jar: <https://builds.apache.org/job/ActiveMQ-Artemis-Master/ws/tests/artemis-test-support/target/artemis-test-support-2.1.0-SNAPSHOT.jar>
[INFO]
[INFO] --- maven-site-plugin:3.3:attach-descriptor (attach-descriptor) @ artemis-test-support ---
[INFO]
[INFO] >>> maven-source-plugin:2.2.1:jar (attach-sources) > generate-sources @ artemis-test-support >>>
[INFO]
[INFO] --- maven-enforcer-plugin:1.4:enforce (enforce-maven) @ artemis-test-support ---
[INFO]
[INFO] --- maven-enforcer-plugin:1.4:enforce (enforce-java) @ artemis-test-support ---
[INFO]
[INFO] <<< maven-source-plugin:2.2.1:jar (attach-sources) < generate-sources @ artemis-test-support <<<
[INFO]
[INFO] --- maven-source-plugin:2.2.1:jar (attach-sources) @ artemis-test-support ---
[INFO] Building jar: <https://builds.apache.org/job/ActiveMQ-Artemis-Master/ws/tests/artemis-test-support/target/artemis-test-support-2.1.0-SNAPSHOT-sources.jar>
[INFO]
[INFO] >>> maven-source-plugin:2.2.1:jar (default) > generate-sources @ artemis-test-support >>>
[INFO]
[INFO] --- maven-enforcer-plugin:1.4:enforce (enforce-maven) @ artemis-test-support ---
[INFO]
[INFO] --- maven-enforcer-plugin:1.4:enforce (enforce-java) @ artemis-test-support ---
[INFO]
[INFO] <<< maven-source-plugin:2.2.1:jar (default) < generate-sources @ artemis-test-support <<<
[INFO]
[INFO] --- maven-source-plugin:2.2.1:jar (default) @ artemis-test-support ---
[INFO]
[INFO] --- dependency-check-maven:1.4.3:check (default) @ artemis-test-support ---
[INFO] Skipping dependency-check
[INFO]
[INFO] --- maven-install-plugin:2.4:install (default-install) @ artemis-test-support ---
[INFO] Installing <https://builds.apache.org/job/ActiveMQ-Artemis-Master/ws/tests/artemis-test-support/target/artemis-test-support-2.1.0-SNAPSHOT.jar> to /home/jenkins/.m2/repository/org/apache/activemq/tests/artemis-test-support/2.1.0-SNAPSHOT/artemis-test-support-2.1.0-SNAPSHOT.jar
[INFO] Installing <https://builds.apache.org/job/ActiveMQ-Artemis-Master/ws/tests/artemis-test-support/pom.xml> to /home/jenkins/.m2/repository/org/apache/activemq/tests/artemis-test-support/2.1.0-SNAPSHOT/artemis-test-support-2.1.0-SNAPSHOT.pom
[INFO] Installing <https://builds.apache.org/job/ActiveMQ-Artemis-Master/ws/tests/artemis-test-support/target/artemis-test-support-2.1.0-SNAPSHOT-sources.jar> to /home/jenkins/.m2/repository/org/apache/activemq/tests/artemis-test-support/2.1.0-SNAPSHOT/artemis-test-support-2.1.0-SNAPSHOT-sources.jar
[INFO] Installing <https://builds.apache.org/job/ActiveMQ-Artemis-Master/ws/tests/artemis-test-support/target/artemis-test-support-2.1.0-SNAPSHOT-sources.jar> to /home/jenkins/.m2/repository/org/apache/activemq/tests/artemis-test-support/2.1.0-SNAPSHOT/artemis-test-support-2.1.0-SNAPSHOT-sources.jar
[INFO]                                                                        
[INFO] ------------------------------------------------------------------------
[INFO] Building ActiveMQ Artemis Integration Tests 2.1.0-SNAPSHOT
[INFO] ------------------------------------------------------------------------
[INFO]
[INFO] --- maven-enforcer-plugin:1.4:enforce (enforce-maven) @ integration-tests ---
[INFO]
[INFO] --- maven-enforcer-plugin:1.4:enforce (enforce-java) @ integration-tests ---
[INFO]
[INFO] --- maven-remote-resources-plugin:1.5:process (process-resource-bundles) @ integration-tests ---
[INFO]
[INFO] --- depends-maven-plugin:1.2:generate-depends-file (generate-depends-file) @ integration-tests ---
[INFO] Created: <https://builds.apache.org/job/ActiveMQ-Artemis-Master/ws/tests/integration-tests/target/classes/META-INF/maven/dependencies.properties>
[INFO]
[INFO] --- maven-resources-plugin:2.6:resources (default-resources) @ integration-tests ---
[INFO] Using 'UTF-8' encoding to copy filtered resources.
[INFO] skip non existing resourceDirectory <https://builds.apache.org/job/ActiveMQ-Artemis-Master/ws/tests/integration-tests/src/main/resources>
[INFO] Copying 3 resources
[INFO]
[INFO] --- maven-compiler-plugin:3.1:compile (default-compile) @ integration-tests ---
[INFO] No sources to compile
[INFO]
[INFO] --- maven-checkstyle-plugin:2.17:check (default) @ integration-tests ---
[INFO] Starting audit...
<https://builds.apache.org/job/ActiveMQ-Artemis-Master/ws/tests/integration-tests/src/test/java/org/apache/activemq/artemis/tests/integration/management/AddressControlTest.java>:26:8: error: Unused import - org.apache.activemq.artemis.api.core.ActiveMQBuffer.
<https://builds.apache.org/job/ActiveMQ-Artemis-Master/ws/tests/integration-tests/src/test/java/org/apache/activemq/artemis/tests/integration/management/AddressControlTest.java>:39:8: error: Unused import - org.apache.activemq.artemis.core.buffers.impl.ChannelBufferWrapper.
Audit done.
[INFO] There are 2 errors reported by Checkstyle 6.11.2 with <https://builds.apache.org/job/ActiveMQ-Artemis-Master/ws/tests/integration-tests/../../etc/checkstyle.xml> ruleset.
[ERROR] src/test/java/org/apache/activemq/artemis/tests/integration/management/AddressControlTest.java:[26,8] (imports) UnusedImports: Unused import - org.apache.activemq.artemis.api.core.ActiveMQBuffer.
[ERROR] src/test/java/org/apache/activemq/artemis/tests/integration/management/AddressControlTest.java:[39,8] (imports) UnusedImports: Unused import - org.apache.activemq.artemis.core.buffers.impl.ChannelBufferWrapper.
[INFO] ------------------------------------------------------------------------
[INFO] Reactor Summary:
[INFO]
[INFO] ActiveMQ Artemis Parent ............................ SUCCESS [ 12.060 s]
[INFO] ActiveMQ Artemis Commons ........................... SUCCESS [ 41.128 s]
[INFO] ActiveMQ Artemis Core Client ....................... SUCCESS [ 20.999 s]
[INFO] ActiveMQ Artemis Selector Implementation ........... SUCCESS [  5.761 s]
[INFO] ActiveMQ Artemis JMS Client ........................ SUCCESS [  7.505 s]
[INFO] ActiveMQ Artemis Native POM ........................ SUCCESS [  8.255 s]
[INFO] ActiveMQ Artemis Journal ........................... SUCCESS [  5.851 s]
[INFO] ActiveMQ Artemis JDBC Store ........................ SUCCESS [  8.173 s]
[INFO] ActiveMQ Artemis Server ............................ SUCCESS [01:07 min]
[INFO] ActiveMQ Artemis Protocols ......................... SUCCESS [  0.649 s]
[INFO] ActiveMQ Artemis AMQP Protocol ..................... SUCCESS [  7.605 s]
[INFO] ActiveMQ Artemis STOMP Protocol .................... SUCCESS [  3.528 s]
[INFO] ActiveMQ Artemis OpenWire Protocol ................. SUCCESS [  4.148 s]
[INFO] ActiveMQ Artemis HQClient Protocol ................. SUCCESS [  1.378 s]
[INFO] ActiveMQ Artemis HornetQ Protocol .................. SUCCESS [  1.481 s]
[INFO] ActiveMQ Artemis MQTT Protocol ..................... SUCCESS [  2.313 s]
[INFO] ActiveMQ Artemis DTO ............................... SUCCESS [  3.380 s]
[INFO] ActiveMQ Artemis Service Extensions ................ SUCCESS [  2.951 s]
[INFO] ActiveMQ Artemis JMS Server ........................ SUCCESS [  3.258 s]
[INFO] ActiveMQ Artemis CDI Integration ................... SUCCESS [  8.256 s]
[INFO] ActiveMQ Artemis Boot .............................. SUCCESS [  0.830 s]
[INFO] ActiveMQ Artemis Tools ............................. SUCCESS [  1.764 s]
[INFO] ActiveMQ Artemis CLI ............................... SUCCESS [ 28.351 s]
[INFO] ActiveMQ Artemis Web ............................... SUCCESS [  7.463 s]
[INFO] ActiveMQ Artemis Web ............................... SUCCESS [02:01 min]
[INFO] ActiveMQ Artemis JUnit Rules ....................... SUCCESS [ 10.828 s]
[INFO] ActiveMQ Artemis RAR POM ........................... SUCCESS [  4.090 s]
[INFO] ActiveMQ Artemis REST Interface Implementation ..... SUCCESS [01:35 min]
[INFO] ActiveMQ Artemis Maven Plugin ...................... SUCCESS [  6.229 s]
[INFO] ActiveMQ Artemis Server OSGi ....................... SUCCESS [  6.165 s]
[INFO] ActiveMQ Artemis Spring Integration ................ SUCCESS [  1.323 s]
[INFO] Apache ActiveMQ Artemis Distribution ............... SUCCESS [ 41.579 s]
[INFO] ActiveMQ Artemis Tests POM ......................... SUCCESS [  1.218 s]
[INFO] ActiveMQ Artemis Unit Tests ........................ SUCCESS [03:00 min]
[INFO] ActiveMQ Artemis Joram Tests ....................... SUCCESS [01:49 min]
[INFO] ActiveMQ Artemis timing Tests ...................... SUCCESS [  1.797 s]
[INFO] ActiveMQ Artemis JMS Tests ......................... SUCCESS [03:30 min]
[INFO] ActiveMQ Artemis Features .......................... SUCCESS [  0.093 s]
[INFO] ActiveMQ Artemis Test Support ...................... SUCCESS [  3.140 s]
[INFO] ActiveMQ Artemis Integration Tests ................. FAILURE [ 18.778 s]
[INFO] ActiveMQ Artemis soak Tests ........................ SKIPPED
[INFO] ActiveMQ Artemis stress Tests ...................... SKIPPED
[INFO] ActiveMQ Artemis performance Tests ................. SKIPPED
[INFO] Smoke Tests ........................................ SKIPPED
[INFO] ActiveMQ Artemis Extra Tests ....................... SKIPPED
[INFO] ------------------------------------------------------------------------
[INFO] BUILD FAILURE
[INFO] ------------------------------------------------------------------------
[INFO] Total time: 17:49 min
[INFO] Finished at: 2017-04-11T07:17:08+00:00
[INFO] Final Memory: 254M/3087M
[INFO] ------------------------------------------------------------------------
[ERROR] Failed to execute goal org.apache.maven.plugins:maven-checkstyle-plugin:2.17:check (default) on project integration-tests: You have 2 Checkstyle violations. -> [Help 1]
[ERROR]
[ERROR] To see the full stack trace of the errors, re-run Maven with the -e switch.
[ERROR] Re-run Maven using the -X switch to enable full debug logging.
[ERROR]
[ERROR] For more information about the errors and possible solutions, please read the following articles:
[ERROR] [Help 1] http://cwiki.apache.org/confluence/display/MAVEN/MojoFailureException
[ERROR]
[ERROR] After correcting the problems, you can resume the build with the command
[ERROR]   mvn <goals> -rf :integration-tests
Build step 'Invoke top-level Maven targets' marked build as failure
Performing Post build task...
Could not match :Too many files with unapproved license  : False
Logical operation result is FALSE
Skipping script  : cat ratReport.txt
END OF POST BUILD TASK : 0
Recording test results
Reply | Threaded
Open this post in threaded view
|  
Report Content as Inappropriate

Build failed in Jenkins: ActiveMQ-Artemis-Master #998

Apache Jenkins Server-2
See <https://builds.apache.org/job/ActiveMQ-Artemis-Master/998/display/redirect>

------------------------------------------
[...truncated 3.05 MB...]
[INFO] 3 resources included (use -debug for more details)
[INFO] Rat check: Summary over all files. Unapproved: 0, unknown: 0, generated: 0, approved: 3 licenses.
[INFO]
[INFO] --- maven-site-plugin:3.3:attach-descriptor (attach-descriptor) @ artemis-features ---
[INFO]
[INFO] >>> maven-source-plugin:2.2.1:jar (attach-sources) > generate-sources @ artemis-features >>>
[INFO]
[INFO] --- maven-enforcer-plugin:1.4:enforce (enforce-maven) @ artemis-features ---
[INFO]
[INFO] --- maven-enforcer-plugin:1.4:enforce (enforce-java) @ artemis-features ---
[INFO]
[INFO] <<< maven-source-plugin:2.2.1:jar (attach-sources) < generate-sources @ artemis-features <<<
[INFO]
[INFO] --- maven-source-plugin:2.2.1:jar (attach-sources) @ artemis-features ---
[INFO]
[INFO] --- build-helper-maven-plugin:1.8:attach-artifact (attach-artifacts) @ artemis-features ---
[INFO]
[INFO] >>> maven-source-plugin:2.2.1:jar (default) > generate-sources @ artemis-features >>>
[INFO]
[INFO] --- maven-enforcer-plugin:1.4:enforce (enforce-maven) @ artemis-features ---
[INFO]
[INFO] --- maven-enforcer-plugin:1.4:enforce (enforce-java) @ artemis-features ---
[INFO]
[INFO] <<< maven-source-plugin:2.2.1:jar (default) < generate-sources @ artemis-features <<<
[INFO]
[INFO] --- maven-source-plugin:2.2.1:jar (default) @ artemis-features ---
[INFO]
[INFO] --- dependency-check-maven:1.4.3:check (default) @ artemis-features ---
[INFO] Skipping dependency-check
[INFO]
[INFO] --- maven-install-plugin:2.4:install (default-install) @ artemis-features ---
[INFO] Installing <https://builds.apache.org/job/ActiveMQ-Artemis-Master/ws/artemis-features/pom.xml> to /home/jenkins/.m2/repository/org/apache/activemq/artemis-features/2.1.0-SNAPSHOT/artemis-features-2.1.0-SNAPSHOT.pom
[INFO] Installing <https://builds.apache.org/job/ActiveMQ-Artemis-Master/ws/artemis-features/target/classes/features.xml> to /home/jenkins/.m2/repository/org/apache/activemq/artemis-features/2.1.0-SNAPSHOT/artemis-features-2.1.0-SNAPSHOT-features.xml
[INFO] Installing <https://builds.apache.org/job/ActiveMQ-Artemis-Master/ws/artemis-features/target/classes/artemis.xml> to /home/jenkins/.m2/repository/org/apache/activemq/artemis-features/2.1.0-SNAPSHOT/artemis-features-2.1.0-SNAPSHOT-artemis.xml
[INFO] Installing <https://builds.apache.org/job/ActiveMQ-Artemis-Master/ws/artemis-features/target/classes/org.apache.activemq.artemis.cfg> to /home/jenkins/.m2/repository/org/apache/activemq/artemis-features/2.1.0-SNAPSHOT/artemis-features-2.1.0-SNAPSHOT.cfg
[INFO]                                                                        
[INFO] ------------------------------------------------------------------------
[INFO] Building ActiveMQ Artemis Test Support 2.1.0-SNAPSHOT
[INFO] ------------------------------------------------------------------------
[INFO]
[INFO] --- maven-enforcer-plugin:1.4:enforce (enforce-maven) @ artemis-test-support ---
[INFO]
[INFO] --- maven-enforcer-plugin:1.4:enforce (enforce-java) @ artemis-test-support ---
[INFO]
[INFO] --- maven-remote-resources-plugin:1.5:process (process-resource-bundles) @ artemis-test-support ---
[INFO]
[INFO] --- maven-resources-plugin:2.6:resources (default-resources) @ artemis-test-support ---
[INFO] Using 'UTF-8' encoding to copy filtered resources.
[INFO] skip non existing resourceDirectory <https://builds.apache.org/job/ActiveMQ-Artemis-Master/ws/tests/artemis-test-support/src/main/resources>
[INFO] Copying 3 resources
[INFO]
[INFO] --- maven-compiler-plugin:3.1:compile (default-compile) @ artemis-test-support ---
[INFO] Changes detected - recompiling the module!
[INFO] Compiling 57 source files to <https://builds.apache.org/job/ActiveMQ-Artemis-Master/ws/tests/artemis-test-support/target/classes>
Note: Some input files use or override a deprecated API.
Note: Recompile with -Xlint:deprecation for details.
[INFO]
[INFO] --- maven-checkstyle-plugin:2.17:check (default) @ artemis-test-support ---
[INFO] Starting audit...
Audit done.
[INFO]
[INFO] --- apache-rat-plugin:0.12:check (default) @ artemis-test-support ---
[INFO] Enabled default license matchers.
[INFO] Will parse SCM ignores for exclusions...
[INFO] Finished adding exclusions from SCM ignore files.
[INFO] 61 implicit excludes (use -debug for more details).
[INFO] Exclude: **/*.txt
[INFO] Exclude: **/*.md
[INFO] Exclude: etc/ide-settings/**
[INFO] Exclude: docs/**/*.json
[INFO] Exclude: docs/**/_book/
[INFO] Exclude: **/target/
[INFO] Exclude: **/META-INF/services/*
[INFO] Exclude: **/META-INF/MANIFEST.MF
[INFO] Exclude: **/*.iml
[INFO] Exclude: **/*.jceks
[INFO] Exclude: **/*.jks
[INFO] Exclude: **/org/apache/activemq/artemis/utils/json/**
[INFO] Exclude: **/org/apache/activemq/artemis/utils/Base64.java
[INFO] Exclude: **/.settings/**
[INFO] Exclude: **/.project
[INFO] Exclude: **/.classpath
[INFO] Exclude: **/.editorconfig
[INFO] Exclude: **/.checkstyle
[INFO] Exclude: **/.factorypath
[INFO] Exclude: **/org.apache.activemq.artemis.cfg
[INFO] Exclude: **/nb-configuration.xml
[INFO] Exclude: **/*.data
[INFO] Exclude: **/*.bin
[INFO] Exclude: **/src/test/resources/keystore
[INFO] Exclude: **/*.log
[INFO] Exclude: **/*.redo
[INFO] Exclude: **/node/**
[INFO] Exclude: **/node_modules/**
[INFO] Exclude: **/package.json
[INFO] Exclude: **/npm-shrinkwrap.json
[INFO] Exclude: **/CMakeFiles/
[INFO] Exclude: **/Makefile
[INFO] Exclude: **/cmake_install.cmake
[INFO] Exclude: artemis-native/src/main/c/org_apache_activemq_artemis_jlibaio_LibaioContext.h
[INFO] 58 resources included (use -debug for more details)
[INFO] Rat check: Summary over all files. Unapproved: 0, unknown: 0, generated: 0, approved: 58 licenses.
[INFO]
[INFO] --- maven-resources-plugin:2.6:testResources (default-testResources) @ artemis-test-support ---
[INFO] Using 'UTF-8' encoding to copy filtered resources.
[INFO] skip non existing resourceDirectory <https://builds.apache.org/job/ActiveMQ-Artemis-Master/ws/tests/artemis-test-support/src/test/resources>
[INFO] Copying 3 resources
[INFO]
[INFO] --- maven-compiler-plugin:3.1:testCompile (default-testCompile) @ artemis-test-support ---
[INFO] No sources to compile
[INFO]
[INFO] --- maven-surefire-plugin:2.18.1:test (default-test) @ artemis-test-support ---
[INFO]
[INFO] --- maven-jar-plugin:2.4:jar (default-jar) @ artemis-test-support ---
[INFO] Building jar: <https://builds.apache.org/job/ActiveMQ-Artemis-Master/ws/tests/artemis-test-support/target/artemis-test-support-2.1.0-SNAPSHOT.jar>
[INFO]
[INFO] --- maven-site-plugin:3.3:attach-descriptor (attach-descriptor) @ artemis-test-support ---
[INFO]
[INFO] >>> maven-source-plugin:2.2.1:jar (attach-sources) > generate-sources @ artemis-test-support >>>
[INFO]
[INFO] --- maven-enforcer-plugin:1.4:enforce (enforce-maven) @ artemis-test-support ---
[INFO]
[INFO] --- maven-enforcer-plugin:1.4:enforce (enforce-java) @ artemis-test-support ---
[INFO]
[INFO] <<< maven-source-plugin:2.2.1:jar (attach-sources) < generate-sources @ artemis-test-support <<<
[INFO]
[INFO] --- maven-source-plugin:2.2.1:jar (attach-sources) @ artemis-test-support ---
[INFO] Building jar: <https://builds.apache.org/job/ActiveMQ-Artemis-Master/ws/tests/artemis-test-support/target/artemis-test-support-2.1.0-SNAPSHOT-sources.jar>
[INFO]
[INFO] >>> maven-source-plugin:2.2.1:jar (default) > generate-sources @ artemis-test-support >>>
[INFO]
[INFO] --- maven-enforcer-plugin:1.4:enforce (enforce-maven) @ artemis-test-support ---
[INFO]
[INFO] --- maven-enforcer-plugin:1.4:enforce (enforce-java) @ artemis-test-support ---
[INFO]
[INFO] <<< maven-source-plugin:2.2.1:jar (default) < generate-sources @ artemis-test-support <<<
[INFO]
[INFO] --- maven-source-plugin:2.2.1:jar (default) @ artemis-test-support ---
[INFO]
[INFO] --- dependency-check-maven:1.4.3:check (default) @ artemis-test-support ---
[INFO] Skipping dependency-check
[INFO]
[INFO] --- maven-install-plugin:2.4:install (default-install) @ artemis-test-support ---
[INFO] Installing <https://builds.apache.org/job/ActiveMQ-Artemis-Master/ws/tests/artemis-test-support/target/artemis-test-support-2.1.0-SNAPSHOT.jar> to /home/jenkins/.m2/repository/org/apache/activemq/tests/artemis-test-support/2.1.0-SNAPSHOT/artemis-test-support-2.1.0-SNAPSHOT.jar
[INFO] Installing <https://builds.apache.org/job/ActiveMQ-Artemis-Master/ws/tests/artemis-test-support/pom.xml> to /home/jenkins/.m2/repository/org/apache/activemq/tests/artemis-test-support/2.1.0-SNAPSHOT/artemis-test-support-2.1.0-SNAPSHOT.pom
[INFO] Installing <https://builds.apache.org/job/ActiveMQ-Artemis-Master/ws/tests/artemis-test-support/target/artemis-test-support-2.1.0-SNAPSHOT-sources.jar> to /home/jenkins/.m2/repository/org/apache/activemq/tests/artemis-test-support/2.1.0-SNAPSHOT/artemis-test-support-2.1.0-SNAPSHOT-sources.jar
[INFO] Installing <https://builds.apache.org/job/ActiveMQ-Artemis-Master/ws/tests/artemis-test-support/target/artemis-test-support-2.1.0-SNAPSHOT-sources.jar> to /home/jenkins/.m2/repository/org/apache/activemq/tests/artemis-test-support/2.1.0-SNAPSHOT/artemis-test-support-2.1.0-SNAPSHOT-sources.jar
[INFO]                                                                        
[INFO] ------------------------------------------------------------------------
[INFO] Building ActiveMQ Artemis Integration Tests 2.1.0-SNAPSHOT
[INFO] ------------------------------------------------------------------------
[INFO]
[INFO] --- maven-enforcer-plugin:1.4:enforce (enforce-maven) @ integration-tests ---
[INFO]
[INFO] --- maven-enforcer-plugin:1.4:enforce (enforce-java) @ integration-tests ---
[INFO]
[INFO] --- maven-remote-resources-plugin:1.5:process (process-resource-bundles) @ integration-tests ---
[INFO]
[INFO] --- depends-maven-plugin:1.2:generate-depends-file (generate-depends-file) @ integration-tests ---
[INFO] Created: <https://builds.apache.org/job/ActiveMQ-Artemis-Master/ws/tests/integration-tests/target/classes/META-INF/maven/dependencies.properties>
[INFO]
[INFO] --- maven-resources-plugin:2.6:resources (default-resources) @ integration-tests ---
[INFO] Using 'UTF-8' encoding to copy filtered resources.
[INFO] skip non existing resourceDirectory <https://builds.apache.org/job/ActiveMQ-Artemis-Master/ws/tests/integration-tests/src/main/resources>
[INFO] Copying 3 resources
[INFO]
[INFO] --- maven-compiler-plugin:3.1:compile (default-compile) @ integration-tests ---
[INFO] No sources to compile
[INFO]
[INFO] --- maven-checkstyle-plugin:2.17:check (default) @ integration-tests ---
[INFO] Starting audit...
<https://builds.apache.org/job/ActiveMQ-Artemis-Master/ws/tests/integration-tests/src/test/java/org/apache/activemq/artemis/tests/integration/management/AddressControlTest.java>:26:8: error: Unused import - org.apache.activemq.artemis.api.core.ActiveMQBuffer.
<https://builds.apache.org/job/ActiveMQ-Artemis-Master/ws/tests/integration-tests/src/test/java/org/apache/activemq/artemis/tests/integration/management/AddressControlTest.java>:39:8: error: Unused import - org.apache.activemq.artemis.core.buffers.impl.ChannelBufferWrapper.
Audit done.
[INFO] There are 2 errors reported by Checkstyle 6.11.2 with <https://builds.apache.org/job/ActiveMQ-Artemis-Master/ws/tests/integration-tests/../../etc/checkstyle.xml> ruleset.
[ERROR] src/test/java/org/apache/activemq/artemis/tests/integration/management/AddressControlTest.java:[26,8] (imports) UnusedImports: Unused import - org.apache.activemq.artemis.api.core.ActiveMQBuffer.
[ERROR] src/test/java/org/apache/activemq/artemis/tests/integration/management/AddressControlTest.java:[39,8] (imports) UnusedImports: Unused import - org.apache.activemq.artemis.core.buffers.impl.ChannelBufferWrapper.
[INFO] ------------------------------------------------------------------------
[INFO] Reactor Summary:
[INFO]
[INFO] ActiveMQ Artemis Parent ............................ SUCCESS [  7.071 s]
[INFO] ActiveMQ Artemis Commons ........................... SUCCESS [ 40.404 s]
[INFO] ActiveMQ Artemis Core Client ....................... SUCCESS [ 19.864 s]
[INFO] ActiveMQ Artemis Selector Implementation ........... SUCCESS [  5.753 s]
[INFO] ActiveMQ Artemis JMS Client ........................ SUCCESS [  8.043 s]
[INFO] ActiveMQ Artemis Native POM ........................ SUCCESS [  8.158 s]
[INFO] ActiveMQ Artemis Journal ........................... SUCCESS [  5.900 s]
[INFO] ActiveMQ Artemis JDBC Store ........................ SUCCESS [  8.171 s]
[INFO] ActiveMQ Artemis Server ............................ SUCCESS [01:04 min]
[INFO] ActiveMQ Artemis Protocols ......................... SUCCESS [  0.779 s]
[INFO] ActiveMQ Artemis AMQP Protocol ..................... SUCCESS [  7.446 s]
[INFO] ActiveMQ Artemis STOMP Protocol .................... SUCCESS [  3.335 s]
[INFO] ActiveMQ Artemis OpenWire Protocol ................. SUCCESS [  3.983 s]
[INFO] ActiveMQ Artemis HQClient Protocol ................. SUCCESS [  1.442 s]
[INFO] ActiveMQ Artemis HornetQ Protocol .................. SUCCESS [  1.576 s]
[INFO] ActiveMQ Artemis MQTT Protocol ..................... SUCCESS [  2.477 s]
[INFO] ActiveMQ Artemis DTO ............................... SUCCESS [  3.484 s]
[INFO] ActiveMQ Artemis Service Extensions ................ SUCCESS [  3.031 s]
[INFO] ActiveMQ Artemis JMS Server ........................ SUCCESS [  3.400 s]
[INFO] ActiveMQ Artemis CDI Integration ................... SUCCESS [  8.171 s]
[INFO] ActiveMQ Artemis Boot .............................. SUCCESS [  0.961 s]
[INFO] ActiveMQ Artemis Tools ............................. SUCCESS [  1.704 s]
[INFO] ActiveMQ Artemis CLI ............................... SUCCESS [ 28.668 s]
[INFO] ActiveMQ Artemis Web ............................... SUCCESS [  7.414 s]
[INFO] ActiveMQ Artemis Web ............................... SUCCESS [01:55 min]
[INFO] ActiveMQ Artemis JUnit Rules ....................... SUCCESS [ 11.075 s]
[INFO] ActiveMQ Artemis RAR POM ........................... SUCCESS [  4.207 s]
[INFO] ActiveMQ Artemis REST Interface Implementation ..... SUCCESS [01:35 min]
[INFO] ActiveMQ Artemis Maven Plugin ...................... SUCCESS [  6.586 s]
[INFO] ActiveMQ Artemis Server OSGi ....................... SUCCESS [  6.241 s]
[INFO] ActiveMQ Artemis Spring Integration ................ SUCCESS [  1.312 s]
[INFO] Apache ActiveMQ Artemis Distribution ............... SUCCESS [ 40.717 s]
[INFO] ActiveMQ Artemis Tests POM ......................... SUCCESS [  1.333 s]
[INFO] ActiveMQ Artemis Unit Tests ........................ SUCCESS [02:43 min]
[INFO] ActiveMQ Artemis Joram Tests ....................... SUCCESS [ 44.533 s]
[INFO] ActiveMQ Artemis timing Tests ...................... SUCCESS [  1.763 s]
[INFO] ActiveMQ Artemis JMS Tests ......................... SUCCESS [03:29 min]
[INFO] ActiveMQ Artemis Features .......................... SUCCESS [  0.115 s]
[INFO] ActiveMQ Artemis Test Support ...................... SUCCESS [  3.187 s]
[INFO] ActiveMQ Artemis Integration Tests ................. FAILURE [ 18.390 s]
[INFO] ActiveMQ Artemis soak Tests ........................ SKIPPED
[INFO] ActiveMQ Artemis stress Tests ...................... SKIPPED
[INFO] ActiveMQ Artemis performance Tests ................. SKIPPED
[INFO] Smoke Tests ........................................ SKIPPED
[INFO] ActiveMQ Artemis Extra Tests ....................... SKIPPED
[INFO] ------------------------------------------------------------------------
[INFO] BUILD FAILURE
[INFO] ------------------------------------------------------------------------
[INFO] Total time: 16:11 min
[INFO] Finished at: 2017-04-11T07:34:27+00:00
[INFO] Final Memory: 242M/2826M
[INFO] ------------------------------------------------------------------------
[ERROR] Failed to execute goal org.apache.maven.plugins:maven-checkstyle-plugin:2.17:check (default) on project integration-tests: You have 2 Checkstyle violations. -> [Help 1]
[ERROR]
[ERROR] To see the full stack trace of the errors, re-run Maven with the -e switch.
[ERROR] Re-run Maven using the -X switch to enable full debug logging.
[ERROR]
[ERROR] For more information about the errors and possible solutions, please read the following articles:
[ERROR] [Help 1] http://cwiki.apache.org/confluence/display/MAVEN/MojoFailureException
[ERROR]
[ERROR] After correcting the problems, you can resume the build with the command
[ERROR]   mvn <goals> -rf :integration-tests
Build step 'Invoke top-level Maven targets' marked build as failure
Performing Post build task...
Could not match :Too many files with unapproved license  : False
Logical operation result is FALSE
Skipping script  : cat ratReport.txt
END OF POST BUILD TASK : 0
Recording test results
Reply | Threaded
Open this post in threaded view
|  
Report Content as Inappropriate

Jenkins build is back to normal : ActiveMQ-Artemis-Master #999

Apache Jenkins Server-2
Loading...