Build failed in Jenkins: ActiveMQ-Artemis-Master #922

Previous Topic Next Topic
 
classic Classic list List threaded Threaded
2 messages Options
Reply | Threaded
Open this post in threaded view
|  
Report Content as Inappropriate

Build failed in Jenkins: ActiveMQ-Artemis-Master #922

Apache Jenkins Server-2
See <https://builds.apache.org/job/ActiveMQ-Artemis-Master/922/display/redirect?page=changes>

Changes:

[clebertsuconic] ARTEMIS-1042 Fixing AMQPFailoverTest

[clebertsuconic] NO-JIRA: Adding timeouts on failover tests

------------------------------------------
[...truncated 3.22 MB...]
[INFO] Exclude: **/CMakeFiles/
[INFO] Exclude: **/Makefile
[INFO] Exclude: **/cmake_install.cmake
[INFO] Exclude: artemis-native/src/main/c/org_apache_activemq_artemis_jlibaio_LibaioContext.h
[INFO] 59 resources included (use -debug for more details)
[INFO] Rat check: Summary over all files. Unapproved: 0, unknown: 0, generated: 0, approved: 59 licenses.
[INFO]
[INFO] --- maven-enforcer-plugin:1.4:enforce (enforce-maven) @ artemis-test-support ---
[INFO]
[INFO] --- maven-enforcer-plugin:1.4:enforce (enforce-java) @ artemis-test-support ---
[INFO]
[INFO] --- maven-remote-resources-plugin:1.5:process (process-resource-bundles) @ artemis-test-support ---
[INFO]
[INFO] --- maven-resources-plugin:2.6:resources (default-resources) @ artemis-test-support ---
[INFO] Using 'UTF-8' encoding to copy filtered resources.
[INFO] skip non existing resourceDirectory <https://builds.apache.org/job/ActiveMQ-Artemis-Master/ws/tests/artemis-test-support/src/main/resources>
[INFO] Copying 3 resources
[INFO] Copying 3 resources
[INFO]
[INFO] --- maven-compiler-plugin:3.1:compile (default-compile) @ artemis-test-support ---
[INFO] Nothing to compile - all classes are up to date
[INFO]
[INFO] --- maven-checkstyle-plugin:2.17:check (default) @ artemis-test-support ---
[INFO] Starting audit...
Audit done.
[INFO]
[INFO] --- apache-rat-plugin:0.12:check (default) @ artemis-test-support ---
[INFO] Enabled default license matchers.
[INFO] Will parse SCM ignores for exclusions...
[INFO] Finished adding exclusions from SCM ignore files.
[INFO] 61 implicit excludes (use -debug for more details).
[INFO] Exclude: **/*.txt
[INFO] Exclude: **/*.md
[INFO] Exclude: etc/ide-settings/**
[INFO] Exclude: docs/**/*.json
[INFO] Exclude: docs/**/_book/
[INFO] Exclude: **/target/
[INFO] Exclude: **/META-INF/services/*
[INFO] Exclude: **/META-INF/MANIFEST.MF
[INFO] Exclude: **/*.iml
[INFO] Exclude: **/*.jceks
[INFO] Exclude: **/*.jks
[INFO] Exclude: **/org/apache/activemq/artemis/utils/json/**
[INFO] Exclude: **/org/apache/activemq/artemis/utils/Base64.java
[INFO] Exclude: **/.settings/**
[INFO] Exclude: **/.project
[INFO] Exclude: **/.classpath
[INFO] Exclude: **/.editorconfig
[INFO] Exclude: **/.checkstyle
[INFO] Exclude: **/.factorypath
[INFO] Exclude: **/org.apache.activemq.artemis.cfg
[INFO] Exclude: **/nb-configuration.xml
[INFO] Exclude: **/*.data
[INFO] Exclude: **/*.bin
[INFO] Exclude: **/src/test/resources/keystore
[INFO] Exclude: **/*.log
[INFO] Exclude: **/*.redo
[INFO] Exclude: **/node/**
[INFO] Exclude: **/node_modules/**
[INFO] Exclude: **/package.json
[INFO] Exclude: **/npm-shrinkwrap.json
[INFO] Exclude: **/CMakeFiles/
[INFO] Exclude: **/Makefile
[INFO] Exclude: **/cmake_install.cmake
[INFO] Exclude: artemis-native/src/main/c/org_apache_activemq_artemis_jlibaio_LibaioContext.h
[INFO] 59 resources included (use -debug for more details)
[INFO] Rat check: Summary over all files. Unapproved: 0, unknown: 0, generated: 0, approved: 59 licenses.
[INFO]
[INFO] --- maven-resources-plugin:2.6:testResources (default-testResources) @ artemis-test-support ---
[INFO] Using 'UTF-8' encoding to copy filtered resources.
[INFO] skip non existing resourceDirectory <https://builds.apache.org/job/ActiveMQ-Artemis-Master/ws/tests/artemis-test-support/src/test/resources>
[INFO] Copying 3 resources
[INFO] Copying 3 resources
[INFO]
[INFO] --- maven-compiler-plugin:3.1:testCompile (default-testCompile) @ artemis-test-support ---
[INFO] No sources to compile
[INFO]
[INFO] --- maven-enforcer-plugin:1.4:enforce (enforce-maven) @ artemis-test-support ---
[INFO]
[INFO] --- maven-enforcer-plugin:1.4:enforce (enforce-java) @ artemis-test-support ---
[INFO]
[INFO] --- maven-remote-resources-plugin:1.5:process (process-resource-bundles) @ artemis-test-support ---
[INFO]
[INFO] --- maven-resources-plugin:2.6:resources (default-resources) @ artemis-test-support ---
[INFO] Using 'UTF-8' encoding to copy filtered resources.
[INFO] skip non existing resourceDirectory <https://builds.apache.org/job/ActiveMQ-Artemis-Master/ws/tests/artemis-test-support/src/main/resources>
[INFO] Copying 3 resources
[INFO] Copying 3 resources
[INFO] Copying 3 resources
[INFO]
[INFO] --- maven-compiler-plugin:3.1:compile (default-compile) @ artemis-test-support ---
[INFO] Nothing to compile - all classes are up to date
[INFO]
[INFO] --- maven-checkstyle-plugin:2.17:check (default) @ artemis-test-support ---
[INFO] Starting audit...
Audit done.
[INFO]
[INFO] --- apache-rat-plugin:0.12:check (default) @ artemis-test-support ---
[INFO] Enabled default license matchers.
[INFO] Will parse SCM ignores for exclusions...
[INFO] Finished adding exclusions from SCM ignore files.
[INFO] 61 implicit excludes (use -debug for more details).
[INFO] Exclude: **/*.txt
[INFO] Exclude: **/*.md
[INFO] Exclude: etc/ide-settings/**
[INFO] Exclude: docs/**/*.json
[INFO] Exclude: docs/**/_book/
[INFO] Exclude: **/target/
[INFO] Exclude: **/META-INF/services/*
[INFO] Exclude: **/META-INF/MANIFEST.MF
[INFO] Exclude: **/*.iml
[INFO] Exclude: **/*.jceks
[INFO] Exclude: **/*.jks
[INFO] Exclude: **/org/apache/activemq/artemis/utils/json/**
[INFO] Exclude: **/org/apache/activemq/artemis/utils/Base64.java
[INFO] Exclude: **/.settings/**
[INFO] Exclude: **/.project
[INFO] Exclude: **/.classpath
[INFO] Exclude: **/.editorconfig
[INFO] Exclude: **/.checkstyle
[INFO] Exclude: **/.factorypath
[INFO] Exclude: **/org.apache.activemq.artemis.cfg
[INFO] Exclude: **/nb-configuration.xml
[INFO] Exclude: **/*.data
[INFO] Exclude: **/*.bin
[INFO] Exclude: **/src/test/resources/keystore
[INFO] Exclude: **/*.log
[INFO] Exclude: **/*.redo
[INFO] Exclude: **/node/**
[INFO] Exclude: **/node_modules/**
[INFO] Exclude: **/package.json
[INFO] Exclude: **/npm-shrinkwrap.json
[INFO] Exclude: **/CMakeFiles/
[INFO] Exclude: **/Makefile
[INFO] Exclude: **/cmake_install.cmake
[INFO] Exclude: artemis-native/src/main/c/org_apache_activemq_artemis_jlibaio_LibaioContext.h
[INFO] 59 resources included (use -debug for more details)
[INFO] Rat check: Summary over all files. Unapproved: 0, unknown: 0, generated: 0, approved: 59 licenses.
[INFO]
[INFO] --- maven-resources-plugin:2.6:testResources (default-testResources) @ artemis-test-support ---
[INFO] Using 'UTF-8' encoding to copy filtered resources.
[INFO] skip non existing resourceDirectory <https://builds.apache.org/job/ActiveMQ-Artemis-Master/ws/tests/artemis-test-support/src/test/resources>
[INFO] Copying 3 resources
[INFO] Copying 3 resources
[INFO] Copying 3 resources
[INFO]
[INFO] --- maven-compiler-plugin:3.1:testCompile (default-testCompile) @ artemis-test-support ---
[INFO] No sources to compile
[INFO]
[INFO] --- maven-surefire-plugin:2.18.1:test (default-test) @ artemis-test-support ---
[INFO]                                                                        
[INFO] ------------------------------------------------------------------------
[INFO] Building ActiveMQ Artemis Integration Tests 2.1.0-SNAPSHOT
[INFO] ------------------------------------------------------------------------
[INFO]
[INFO] --- maven-enforcer-plugin:1.4:enforce (enforce-maven) @ integration-tests ---
[INFO]
[INFO] --- maven-enforcer-plugin:1.4:enforce (enforce-java) @ integration-tests ---
[INFO]
[INFO] --- maven-remote-resources-plugin:1.5:process (process-resource-bundles) @ integration-tests ---
[INFO]
[INFO] --- depends-maven-plugin:1.2:generate-depends-file (generate-depends-file) @ integration-tests ---
[INFO] Created: <https://builds.apache.org/job/ActiveMQ-Artemis-Master/ws/tests/integration-tests/target/classes/META-INF/maven/dependencies.properties>
[INFO]
[INFO] --- maven-resources-plugin:2.6:resources (default-resources) @ integration-tests ---
[INFO] Using 'UTF-8' encoding to copy filtered resources.
[INFO] skip non existing resourceDirectory <https://builds.apache.org/job/ActiveMQ-Artemis-Master/ws/tests/integration-tests/src/main/resources>
[INFO] Copying 3 resources
[INFO]
[INFO] --- maven-compiler-plugin:3.1:compile (default-compile) @ integration-tests ---
[INFO] No sources to compile
[INFO]
[INFO] --- maven-checkstyle-plugin:2.17:check (default) @ integration-tests ---
[INFO] Starting audit...
<https://builds.apache.org/job/ActiveMQ-Artemis-Master/ws/tests/integration-tests/src/test/java/org/apache/activemq/artemis/tests/integration/amqp/AmqpNettyFailoverTest.java>:21:8: error: Unused import - org.apache.activemq.artemis.tests.integration.cluster.failover.FailoverTest.
Audit done.
[INFO] There is 1 error reported by Checkstyle 6.11.2 with <https://builds.apache.org/job/ActiveMQ-Artemis-Master/ws/tests/integration-tests/../../etc/checkstyle.xml> ruleset.
[ERROR] src/test/java/org/apache/activemq/artemis/tests/integration/amqp/AmqpNettyFailoverTest.java:[21,8] (imports) UnusedImports: Unused import - org.apache.activemq.artemis.tests.integration.cluster.failover.FailoverTest.
[INFO] ------------------------------------------------------------------------
[INFO] Reactor Summary:
[INFO]
[INFO] ActiveMQ Artemis Parent ............................ SUCCESS [  3.666 s]
[INFO] ActiveMQ Artemis Commons ........................... SUCCESS [ 13.541 s]
[INFO] ActiveMQ Artemis Core Client ....................... SUCCESS [ 10.305 s]
[INFO] ActiveMQ Artemis Selector Implementation ........... SUCCESS [  3.864 s]
[INFO] ActiveMQ Artemis JMS Client ........................ SUCCESS [  4.575 s]
[INFO] ActiveMQ Artemis Native POM ........................ SUCCESS [  7.125 s]
[INFO] ActiveMQ Artemis Journal ........................... SUCCESS [  4.106 s]
[INFO] ActiveMQ Artemis JDBC Store ........................ SUCCESS [  5.604 s]
[INFO] ActiveMQ Artemis Server ............................ SUCCESS [ 50.435 s]
[INFO] ActiveMQ Artemis Protocols ......................... SUCCESS [  0.968 s]
[INFO] ActiveMQ Artemis AMQP Protocol ..................... SUCCESS [  6.075 s]
[INFO] ActiveMQ Artemis STOMP Protocol .................... SUCCESS [  2.571 s]
[INFO] ActiveMQ Artemis OpenWire Protocol ................. SUCCESS [  2.419 s]
[INFO] ActiveMQ Artemis HQClient Protocol ................. SUCCESS [  1.106 s]
[INFO] ActiveMQ Artemis HornetQ Protocol .................. SUCCESS [  1.408 s]
[INFO] ActiveMQ Artemis MQTT Protocol ..................... SUCCESS [  2.195 s]
[INFO] ActiveMQ Artemis DTO ............................... SUCCESS [  3.267 s]
[INFO] ActiveMQ Artemis Service Extensions ................ SUCCESS [  2.267 s]
[INFO] ActiveMQ Artemis JMS Server ........................ SUCCESS [  2.585 s]
[INFO] ActiveMQ Artemis CDI Integration ................... SUCCESS [  5.710 s]
[INFO] ActiveMQ Artemis Boot .............................. SUCCESS [  0.849 s]
[INFO] ActiveMQ Artemis Tools ............................. SUCCESS [  1.512 s]
[INFO] ActiveMQ Artemis CLI ............................... SUCCESS [ 25.670 s]
[INFO] ActiveMQ Artemis Web ............................... SUCCESS [  6.082 s]
[INFO] ActiveMQ Artemis Web ............................... SUCCESS [  1.399 s]
[INFO] ActiveMQ Artemis JUnit Rules ....................... SUCCESS [  8.755 s]
[INFO] ActiveMQ Artemis RAR POM ........................... SUCCESS [  3.147 s]
[INFO] ActiveMQ Artemis REST Interface Implementation ..... SUCCESS [01:25 min]
[INFO] ActiveMQ Artemis Maven Plugin ...................... SUCCESS [  7.053 s]
[INFO] ActiveMQ Artemis Server OSGi ....................... SUCCESS [  2.594 s]
[INFO] ActiveMQ Artemis Spring Integration ................ SUCCESS [  1.698 s]
[INFO] Apache ActiveMQ Artemis Distribution ............... SUCCESS [  3.287 s]
[INFO] ActiveMQ Artemis Tests POM ......................... SUCCESS [  1.701 s]
[INFO] ActiveMQ Artemis Unit Tests ........................ SUCCESS [02:53 min]
[INFO] ActiveMQ Artemis Joram Tests ....................... SUCCESS [ 35.042 s]
[INFO] ActiveMQ Artemis timing Tests ...................... SUCCESS [  2.370 s]
[INFO] ActiveMQ Artemis JMS Tests ......................... SUCCESS [03:16 min]
[INFO] ActiveMQ Artemis Features .......................... SUCCESS [  0.101 s]
[INFO] ActiveMQ Artemis Test Support ...................... SUCCESS [  2.866 s]
[INFO] ActiveMQ Artemis Integration Tests ................. FAILURE [  9.324 s]
[INFO] ActiveMQ Artemis soak Tests ........................ SKIPPED
[INFO] ActiveMQ Artemis stress Tests ...................... SKIPPED
[INFO] ActiveMQ Artemis performance Tests ................. SKIPPED
[INFO] ActiveMQ Artemis Extra Tests ....................... SKIPPED
[INFO] ------------------------------------------------------------------------
[INFO] BUILD FAILURE
[INFO] ------------------------------------------------------------------------
[INFO] Total time: 11:44 min
[INFO] Finished at: 2017-03-20T22:30:34+00:00
[INFO] Final Memory: 320M/7062M
[INFO] ------------------------------------------------------------------------
[ERROR] Failed to execute goal org.apache.maven.plugins:maven-checkstyle-plugin:2.17:check (default) on project integration-tests: You have 1 Checkstyle violation. -> [Help 1]
[ERROR]
[ERROR] To see the full stack trace of the errors, re-run Maven with the -e switch.
[ERROR] Re-run Maven using the -X switch to enable full debug logging.
[ERROR]
[ERROR] For more information about the errors and possible solutions, please read the following articles:
[ERROR] [Help 1] http://cwiki.apache.org/confluence/display/MAVEN/MojoFailureException
[ERROR]
[ERROR] After correcting the problems, you can resume the build with the command
[ERROR]   mvn <goals> -rf :integration-tests
Build step 'Invoke top-level Maven targets' marked build as failure
Performing Post build task...
Could not match :Too many files with unapproved license  : False
Logical operation result is FALSE
Skipping script  : cat ratReport.txt
END OF POST BUILD TASK : 0
Recording test results
Reply | Threaded
Open this post in threaded view
|  
Report Content as Inappropriate

Jenkins build is back to normal : ActiveMQ-Artemis-Master #923

Apache Jenkins Server-2
Loading...