Build failed in Jenkins: ActiveMQ-Artemis-Master #861

Previous Topic Next Topic
 
classic Classic list List threaded Threaded
2 messages Options
Reply | Threaded
Open this post in threaded view
|

Build failed in Jenkins: ActiveMQ-Artemis-Master #861

Apache Jenkins Server-2
See <https://builds.apache.org/job/ActiveMQ-Artemis-Master/861/changes>

Changes:

[mtaylor] ARTEMIS-974 ensure will messages are retained

------------------------------------------
[...truncated 17920 lines...]
        at org.junit.runners.ParentRunner.runLeaf(ParentRunner.java:271) [junit-4.11.jar:]
        at org.junit.runners.BlockJUnit4ClassRunner.runChild(BlockJUnit4ClassRunner.java:70) [junit-4.11.jar:]
        at org.junit.runners.BlockJUnit4ClassRunner.runChild(BlockJUnit4ClassRunner.java:50) [junit-4.11.jar:]
        at org.junit.runners.ParentRunner$3.run(ParentRunner.java:238) [junit-4.11.jar:]
        at org.junit.runners.ParentRunner$1.schedule(ParentRunner.java:63) [junit-4.11.jar:]
        at org.junit.runners.ParentRunner.runChildren(ParentRunner.java:236) [junit-4.11.jar:]
        at org.junit.runners.ParentRunner.access$000(ParentRunner.java:53) [junit-4.11.jar:]
        at org.junit.runners.ParentRunner$2.evaluate(ParentRunner.java:229) [junit-4.11.jar:]
        at org.junit.runners.ParentRunner.run(ParentRunner.java:309) [junit-4.11.jar:]
        at org.apache.maven.surefire.junit4.JUnit4Provider.execute(JUnit4Provider.java:283) [surefire-junit4-2.18.1.jar:2.18.1]
        at org.apache.maven.surefire.junit4.JUnit4Provider.executeWithRerun(JUnit4Provider.java:173) [surefire-junit4-2.18.1.jar:2.18.1]
        at org.apache.maven.surefire.junit4.JUnit4Provider.executeTestSet(JUnit4Provider.java:153) [surefire-junit4-2.18.1.jar:2.18.1]
        at org.apache.maven.surefire.junit4.JUnit4Provider.invoke(JUnit4Provider.java:128) [surefire-junit4-2.18.1.jar:2.18.1]
        at org.apache.maven.surefire.booter.ForkedBooter.invokeProviderInSameClassLoader(ForkedBooter.java:203) [surefire-booter-2.18.1.jar:2.18.1]
        at org.apache.maven.surefire.booter.ForkedBooter.runSuitesInProcess(ForkedBooter.java:155) [surefire-booter-2.18.1.jar:2.18.1]
        at org.apache.maven.surefire.booter.ForkedBooter.main(ForkedBooter.java:103) [surefire-booter-2.18.1.jar:2.18.1]

[main] 19:08:03,002 INFO  [org.apache.activemq.artemis.ra] AMQ151001: Attempting to reconnect org.apache.activemq.artemis.ra.inflow.ActiveMQActivationSpec(ra=org.apache.activemq.artemis.ra.ActiveMQResourceAdapter@3c4bef00 destination=test destinationType=javax.jms.Topic ack=Auto-acknowledge durable=false clientID=null user=user password=**** maxSession=1)
[main] 19:08:03,003 INFO  [org.apache.activemq.artemis.ra] AMQ151004: Instantiating javax.jms.Topic "test" directly since UseJNDI=false.
[Thread-0 (ActiveMQ-remoting-threads-ActiveMQServerImpl::serverUUID=3c36604d-f47b-11e6-b8fc-020007a90005-98351968-1278616846)] 19:08:03,009 WARN  [org.apache.activemq.artemis.core.server] AMQ222216: Security problem while creating session: AMQ119031: Unable to validate user
[main] 19:08:03,012 ERROR [org.apache.activemq.artemis.ra] AMQ154003: Unable to reconnect org.apache.activemq.artemis.ra.inflow.ActiveMQActivationSpec(ra=org.apache.activemq.artemis.ra.ActiveMQResourceAdapter@3c4bef00 destination=test destinationType=javax.jms.Topic ack=Auto-acknowledge durable=false clientID=null user=user password=**** maxSession=1): ActiveMQSecurityException[errorType=SECURITY_EXCEPTION message=AMQ119031: Unable to validate user]
        at org.apache.activemq.artemis.core.protocol.core.impl.ChannelImpl.sendBlocking(ChannelImpl.java:411) [:]
        at org.apache.activemq.artemis.core.protocol.core.impl.ChannelImpl.sendBlocking(ChannelImpl.java:322) [:]
        at org.apache.activemq.artemis.core.protocol.core.impl.ActiveMQClientProtocolManager.createSessionContext(ActiveMQClientProtocolManager.java:288) [:]
        at org.apache.activemq.artemis.core.protocol.core.impl.ActiveMQClientProtocolManager.createSessionContext(ActiveMQClientProtocolManager.java:237) [:]
        at org.apache.activemq.artemis.core.client.impl.ClientSessionFactoryImpl.createSessionChannel(ClientSessionFactoryImpl.java:1284) [:]
        at org.apache.activemq.artemis.core.client.impl.ClientSessionFactoryImpl.createSessionInternal(ClientSessionFactoryImpl.java:670) [:]
        at org.apache.activemq.artemis.core.client.impl.ClientSessionFactoryImpl.createSession(ClientSessionFactoryImpl.java:295) [:]
        at org.apache.activemq.artemis.ra.ActiveMQResourceAdapter.createSession(ActiveMQResourceAdapter.java:1557) [:]
        at org.apache.activemq.artemis.ra.inflow.ActiveMQActivation.setupSession(ActiveMQActivation.java:482) [:]
        at org.apache.activemq.artemis.ra.inflow.ActiveMQActivation.setup(ActiveMQActivation.java:314) [:]
        at org.apache.activemq.artemis.ra.inflow.ActiveMQActivation.reconnect(ActiveMQActivation.java:659) [:]
        at org.apache.activemq.artemis.ra.inflow.ActiveMQActivation$SetupActivation.run(ActiveMQActivation.java:699) [:]
        at org.apache.activemq.artemis.tests.unit.ra.BootstrapContext$1.scheduleWork(BootstrapContext.java:64) [:]
        at org.apache.activemq.artemis.ra.inflow.ActiveMQActivation.start(ActiveMQActivation.java:251) [:]
        at org.apache.activemq.artemis.tests.unit.ra.ResourceAdapterTest.testForConnectionLeakDuringActivationWhenSessionCreationFails(ResourceAdapterTest.java:547) [:]
        at sun.reflect.NativeMethodAccessorImpl.invoke0(Native Method) [rt.jar:1.8.0_121]
        at sun.reflect.NativeMethodAccessorImpl.invoke(NativeMethodAccessorImpl.java:62) [rt.jar:1.8.0_121]
        at sun.reflect.DelegatingMethodAccessorImpl.invoke(DelegatingMethodAccessorImpl.java:43) [rt.jar:1.8.0_121]
        at java.lang.reflect.Method.invoke(Method.java:498) [rt.jar:1.8.0_121]
        at org.junit.runners.model.FrameworkMethod$1.runReflectiveCall(FrameworkMethod.java:47) [junit-4.11.jar:]
        at org.junit.internal.runners.model.ReflectiveCallable.run(ReflectiveCallable.java:12) [junit-4.11.jar:]
        at org.junit.runners.model.FrameworkMethod.invokeExplosively(FrameworkMethod.java:44) [junit-4.11.jar:]
        at org.junit.internal.runners.statements.InvokeMethod.evaluate(InvokeMethod.java:17) [junit-4.11.jar:]
        at org.junit.internal.runners.statements.RunBefores.evaluate(RunBefores.java:26) [junit-4.11.jar:]
        at org.junit.internal.runners.statements.RunAfters.evaluate(RunAfters.java:27) [junit-4.11.jar:]
        at org.junit.rules.ExternalResource$1.evaluate(ExternalResource.java:48) [junit-4.11.jar:]
        at org.junit.rules.TestWatcher$1.evaluate(TestWatcher.java:55) [junit-4.11.jar:]
        at org.junit.rules.ExternalResource$1.evaluate(ExternalResource.java:48) [junit-4.11.jar:]
        at org.junit.rules.ExternalResource$1.evaluate(ExternalResource.java:48) [junit-4.11.jar:]
        at org.junit.rules.TestWatcher$1.evaluate(TestWatcher.java:55) [junit-4.11.jar:]
        at org.junit.rules.RunRules.evaluate(RunRules.java:20) [junit-4.11.jar:]
        at org.junit.runners.ParentRunner.runLeaf(ParentRunner.java:271) [junit-4.11.jar:]
        at org.junit.runners.BlockJUnit4ClassRunner.runChild(BlockJUnit4ClassRunner.java:70) [junit-4.11.jar:]
        at org.junit.runners.BlockJUnit4ClassRunner.runChild(BlockJUnit4ClassRunner.java:50) [junit-4.11.jar:]
        at org.junit.runners.ParentRunner$3.run(ParentRunner.java:238) [junit-4.11.jar:]
        at org.junit.runners.ParentRunner$1.schedule(ParentRunner.java:63) [junit-4.11.jar:]
        at org.junit.runners.ParentRunner.runChildren(ParentRunner.java:236) [junit-4.11.jar:]
        at org.junit.runners.ParentRunner.access$000(ParentRunner.java:53) [junit-4.11.jar:]
        at org.junit.runners.ParentRunner$2.evaluate(ParentRunner.java:229) [junit-4.11.jar:]
        at org.junit.runners.ParentRunner.run(ParentRunner.java:309) [junit-4.11.jar:]
        at org.apache.maven.surefire.junit4.JUnit4Provider.execute(JUnit4Provider.java:283) [surefire-junit4-2.18.1.jar:2.18.1]
        at org.apache.maven.surefire.junit4.JUnit4Provider.executeWithRerun(JUnit4Provider.java:173) [surefire-junit4-2.18.1.jar:2.18.1]
        at org.apache.maven.surefire.junit4.JUnit4Provider.executeTestSet(JUnit4Provider.java:153) [surefire-junit4-2.18.1.jar:2.18.1]
        at org.apache.maven.surefire.junit4.JUnit4Provider.invoke(JUnit4Provider.java:128) [surefire-junit4-2.18.1.jar:2.18.1]
        at org.apache.maven.surefire.booter.ForkedBooter.invokeProviderInSameClassLoader(ForkedBooter.java:203) [surefire-booter-2.18.1.jar:2.18.1]
        at org.apache.maven.surefire.booter.ForkedBooter.runSuitesInProcess(ForkedBooter.java:155) [surefire-booter-2.18.1.jar:2.18.1]
        at org.apache.maven.surefire.booter.ForkedBooter.main(ForkedBooter.java:103) [surefire-booter-2.18.1.jar:2.18.1]

[main] 19:08:03,015 INFO  [org.apache.activemq.artemis.ra] AMQ151003: resource adaptor stopped
[main] 19:08:03,019 INFO  [org.apache.activemq.artemis.core.server] AMQ221002: Apache ActiveMQ Artemis Message Broker version 2.0.0-SNAPSHOT [3c36604d-f47b-11e6-b8fc-020007a90005] stopped, uptime 2.046 seconds
[main] 19:08:03,027 INFO  [org.apache.activemq.artemis.core.server] #*#*# Finished test: testForConnectionLeakDuringActivationWhenSessionCreationFails()...
[main] 19:08:03,027 INFO  [org.apache.activemq.artemis.core.server] #*#*# Starting test: testCreateConnectionFactoryThrowsException()...
#test testCreateConnectionFactoryThrowsException
[main] 19:08:03,037 INFO  [org.apache.activemq.artemis.core.server] #*#*# Finished test: testCreateConnectionFactoryThrowsException()...
[main] 19:08:03,041 INFO  [org.apache.activemq.artemis.core.server] #*#*# Starting test: testCreateConnectionFactoryMultipleConnectorsOverrideAndParams()...
#test testCreateConnectionFactoryMultipleConnectorsOverrideAndParams
[main] 19:08:03,053 INFO  [org.apache.activemq.artemis.core.server] #*#*# Finished test: testCreateConnectionFactoryMultipleConnectorsOverrideAndParams()...
[main] 19:08:03,055 INFO  [org.apache.activemq.artemis.core.server] #*#*# Starting test: test2DefaultConnectionFactorySame()...
#test test2DefaultConnectionFactorySame
[main] 19:08:03,065 INFO  [org.apache.activemq.artemis.core.server] #*#*# Finished test: test2DefaultConnectionFactorySame()...
Tests run: 16, Failures: 0, Errors: 0, Skipped: 0, Time elapsed: 2.362 sec - in org.apache.activemq.artemis.tests.unit.ra.ResourceAdapterTest
Running org.apache.activemq.artemis.tests.unit.util.ActiveMQBufferInputStreamTest
[main] 19:08:03,067 INFO  [org.apache.activemq.artemis.core.server] #*#*# Starting test: testReadBytes()...
#test testReadBytes
[main] 19:08:03,080 INFO  [org.apache.activemq.artemis.core.server] #*#*# Finished test: testReadBytes()...
Tests run: 1, Failures: 0, Errors: 0, Skipped: 0, Time elapsed: 0.014 sec - in org.apache.activemq.artemis.tests.unit.util.ActiveMQBufferInputStreamTest
Running org.apache.activemq.artemis.tests.unit.util.LinkedListTest
[main] 19:08:03,082 INFO  [org.apache.activemq.artemis.core.server] #*#*# Starting test: testAddHead()...
#test testAddHead
[main] 19:08:03,092 INFO  [org.apache.activemq.artemis.core.server] #*#*# Finished test: testAddHead()...
[main] 19:08:03,093 INFO  [org.apache.activemq.artemis.core.server] #*#*# Starting test: testAddTail()...
#test testAddTail
[main] 19:08:03,101 INFO  [org.apache.activemq.artemis.core.server] #*#*# Finished test: testAddTail()...
[main] 19:08:03,102 INFO  [org.apache.activemq.artemis.core.server] #*#*# Starting test: testAddHeadAndTail()...
#test testAddHeadAndTail
[main] 19:08:03,110 INFO  [org.apache.activemq.artemis.core.server] #*#*# Finished test: testAddHeadAndTail()...
[main] 19:08:03,111 INFO  [org.apache.activemq.artemis.core.server] #*#*# Starting test: testCreateIteratorAfterAddElements()...
#test testCreateIteratorAfterAddElements
[main] 19:08:03,121 INFO  [org.apache.activemq.artemis.core.server] #*#*# Finished test: testCreateIteratorAfterAddElements()...
[main] 19:08:03,122 INFO  [org.apache.activemq.artemis.core.server] #*#*# Starting test: testClear()...
#test testClear
[main] 19:08:03,130 INFO  [org.apache.activemq.artemis.core.server] #*#*# Finished test: testClear()...
[main] 19:08:03,131 INFO  [org.apache.activemq.artemis.core.server] #*#*# Starting test: testPoll()...
#test testPoll
[main] 19:08:03,139 INFO  [org.apache.activemq.artemis.core.server] #*#*# Finished test: testPoll()...
[main] 19:08:03,140 INFO  [org.apache.activemq.artemis.core.server] #*#*# Starting test: testRemoveHead1()...
#test testRemoveHead1
[main] 19:08:03,149 INFO  [org.apache.activemq.artemis.core.server] #*#*# Finished test: testRemoveHead1()...
[main] 19:08:03,150 INFO  [org.apache.activemq.artemis.core.server] #*#*# Starting test: testRemoveHead2()...
#test testRemoveHead2
[main] 19:08:03,159 INFO  [org.apache.activemq.artemis.core.server] #*#*# Finished test: testRemoveHead2()...
[main] 19:08:03,160 INFO  [org.apache.activemq.artemis.core.server] #*#*# Starting test: testRemoveHead3()...
#test testRemoveHead3
[main] 19:08:03,171 INFO  [org.apache.activemq.artemis.core.server] #*#*# Finished test: testRemoveHead3()...
[main] 19:08:03,172 INFO  [org.apache.activemq.artemis.core.server] #*#*# Starting test: testRemoveTail1()...
#test testRemoveTail1
[main] 19:08:03,182 INFO  [org.apache.activemq.artemis.core.server] #*#*# Finished test: testRemoveTail1()...
[main] 19:08:03,183 INFO  [org.apache.activemq.artemis.core.server] #*#*# Starting test: testRemoveTail2()...
#test testRemoveTail2
[main] 19:08:03,197 INFO  [org.apache.activemq.artemis.core.server] #*#*# Finished test: testRemoveTail2()...
[main] 19:08:03,197 INFO  [org.apache.activemq.artemis.core.server] #*#*# Starting test: testRemoveTail3()...
#test testRemoveTail3
[main] 19:08:03,207 INFO  [org.apache.activemq.artemis.core.server] #*#*# Finished test: testRemoveTail3()...
[main] 19:08:03,207 INFO  [org.apache.activemq.artemis.core.server] #*#*# Starting test: testRemoveInTurn()...
#test testRemoveInTurn
[main] 19:08:03,217 INFO  [org.apache.activemq.artemis.core.server] #*#*# Finished test: testRemoveInTurn()...
[main] 19:08:03,219 INFO  [org.apache.activemq.artemis.core.server] #*#*# Starting test: testRemoveMiddle()...
#test testRemoveMiddle
[main] 19:08:03,229 INFO  [org.apache.activemq.artemis.core.server] #*#*# Finished test: testRemoveMiddle()...
[main] 19:08:03,230 INFO  [org.apache.activemq.artemis.core.server] #*#*# Starting test: testAddHeadAndRemove()...
#test testAddHeadAndRemove
Jumping 500
[main] 19:08:03,241 INFO  [org.apache.activemq.artemis.utils.ThreadLeakCheckRule] #test forceGC
[main] 19:08:04,875 INFO  [org.apache.activemq.artemis.utils.ThreadLeakCheckRule] #test forceGC Done
[main] 19:08:04,883 INFO  [org.apache.activemq.artemis.core.server] #*#*# Finished test: testAddHeadAndRemove()...
[main] 19:08:04,885 INFO  [org.apache.activemq.artemis.core.server] #*#*# Starting test: testMultipleIterators1()...
#test testMultipleIterators1
[main] 19:08:04,890 INFO  [org.apache.activemq.artemis.core.server] #*#*# Finished test: testMultipleIterators1()...
[main] 19:08:04,890 INFO  [org.apache.activemq.artemis.core.server] #*#*# Starting test: testMultipleIterators2()...
#test testMultipleIterators2
[main] 19:08:04,893 INFO  [org.apache.activemq.artemis.core.server] #*#*# Finished test: testMultipleIterators2()...
[main] 19:08:04,893 INFO  [org.apache.activemq.artemis.core.server] #*#*# Starting test: testResizing()...
#test testResizing
[main] 19:08:04,900 INFO  [org.apache.activemq.artemis.core.server] #*#*# Finished test: testResizing()...
[main] 19:08:04,900 INFO  [org.apache.activemq.artemis.core.server] #*#*# Starting test: testRepeatAndRemove()...
#test testRepeatAndRemove
[main] 19:08:04,903 INFO  [org.apache.activemq.artemis.core.server] #*#*# Finished test: testRepeatAndRemove()...
[main] 19:08:04,903 INFO  [org.apache.activemq.artemis.core.server] #*#*# Starting test: testIterateNoElements()...
#test testIterateNoElements
[main] 19:08:04,906 INFO  [org.apache.activemq.artemis.core.server] #*#*# Finished test: testIterateNoElements()...
[main] 19:08:04,907 INFO  [org.apache.activemq.artemis.core.server] #*#*# Starting test: testAddAndRemove()...
#test testAddAndRemove
[main] 19:08:04,917 INFO  [org.apache.activemq.artemis.utils.ThreadLeakCheckRule] #test forceGC
[main] 19:08:04,972 INFO  [org.apache.activemq.artemis.utils.ThreadLeakCheckRule] #test forceGC Done
[main] 19:08:05,246 INFO  [org.apache.activemq.artemis.utils.ThreadLeakCheckRule] #test forceGC
[main] 19:08:06,690 INFO  [org.apache.activemq.artemis.utils.ThreadLeakCheckRule] #test forceGC Done
[main] 19:08:07,349 INFO  [org.apache.activemq.artemis.utils.ThreadLeakCheckRule] #test forceGC
[main] 19:08:08,649 INFO  [org.apache.activemq.artemis.utils.ThreadLeakCheckRule] #test forceGC Done
[main] 19:08:08,649 INFO  [org.apache.activemq.artemis.utils.ThreadLeakCheckRule] #test forceGC
[main] 19:08:08,766 INFO  [org.apache.activemq.artemis.utils.ThreadLeakCheckRule] #test forceGC Done
[main] 19:08:09,282 INFO  [org.apache.activemq.artemis.utils.ThreadLeakCheckRule] #test forceGC
[main] 19:08:09,961 INFO  [org.apache.activemq.artemis.utils.ThreadLeakCheckRule] #test forceGC Done
#
# There is insufficient memory for the Java Runtime Environment to continue.
SUREFIRE-859: Java HotSpot(TM) 64-Bit Server VM warning: INFO: os::commit_memory(0x0000000712a80000, 331350016, 0) failed; error='Cannot allocate memory' (errno=12)
# Native memory allocation (mmap) failed to map 331350016 bytes for committing reserved memory.
# An error report file with more information is saved as:
# <https://builds.apache.org/job/ActiveMQ-Artemis-Master/ws/tests/unit-tests/hs_err_pid18142.log>

Results :

Tests run: 557, Failures: 0, Errors: 0, Skipped: 0

[INFO] ------------------------------------------------------------------------
[INFO] Reactor Summary:
[INFO]
[INFO] ActiveMQ Artemis Parent ............................ SUCCESS [ 11.160 s]
[INFO] ActiveMQ Artemis Commons ........................... SUCCESS [ 20.496 s]
[INFO] ActiveMQ Artemis Core Client ....................... SUCCESS [ 20.438 s]
[INFO] ActiveMQ Artemis Selector Implementation ........... SUCCESS [ 10.126 s]
[INFO] ActiveMQ Artemis JMS Client ........................ SUCCESS [  5.584 s]
[INFO] ActiveMQ Artemis Native POM ........................ SUCCESS [  7.131 s]
[INFO] ActiveMQ Artemis Journal ........................... SUCCESS [  4.847 s]
[INFO] ActiveMQ Artemis JDBC Store ........................ SUCCESS [ 11.975 s]
[INFO] ActiveMQ Artemis Server ............................ SUCCESS [01:00 min]
[INFO] ActiveMQ Artemis Protocols ......................... SUCCESS [  1.364 s]
[INFO] ActiveMQ Artemis AMQP Protocol ..................... SUCCESS [  6.901 s]
[INFO] ActiveMQ Artemis STOMP Protocol .................... SUCCESS [  2.544 s]
[INFO] ActiveMQ Artemis OpenWire Protocol ................. SUCCESS [  3.277 s]
[INFO] ActiveMQ Artemis HQClient Protocol ................. SUCCESS [  1.157 s]
[INFO] ActiveMQ Artemis HornetQ Protocol .................. SUCCESS [  1.862 s]
[INFO] ActiveMQ Artemis MQTT Protocol ..................... SUCCESS [  3.526 s]
[INFO] ActiveMQ Artemis DTO ............................... SUCCESS [  6.736 s]
[INFO] ActiveMQ Artemis Service Extensions ................ SUCCESS [  3.368 s]
[INFO] ActiveMQ Artemis JMS Server ........................ SUCCESS [  2.780 s]
[INFO] ActiveMQ Artemis CDI Integration ................... SUCCESS [  9.083 s]
[INFO] ActiveMQ Artemis Boot .............................. SUCCESS [  2.219 s]
[INFO] ActiveMQ Artemis Tools ............................. SUCCESS [  3.749 s]
[INFO] ActiveMQ Artemis CLI ............................... SUCCESS [ 37.084 s]
[INFO] ActiveMQ Artemis Web ............................... SUCCESS [ 10.646 s]
[INFO] ActiveMQ Artemis Web ............................... SUCCESS [  2.324 s]
[INFO] ActiveMQ Artemis JUnit Rules ....................... SUCCESS [ 14.388 s]
[INFO] ActiveMQ Artemis RAR POM ........................... SUCCESS [  5.810 s]
[INFO] ActiveMQ Artemis REST Interface Implementation ..... SUCCESS [01:37 min]
[INFO] ActiveMQ Artemis Maven Plugin ...................... SUCCESS [  9.068 s]
[INFO] ActiveMQ Artemis Server OSGi ....................... SUCCESS [  4.240 s]
[INFO] ActiveMQ Artemis Spring Integration ................ SUCCESS [  2.951 s]
[INFO] ActiveMQ Artemis Aerogear Integration .............. SUCCESS [  2.558 s]
[INFO] ActiveMQ Artemis Vert.x Integration ................ SUCCESS [  3.548 s]
[INFO] Apache ActiveMQ Artemis Distribution ............... SUCCESS [  4.908 s]
[INFO] ActiveMQ Artemis Tests POM ......................... SUCCESS [  5.396 s]
[INFO] ActiveMQ Artemis Unit Tests ........................ FAILURE [02:05 min]
[INFO] ActiveMQ Artemis Joram Tests ....................... SKIPPED
[INFO] ActiveMQ Artemis timing Tests ...................... SKIPPED
[INFO] ActiveMQ Artemis JMS Tests ......................... SKIPPED
[INFO] ActiveMQ Artemis Features .......................... SKIPPED
[INFO] ActiveMQ Artemis Test Support ...................... SKIPPED
[INFO] ActiveMQ Artemis Integration Tests ................. SKIPPED
[INFO] ActiveMQ Artemis soak Tests ........................ SKIPPED
[INFO] ActiveMQ Artemis stress Tests ...................... SKIPPED
[INFO] ActiveMQ Artemis performance Tests ................. SKIPPED
[INFO] ActiveMQ Artemis Extra Tests ....................... SKIPPED
[INFO] ------------------------------------------------------------------------
[INFO] BUILD FAILURE
[INFO] ------------------------------------------------------------------------
[INFO] Total time: 08:50 min
[INFO] Finished at: 2017-02-16T19:08:12+00:00
[INFO] Final Memory: 220M/1502M
[INFO] ------------------------------------------------------------------------
[ERROR] Failed to execute goal org.apache.maven.plugins:maven-surefire-plugin:2.18.1:test (default-test) on project unit-tests: Execution default-test of goal org.apache.maven.plugins:maven-surefire-plugin:2.18.1:test failed: The forked VM terminated without properly saying goodbye. VM crash or System.exit called?
[ERROR] Command was /bin/sh -c cd <https://builds.apache.org/job/ActiveMQ-Artemis-Master/ws/tests/unit-tests> && /usr/local/asfpackages/java/jdk1.8.0_121/jre/bin/java -Djava.util.logging.manager=org.jboss.logmanager.LogManager -Dlogging.configuration=<https://builds.apache.org/job/ActiveMQ-Artemis-Master/ws/tests/unit-tests/../../tests/config/logging.properties> -Djava.library.path=<https://builds.apache.org/job/ActiveMQ-Artemis-Master/ws/tests/unit-tests/../../artemis-native/bin> -Djgroups.bind_addr=localhost -Dorg.apache.activemq.artemis.api.core.UDPBroadcastEndpointFactory.localBindAddress=localhost -Djava.net.preferIPv4Stack=true -jar <https://builds.apache.org/job/ActiveMQ-Artemis-Master/ws/tests/unit-tests/target/surefire/surefirebooter5637684062708722751.jar> <https://builds.apache.org/job/ActiveMQ-Artemis-Master/ws/tests/unit-tests/target/surefire/surefire7313068688254808219tmp> <https://builds.apache.org/job/ActiveMQ-Artemis-Master/ws/tests/unit-tests/target/surefire/surefire_175222261561925323381tmp>
[ERROR] -> [Help 1]
[ERROR]
[ERROR] To see the full stack trace of the errors, re-run Maven with the -e switch.
[ERROR] Re-run Maven using the -X switch to enable full debug logging.
[ERROR]
[ERROR] For more information about the errors and possible solutions, please read the following articles:
[ERROR] [Help 1] http://cwiki.apache.org/confluence/display/MAVEN/PluginExecutionException
[ERROR]
[ERROR] After correcting the problems, you can resume the build with the command
[ERROR]   mvn <goals> -rf :unit-tests
Build step 'Invoke top-level Maven targets' marked build as failure
Performing Post build task...
Could not match :Too many files with unapproved license  : False
Logical operation result is FALSE
Skipping script  : cat ratReport.txt
END OF POST BUILD TASK : 0
Recording test results
Reply | Threaded
Open this post in threaded view
|

Jenkins build is back to normal : ActiveMQ-Artemis-Master #862

Apache Jenkins Server-2