Build failed in Jenkins: ActiveMQ-Artemis-Master #1606

Previous Topic Next Topic
 
classic Classic list List threaded Threaded
3 messages Options
Reply | Threaded
Open this post in threaded view
|

Build failed in Jenkins: ActiveMQ-Artemis-Master #1606

Apache Jenkins Server-2
See <https://builds.apache.org/job/ActiveMQ-Artemis-Master/1606/display/redirect>

------------------------------------------
Started by an SCM change
Started by an SCM change
Started by an SCM change
Started by an SCM change
[EnvInject] - Loading node environment variables.
Building remotely on H22 (ubuntu xenial) in workspace <https://builds.apache.org/job/ActiveMQ-Artemis-Master/ws/>
 > git rev-parse --is-inside-work-tree # timeout=10
Fetching changes from the remote Git repository
 > git config remote.origin.url https://git-wip-us.apache.org/repos/asf/activemq-artemis.git # timeout=10
Cleaning workspace
 > git rev-parse --verify HEAD # timeout=10
Resetting working tree
 > git reset --hard # timeout=10
ERROR: Error fetching remote repo 'origin'
hudson.plugins.git.GitException: Failed to fetch from https://git-wip-us.apache.org/repos/asf/activemq-artemis.git
        at hudson.plugins.git.GitSCM.fetchFrom(GitSCM.java:825)
        at hudson.plugins.git.GitSCM.retrieveChanges(GitSCM.java:1092)
        at hudson.plugins.git.GitSCM.checkout(GitSCM.java:1123)
        at hudson.scm.SCM.checkout(SCM.java:495)
        at hudson.model.AbstractProject.checkout(AbstractProject.java:1202)
        at hudson.model.AbstractBuild$AbstractBuildExecution.defaultCheckout(AbstractBuild.java:574)
        at jenkins.scm.SCMCheckoutStrategy.checkout(SCMCheckoutStrategy.java:86)
        at hudson.model.AbstractBuild$AbstractBuildExecution.run(AbstractBuild.java:499)
        at hudson.model.Run.execute(Run.java:1724)
        at hudson.model.FreeStyleBuild.run(FreeStyleBuild.java:43)
        at hudson.model.ResourceController.execute(ResourceController.java:97)
        at hudson.model.Executor.run(Executor.java:421)
Caused by: hudson.plugins.git.GitException: Command "git reset --hard" returned status code 128:
stdout:
stderr: fatal: Could not write new index file.

        at org.jenkinsci.plugins.gitclient.CliGitAPIImpl.launchCommandIn(CliGitAPIImpl.java:1970)
        at org.jenkinsci.plugins.gitclient.CliGitAPIImpl.launchCommandIn(CliGitAPIImpl.java:1938)
        at org.jenkinsci.plugins.gitclient.CliGitAPIImpl.launchCommandIn(CliGitAPIImpl.java:1934)
        at org.jenkinsci.plugins.gitclient.CliGitAPIImpl.launchCommand(CliGitAPIImpl.java:1572)
        at org.jenkinsci.plugins.gitclient.CliGitAPIImpl.reset(CliGitAPIImpl.java:438)
        at org.jenkinsci.plugins.gitclient.CliGitAPIImpl.clean(CliGitAPIImpl.java:761)
        at hudson.plugins.git.GitAPI.clean(GitAPI.java:311)
        at sun.reflect.NativeMethodAccessorImpl.invoke0(Native Method)
        at sun.reflect.NativeMethodAccessorImpl.invoke(NativeMethodAccessorImpl.java:62)
        at sun.reflect.DelegatingMethodAccessorImpl.invoke(DelegatingMethodAccessorImpl.java:43)
        at java.lang.reflect.Method.invoke(Method.java:498)
        at hudson.remoting.RemoteInvocationHandler$RPCRequest.perform(RemoteInvocationHandler.java:922)
        at hudson.remoting.RemoteInvocationHandler$RPCRequest.call(RemoteInvocationHandler.java:896)
        at hudson.remoting.RemoteInvocationHandler$RPCRequest.call(RemoteInvocationHandler.java:853)
        at hudson.remoting.UserRequest.perform(UserRequest.java:207)
        at hudson.remoting.UserRequest.perform(UserRequest.java:53)
        at hudson.remoting.Request$2.run(Request.java:358)
        at hudson.remoting.InterceptingExecutorService$1.call(InterceptingExecutorService.java:72)
        at java.util.concurrent.FutureTask.run(FutureTask.java:266)
        at java.util.concurrent.ThreadPoolExecutor.runWorker(ThreadPoolExecutor.java:1142)
        at java.util.concurrent.ThreadPoolExecutor$Worker.run(ThreadPoolExecutor.java:617)
        at java.lang.Thread.run(Thread.java:748)
        Suppressed: hudson.remoting.Channel$CallSiteStackTrace: Remote call to H22
                at hudson.remoting.Channel.attachCallSiteStackTrace(Channel.java:1693)
                at hudson.remoting.UserResponse.retrieve(UserRequest.java:310)
                at hudson.remoting.Channel.call(Channel.java:908)
                at hudson.remoting.RemoteInvocationHandler.invoke(RemoteInvocationHandler.java:281)
                at com.sun.proxy.$Proxy110.clean(Unknown Source)
                at org.jenkinsci.plugins.gitclient.RemoteGitImpl.clean(RemoteGitImpl.java:450)
                at hudson.plugins.git.extensions.impl.CleanBeforeCheckout.decorateFetchCommand(CleanBeforeCheckout.java:30)
                at hudson.plugins.git.GitSCM.fetchFrom(GitSCM.java:821)
                at hudson.plugins.git.GitSCM.retrieveChanges(GitSCM.java:1092)
                at hudson.plugins.git.GitSCM.checkout(GitSCM.java:1123)
                at hudson.scm.SCM.checkout(SCM.java:495)
                at hudson.model.AbstractProject.checkout(AbstractProject.java:1202)
                at hudson.model.AbstractBuild$AbstractBuildExecution.defaultCheckout(AbstractBuild.java:574)
                at jenkins.scm.SCMCheckoutStrategy.checkout(SCMCheckoutStrategy.java:86)
                at hudson.model.AbstractBuild$AbstractBuildExecution.run(AbstractBuild.java:499)
                at hudson.model.Run.execute(Run.java:1724)
                at hudson.model.FreeStyleBuild.run(FreeStyleBuild.java:43)
                at hudson.model.ResourceController.execute(ResourceController.java:97)
                at hudson.model.Executor.run(Executor.java:421)
ERROR: Error fetching remote repo 'origin'
Retrying after 10 seconds
 > git rev-parse --is-inside-work-tree # timeout=10
Fetching changes from the remote Git repository
 > git config remote.origin.url https://git-wip-us.apache.org/repos/asf/activemq-artemis.git # timeout=10
Cleaning workspace
 > git rev-parse --verify HEAD # timeout=10
Resetting working tree
 > git reset --hard # timeout=10
ERROR: Error fetching remote repo 'origin'
hudson.plugins.git.GitException: Failed to fetch from https://git-wip-us.apache.org/repos/asf/activemq-artemis.git
        at hudson.plugins.git.GitSCM.fetchFrom(GitSCM.java:825)
        at hudson.plugins.git.GitSCM.retrieveChanges(GitSCM.java:1092)
        at hudson.plugins.git.GitSCM.checkout(GitSCM.java:1123)
        at hudson.scm.SCM.checkout(SCM.java:495)
        at hudson.model.AbstractProject.checkout(AbstractProject.java:1202)
        at hudson.model.AbstractBuild$AbstractBuildExecution.defaultCheckout(AbstractBuild.java:574)
        at jenkins.scm.SCMCheckoutStrategy.checkout(SCMCheckoutStrategy.java:86)
        at hudson.model.AbstractBuild$AbstractBuildExecution.run(AbstractBuild.java:499)
        at hudson.model.Run.execute(Run.java:1724)
        at hudson.model.FreeStyleBuild.run(FreeStyleBuild.java:43)
        at hudson.model.ResourceController.execute(ResourceController.java:97)
        at hudson.model.Executor.run(Executor.java:421)
Caused by: hudson.plugins.git.GitException: Command "git reset --hard" returned status code 128:
stdout:
stderr: Checking out files:  34% (1766/5128)   Checking out files:  35% (1795/5128)   Checking out files:  36% (1847/5128)   Checking out files:  37% (1898/5128)   Checking out files:  38% (1949/5128)   Checking out files:  39% (2000/5128)   Checking out files:  40% (2052/5128)   Checking out files:  41% (2103/5128)   Checking out files:  42% (2154/5128)   Checking out files:  43% (2206/5128)   Checking out files:  44% (2257/5128)   Checking out files:  45% (2308/5128)   Checking out files:  46% (2359/5128)   Checking out files:  47% (2411/5128)   Checking out files:  48% (2462/5128)   Checking out files:  49% (2513/5128)   Checking out files:  50% (2564/5128)   Checking out files:  51% (2616/5128)   Checking out files:  52% (2667/5128)   Checking out files:  53% (2718/5128)   Checking out files:  54% (2770/5128)   Checking out files:  55% (2821/5128)   Checking out files:  56% (2872/5128)   Checking out files:  57% (2923/5128)   Checking out files:  58% (2975/5128)   Checking out files:  59% (3026/5128)   Checking out files:  60% (3077/5128)   Checking out files:  61% (3129/5128)   Checking out files:  62% (3180/5128)   Checking out files:  63% (3231/5128)   Checking out files:  64% (3282/5128)   Checking out files:  65% (3334/5128)   Checking out files:  66% (3385/5128)   Checking out files:  67% (3436/5128)   Checking out files:  68% (3488/5128)   Checking out files:  69% (3539/5128)   Checking out files:  70% (3590/5128)   Checking out files:  71% (3641/5128)   Checking out files:  72% (3693/5128)   Checking out files:  73% (3744/5128)   Checking out files:  74% (3795/5128)   Checking out files:  75% (3846/5128)   Checking out files:  76% (3898/5128)   Checking out files:  77% (3949/5128)   Checking out files:  78% (4000/5128)   Checking out files:  78% (4015/5128)   Checking out files:  79% (4052/5128)   Checking out files:  80% (4103/5128)   Checking out files:  81% (4154/5128)   Checking out files:  82% (4205/5128)   Checking out files:  83% (4257/5128)   Checking out files:  84% (4308/5128)   Checking out files:  85% (4359/5128)   Checking out files:  86% (4411/5128)   Checking out files:  87% (4462/5128)   Checking out files:  88% (4513/5128)   Checking out files:  89% (4564/5128)   Checking out files:  90% (4616/5128)   Checking out files:  91% (4667/5128)   Checking out files:  92% (4718/5128)   Checking out files:  93% (4770/5128)   Checking out files:  94% (4821/5128)   Checking out files:  95% (4872/5128)   Checking out files:  96% (4923/5128)   Checking out files:  97% (4975/5128)   Checking out files:  98% (5026/5128)   Checking out files:  99% (5077/5128)   Checking out files: 100% (5128/5128)   Checking out files: 100% (5128/5128), done.
fatal: Could not write new index file.

        at org.jenkinsci.plugins.gitclient.CliGitAPIImpl.launchCommandIn(CliGitAPIImpl.java:1970)
        at org.jenkinsci.plugins.gitclient.CliGitAPIImpl.launchCommandIn(CliGitAPIImpl.java:1938)
        at org.jenkinsci.plugins.gitclient.CliGitAPIImpl.launchCommandIn(CliGitAPIImpl.java:1934)
        at org.jenkinsci.plugins.gitclient.CliGitAPIImpl.launchCommand(CliGitAPIImpl.java:1572)
        at org.jenkinsci.plugins.gitclient.CliGitAPIImpl.reset(CliGitAPIImpl.java:438)
        at org.jenkinsci.plugins.gitclient.CliGitAPIImpl.clean(CliGitAPIImpl.java:761)
        at hudson.plugins.git.GitAPI.clean(GitAPI.java:311)
        at sun.reflect.NativeMethodAccessorImpl.invoke0(Native Method)
        at sun.reflect.NativeMethodAccessorImpl.invoke(NativeMethodAccessorImpl.java:62)
        at sun.reflect.DelegatingMethodAccessorImpl.invoke(DelegatingMethodAccessorImpl.java:43)
        at java.lang.reflect.Method.invoke(Method.java:498)
        at hudson.remoting.RemoteInvocationHandler$RPCRequest.perform(RemoteInvocationHandler.java:922)
        at hudson.remoting.RemoteInvocationHandler$RPCRequest.call(RemoteInvocationHandler.java:896)
        at hudson.remoting.RemoteInvocationHandler$RPCRequest.call(RemoteInvocationHandler.java:853)
        at hudson.remoting.UserRequest.perform(UserRequest.java:207)
        at hudson.remoting.UserRequest.perform(UserRequest.java:53)
        at hudson.remoting.Request$2.run(Request.java:358)
        at hudson.remoting.InterceptingExecutorService$1.call(InterceptingExecutorService.java:72)
        at java.util.concurrent.FutureTask.run(FutureTask.java:266)
        at java.util.concurrent.ThreadPoolExecutor.runWorker(ThreadPoolExecutor.java:1142)
        at java.util.concurrent.ThreadPoolExecutor$Worker.run(ThreadPoolExecutor.java:617)
        at java.lang.Thread.run(Thread.java:748)
        Suppressed: hudson.remoting.Channel$CallSiteStackTrace: Remote call to H22
                at hudson.remoting.Channel.attachCallSiteStackTrace(Channel.java:1693)
                at hudson.remoting.UserResponse.retrieve(UserRequest.java:310)
                at hudson.remoting.Channel.call(Channel.java:908)
                at hudson.remoting.RemoteInvocationHandler.invoke(RemoteInvocationHandler.java:281)
                at com.sun.proxy.$Proxy110.clean(Unknown Source)
                at org.jenkinsci.plugins.gitclient.RemoteGitImpl.clean(RemoteGitImpl.java:450)
                at hudson.plugins.git.extensions.impl.CleanBeforeCheckout.decorateFetchCommand(CleanBeforeCheckout.java:30)
                at hudson.plugins.git.GitSCM.fetchFrom(GitSCM.java:821)
                at hudson.plugins.git.GitSCM.retrieveChanges(GitSCM.java:1092)
                at hudson.plugins.git.GitSCM.checkout(GitSCM.java:1123)
                at hudson.scm.SCM.checkout(SCM.java:495)
                at hudson.model.AbstractProject.checkout(AbstractProject.java:1202)
                at hudson.model.AbstractBuild$AbstractBuildExecution.defaultCheckout(AbstractBuild.java:574)
                at jenkins.scm.SCMCheckoutStrategy.checkout(SCMCheckoutStrategy.java:86)
                at hudson.model.AbstractBuild$AbstractBuildExecution.run(AbstractBuild.java:499)
                at hudson.model.Run.execute(Run.java:1724)
                at hudson.model.FreeStyleBuild.run(FreeStyleBuild.java:43)
                at hudson.model.ResourceController.execute(ResourceController.java:97)
                at hudson.model.Executor.run(Executor.java:421)
ERROR: Error fetching remote repo 'origin'
Retrying after 10 seconds
 > git rev-parse --is-inside-work-tree # timeout=10
Fetching changes from the remote Git repository
 > git config remote.origin.url https://git-wip-us.apache.org/repos/asf/activemq-artemis.git # timeout=10
ERROR: Error fetching remote repo 'origin'
hudson.plugins.git.GitException: Failed to fetch from https://git-wip-us.apache.org/repos/asf/activemq-artemis.git
        at hudson.plugins.git.GitSCM.fetchFrom(GitSCM.java:825)
        at hudson.plugins.git.GitSCM.retrieveChanges(GitSCM.java:1092)
        at hudson.plugins.git.GitSCM.checkout(GitSCM.java:1123)
        at hudson.scm.SCM.checkout(SCM.java:495)
        at hudson.model.AbstractProject.checkout(AbstractProject.java:1202)
        at hudson.model.AbstractBuild$AbstractBuildExecution.defaultCheckout(AbstractBuild.java:574)
        at jenkins.scm.SCMCheckoutStrategy.checkout(SCMCheckoutStrategy.java:86)
        at hudson.model.AbstractBuild$AbstractBuildExecution.run(AbstractBuild.java:499)
        at hudson.model.Run.execute(Run.java:1724)
        at hudson.model.FreeStyleBuild.run(FreeStyleBuild.java:43)
        at hudson.model.ResourceController.execute(ResourceController.java:97)
        at hudson.model.Executor.run(Executor.java:421)
Caused by: hudson.plugins.git.GitException: Command "git config remote.origin.url https://git-wip-us.apache.org/repos/asf/activemq-artemis.git" returned status code 4:
stdout:
stderr: error: failed to write new configuration file <https://builds.apache.org/job/ActiveMQ-Artemis-Master/ws/.git/config.lock>

        at org.jenkinsci.plugins.gitclient.CliGitAPIImpl.launchCommandIn(CliGitAPIImpl.java:1970)
        at org.jenkinsci.plugins.gitclient.CliGitAPIImpl.launchCommandIn(CliGitAPIImpl.java:1938)
        at org.jenkinsci.plugins.gitclient.CliGitAPIImpl.launchCommandIn(CliGitAPIImpl.java:1934)
        at org.jenkinsci.plugins.gitclient.CliGitAPIImpl.launchCommand(CliGitAPIImpl.java:1572)
        at org.jenkinsci.plugins.gitclient.CliGitAPIImpl.launchCommand(CliGitAPIImpl.java:1584)
        at org.jenkinsci.plugins.gitclient.CliGitAPIImpl.setRemoteUrl(CliGitAPIImpl.java:1218)
        at hudson.plugins.git.GitAPI.setRemoteUrl(GitAPI.java:160)
        at sun.reflect.GeneratedMethodAccessor46.invoke(Unknown Source)
        at sun.reflect.DelegatingMethodAccessorImpl.invoke(DelegatingMethodAccessorImpl.java:43)
        at java.lang.reflect.Method.invoke(Method.java:498)
        at hudson.remoting.RemoteInvocationHandler$RPCRequest.perform(RemoteInvocationHandler.java:922)
        at hudson.remoting.RemoteInvocationHandler$RPCRequest.call(RemoteInvocationHandler.java:896)
        at hudson.remoting.RemoteInvocationHandler$RPCRequest.call(RemoteInvocationHandler.java:853)
        at hudson.remoting.UserRequest.perform(UserRequest.java:207)
        at hudson.remoting.UserRequest.perform(UserRequest.java:53)
        at hudson.remoting.Request$2.run(Request.java:358)
        at hudson.remoting.InterceptingExecutorService$1.call(InterceptingExecutorService.java:72)
        at java.util.concurrent.FutureTask.run(FutureTask.java:266)
        at java.util.concurrent.ThreadPoolExecutor.runWorker(ThreadPoolExecutor.java:1142)
        at java.util.concurrent.ThreadPoolExecutor$Worker.run(ThreadPoolExecutor.java:617)
        at java.lang.Thread.run(Thread.java:748)
        Suppressed: hudson.remoting.Channel$CallSiteStackTrace: Remote call to H22
                at hudson.remoting.Channel.attachCallSiteStackTrace(Channel.java:1693)
                at hudson.remoting.UserResponse.retrieve(UserRequest.java:310)
                at hudson.remoting.Channel.call(Channel.java:908)
                at hudson.remoting.RemoteInvocationHandler.invoke(RemoteInvocationHandler.java:281)
                at com.sun.proxy.$Proxy110.setRemoteUrl(Unknown Source)
                at org.jenkinsci.plugins.gitclient.RemoteGitImpl.setRemoteUrl(RemoteGitImpl.java:295)
                at hudson.plugins.git.GitSCM.fetchFrom(GitSCM.java:813)
                at hudson.plugins.git.GitSCM.retrieveChanges(GitSCM.java:1092)
                at hudson.plugins.git.GitSCM.checkout(GitSCM.java:1123)
                at hudson.scm.SCM.checkout(SCM.java:495)
                at hudson.model.AbstractProject.checkout(AbstractProject.java:1202)
                at hudson.model.AbstractBuild$AbstractBuildExecution.defaultCheckout(AbstractBuild.java:574)
                at jenkins.scm.SCMCheckoutStrategy.checkout(SCMCheckoutStrategy.java:86)
                at hudson.model.AbstractBuild$AbstractBuildExecution.run(AbstractBuild.java:499)
                at hudson.model.Run.execute(Run.java:1724)
                at hudson.model.FreeStyleBuild.run(FreeStyleBuild.java:43)
                at hudson.model.ResourceController.execute(ResourceController.java:97)
                at hudson.model.Executor.run(Executor.java:421)
ERROR: Error fetching remote repo 'origin'
Performing Post build task...
Could not match :Too many files with unapproved license  : False
Logical operation result is FALSE
Skipping script  : cat ratReport.txt
END OF POST BUILD TASK : 0
Recording test results
ERROR: Step ?Publish JUnit test result report? failed: Test reports were found but none of them are new. Did leafNodes run?
For example, <https://builds.apache.org/job/ActiveMQ-Artemis-Master/ws/artemis-cdi-client/target/surefire-reports/TEST-org.apache.activemq.artemis.cdi.bootstrap.CDIBootstrapProducerTest.xml> is 3 days 1 hr old

Not sending mail to unregistered user [hidden email]
Reply | Threaded
Open this post in threaded view
|

Build failed in Jenkins: ActiveMQ-Artemis-Master #1607

Apache Jenkins Server-2
See <https://builds.apache.org/job/ActiveMQ-Artemis-Master/1607/display/redirect?page=changes>

Changes:

[mtaylor] ARTEMIS-1658 Fix Typo in ActivationSpec

------------------------------------------
[...truncated 1.69 MB...]
[INFO] Installing <https://builds.apache.org/job/ActiveMQ-Artemis-Master/ws/artemis-hawtio/activemq-branding/target/activemq-branding-2.5.0-SNAPSHOT-sources.jar> to /home/jenkins/.m2/repository/org/apache/activemq/activemq-branding/2.5.0-SNAPSHOT/activemq-branding-2.5.0-SNAPSHOT-sources.jar
[INFO]                                                                        
[INFO] ------------------------------------------------------------------------
[INFO] Building ActiveMQ Artemis HawtIO Plugin 2.5.0-SNAPSHOT
[INFO] ------------------------------------------------------------------------
[INFO]
[INFO] --- maven-enforcer-plugin:1.4:enforce (enforce-maven) @ artemis-plugin ---
[INFO]
[INFO] --- maven-enforcer-plugin:1.4:enforce (enforce-java) @ artemis-plugin ---
[INFO]
[INFO] --- maven-antrun-plugin:1.7:run (generate-sources) @ artemis-plugin ---
[INFO] Executing tasks

main:
     [echo] Building plugin javascript file list
     [echo] Files: plugin/js/address.js,plugin/js/addresses.js,plugin/js/artemisHelpers.js,plugin/js/artemisPlugin.js,plugin/js/artemisService.js,plugin/js/brokerDiagram.js,plugin/js/browse.js,plugin/js/connections.js,plugin/js/consumers.js,plugin/js/jmsHeaderSchema.js,plugin/js/preferences.js,plugin/js/producers.js,plugin/js/queue.js,plugin/js/queues.js,plugin/js/send.js,plugin/js/sessions.js,plugin/js/tree.js,plugin/lib/artemis-console.js
[INFO] Executed tasks
[INFO]
[INFO] --- maven-resources-plugin:2.6:resources (copy-resources) @ artemis-plugin ---
[INFO] Using 'UTF-8' encoding to copy filtered resources.
[INFO] Copying 1 resource
[INFO]
[INFO] --- maven-remote-resources-plugin:1.5:process (process-resource-bundles) @ artemis-plugin ---
[INFO]
[INFO] --- maven-resources-plugin:2.6:resources (default-resources) @ artemis-plugin ---
[INFO] Using 'UTF-8' encoding to copy filtered resources.
[INFO] Copying 1 resource
[INFO] Copying 3 resources
[INFO]
[INFO] --- maven-compiler-plugin:3.1:compile (default-compile) @ artemis-plugin ---
[INFO] Changes detected - recompiling the module!
[INFO] Compiling 1 source file to <https://builds.apache.org/job/ActiveMQ-Artemis-Master/ws/artemis-hawtio/artemis-plugin/target/classes>
[INFO]
[INFO] --- maven-checkstyle-plugin:2.17:check (default) @ artemis-plugin ---
[INFO] Starting audit...
Audit done.
[INFO]
[INFO] --- apache-rat-plugin:0.12:check (default) @ artemis-plugin ---
[INFO] Enabled default license matchers.
[INFO] Will parse SCM ignores for exclusions...
[INFO] Finished adding exclusions from SCM ignore files.
[INFO] 61 implicit excludes (use -debug for more details).
[INFO] Exclude: **/footer.html
[INFO] Exclude: **/*.txt
[INFO] Exclude: **/*.md
[INFO] Exclude: etc/ide-settings/**
[INFO] Exclude: docs/**/*.json
[INFO] Exclude: docs/**/_book/
[INFO] Exclude: **/target/
[INFO] Exclude: **/META-INF/services/*
[INFO] Exclude: **/META-INF/MANIFEST.MF
[INFO] Exclude: **/*.iml
[INFO] Exclude: **/*.jceks
[INFO] Exclude: **/*.jks
[INFO] Exclude: **/org/apache/activemq/artemis/utils/json/**
[INFO] Exclude: **/org/apache/activemq/artemis/utils/Base64.java
[INFO] Exclude: **/.settings/**
[INFO] Exclude: **/.project
[INFO] Exclude: **/.classpath
[INFO] Exclude: **/.editorconfig
[INFO] Exclude: **/.checkstyle
[INFO] Exclude: **/.factorypath
[INFO] Exclude: **/org.apache.activemq.artemis.cfg
[INFO] Exclude: **/nb-configuration.xml
[INFO] Exclude: **/*.data
[INFO] Exclude: **/*.bin
[INFO] Exclude: **/src/test/resources/keystore
[INFO] Exclude: **/*.log
[INFO] Exclude: **/*.redo
[INFO] Exclude: **/node/**
[INFO] Exclude: **/node_modules/**
[INFO] Exclude: **/package.json
[INFO] Exclude: **/npm-shrinkwrap.json
[INFO] Exclude: **/overlays/**
[INFO] Exclude: **/CMakeFiles/
[INFO] Exclude: **/Makefile
[INFO] Exclude: **/cmake_install.cmake
[INFO] Exclude: artemis-native/src/main/c/org_apache_activemq_artemis_jlibaio_LibaioContext.h
[INFO] Exclude: **/dependency-reduced-pom.xml
[INFO] 37 resources included (use -debug for more details)
[INFO] Rat check: Summary over all files. Unapproved: 0, unknown: 0, generated: 0, approved: 37 licenses.
[INFO]
[INFO] --- maven-bundle-plugin:3.0.1:manifest (bundle-manifest) @ artemis-plugin ---
[WARNING] Manifest org.apache.activemq:artemis-plugin:war:2.5.0-SNAPSHOT : No sub JAR or directory WEB-INF/classes
[INFO]
[INFO] --- maven-resources-plugin:2.6:testResources (default-testResources) @ artemis-plugin ---
[INFO] Using 'UTF-8' encoding to copy filtered resources.
[INFO] skip non existing resourceDirectory <https://builds.apache.org/job/ActiveMQ-Artemis-Master/ws/artemis-hawtio/artemis-plugin/src/test/resources>
[INFO] Copying 3 resources
[INFO]
[INFO] --- maven-compiler-plugin:3.1:testCompile (default-testCompile) @ artemis-plugin ---
[INFO] No sources to compile
[INFO]
[INFO] --- maven-surefire-plugin:2.18.1:test (default-test) @ artemis-plugin ---
[INFO]
[INFO] --- maven-war-plugin:2.6:war (default-war) @ artemis-plugin ---
[INFO] Packaging webapp
[INFO] Assembling webapp [artemis-plugin] in [<https://builds.apache.org/job/ActiveMQ-Artemis-Master/ws/artemis-hawtio/artemis-plugin/target/artemis-plugin-2.5.0-SNAPSHOT]>
[info] Copying manifest...
[INFO] Processing war project
[INFO] Copying webapp webResources [<https://builds.apache.org/job/ActiveMQ-Artemis-Master/ws/artemis-hawtio/artemis-plugin/src/main/resources]> to [<https://builds.apache.org/job/ActiveMQ-Artemis-Master/ws/artemis-hawtio/artemis-plugin/target/artemis-plugin-2.5.0-SNAPSHOT]>
[INFO] Copying webapp resources [<https://builds.apache.org/job/ActiveMQ-Artemis-Master/ws/artemis-hawtio/artemis-plugin/src/main/webapp]>
[INFO] Webapp assembled in [22 msecs]
[INFO] Building war: <https://builds.apache.org/job/ActiveMQ-Artemis-Master/ws/artemis-hawtio/artemis-plugin/target/artemis-plugin-2.5.0-SNAPSHOT.war>
[INFO]
[INFO] --- maven-site-plugin:3.3:attach-descriptor (attach-descriptor) @ artemis-plugin ---
[INFO]
[INFO] >>> maven-source-plugin:2.2.1:jar (attach-sources) > generate-sources @ artemis-plugin >>>
[INFO]
[INFO] --- maven-enforcer-plugin:1.4:enforce (enforce-maven) @ artemis-plugin ---
[INFO]
[INFO] --- maven-enforcer-plugin:1.4:enforce (enforce-java) @ artemis-plugin ---
[INFO]
[INFO] --- maven-antrun-plugin:1.7:run (generate-sources) @ artemis-plugin ---
[INFO] Executing tasks

main:
     [echo] Building plugin javascript file list
     [echo] Files: plugin/js/address.js,plugin/js/addresses.js,plugin/js/artemisHelpers.js,plugin/js/artemisPlugin.js,plugin/js/artemisService.js,plugin/js/brokerDiagram.js,plugin/js/browse.js,plugin/js/connections.js,plugin/js/consumers.js,plugin/js/jmsHeaderSchema.js,plugin/js/preferences.js,plugin/js/producers.js,plugin/js/queue.js,plugin/js/queues.js,plugin/js/send.js,plugin/js/sessions.js,plugin/js/tree.js,plugin/lib/artemis-console.js
[INFO] Executed tasks
[INFO]
[INFO] --- maven-resources-plugin:2.6:resources (copy-resources) @ artemis-plugin ---
[INFO] Using 'UTF-8' encoding to copy filtered resources.
[INFO] Copying 1 resource
[INFO] Copying 3 resources
[INFO]
[INFO] <<< maven-source-plugin:2.2.1:jar (attach-sources) < generate-sources @ artemis-plugin <<<
[INFO]
[INFO] --- maven-source-plugin:2.2.1:jar (attach-sources) @ artemis-plugin ---
[INFO] Building jar: <https://builds.apache.org/job/ActiveMQ-Artemis-Master/ws/artemis-hawtio/artemis-plugin/target/artemis-plugin-2.5.0-SNAPSHOT-sources.jar>
[INFO]
[INFO] >>> maven-source-plugin:2.2.1:jar (default) > generate-sources @ artemis-plugin >>>
[INFO]
[INFO] --- maven-enforcer-plugin:1.4:enforce (enforce-maven) @ artemis-plugin ---
[INFO]
[INFO] --- maven-enforcer-plugin:1.4:enforce (enforce-java) @ artemis-plugin ---
[INFO]
[INFO] --- maven-antrun-plugin:1.7:run (generate-sources) @ artemis-plugin ---
[INFO] Executing tasks

main:
     [echo] Building plugin javascript file list
     [echo] Files: plugin/js/address.js,plugin/js/addresses.js,plugin/js/artemisHelpers.js,plugin/js/artemisPlugin.js,plugin/js/artemisService.js,plugin/js/brokerDiagram.js,plugin/js/browse.js,plugin/js/connections.js,plugin/js/consumers.js,plugin/js/jmsHeaderSchema.js,plugin/js/preferences.js,plugin/js/producers.js,plugin/js/queue.js,plugin/js/queues.js,plugin/js/send.js,plugin/js/sessions.js,plugin/js/tree.js,plugin/lib/artemis-console.js
[INFO] Executed tasks
[INFO]
[INFO] --- maven-resources-plugin:2.6:resources (copy-resources) @ artemis-plugin ---
[INFO] Using 'UTF-8' encoding to copy filtered resources.
[INFO] Copying 1 resource
[INFO] Copying 3 resources
[INFO]
[INFO] <<< maven-source-plugin:2.2.1:jar (default) < generate-sources @ artemis-plugin <<<
[INFO]
[INFO] --- maven-source-plugin:2.2.1:jar (default) @ artemis-plugin ---
[INFO]
[INFO] --- dependency-check-maven:1.4.3:check (default) @ artemis-plugin ---
[INFO] Skipping dependency-check
[INFO]
[INFO] --- maven-install-plugin:2.4:install (default-install) @ artemis-plugin ---
[INFO] Installing <https://builds.apache.org/job/ActiveMQ-Artemis-Master/ws/artemis-hawtio/artemis-plugin/target/artemis-plugin-2.5.0-SNAPSHOT.war> to /home/jenkins/.m2/repository/org/apache/activemq/artemis-plugin/2.5.0-SNAPSHOT/artemis-plugin-2.5.0-SNAPSHOT.war
[INFO] Installing <https://builds.apache.org/job/ActiveMQ-Artemis-Master/ws/artemis-hawtio/artemis-plugin/pom.xml> to /home/jenkins/.m2/repository/org/apache/activemq/artemis-plugin/2.5.0-SNAPSHOT/artemis-plugin-2.5.0-SNAPSHOT.pom
[INFO] Installing <https://builds.apache.org/job/ActiveMQ-Artemis-Master/ws/artemis-hawtio/artemis-plugin/target/artemis-plugin-2.5.0-SNAPSHOT-sources.jar> to /home/jenkins/.m2/repository/org/apache/activemq/artemis-plugin/2.5.0-SNAPSHOT/artemis-plugin-2.5.0-SNAPSHOT-sources.jar
[INFO] Installing <https://builds.apache.org/job/ActiveMQ-Artemis-Master/ws/artemis-hawtio/artemis-plugin/target/artemis-plugin-2.5.0-SNAPSHOT-sources.jar> to /home/jenkins/.m2/repository/org/apache/activemq/artemis-plugin/2.5.0-SNAPSHOT/artemis-plugin-2.5.0-SNAPSHOT-sources.jar
[INFO]                                                                        
[INFO] ------------------------------------------------------------------------
[INFO] Building ActiveMQ Artemis Console 2.5.0-SNAPSHOT
[INFO] ------------------------------------------------------------------------
Downloading: https://repo.maven.apache.org/maven2/com/google/code/maven-replacer-plugin/replacer/1.5.3/replacer-1.5.3.pom
           [WARNING] Failed to create parent directories for tracking file /home/jenkins/.m2/repository/com/google/code/maven-replacer-plugin/replacer/1.5.3/replacer-1.5.3.pom.lastUpdated
[INFO] ------------------------------------------------------------------------
[INFO] Reactor Summary:
[INFO]
[INFO] ActiveMQ Artemis Parent ............................ SUCCESS [  7.198 s]
[INFO] ActiveMQ Artemis Commons ........................... SUCCESS [ 24.360 s]
[INFO] ActiveMQ Artemis Core Client ....................... SUCCESS [ 12.552 s]
[INFO] ActiveMQ Artemis Selector Implementation ........... SUCCESS [  4.374 s]
[INFO] ActiveMQ Artemis JMS Client ........................ SUCCESS [  4.892 s]
[INFO] ActiveMQ Artemis Native POM ........................ SUCCESS [  6.550 s]
[INFO] ActiveMQ Artemis Journal ........................... SUCCESS [  3.572 s]
[INFO] ActiveMQ Artemis JDBC Store ........................ SUCCESS [ 21.272 s]
[INFO] ActiveMQ Artemis Server ............................ SUCCESS [03:44 min]
[INFO] ActiveMQ Artemis Protocols ......................... SUCCESS [  0.186 s]
[INFO] ActiveMQ Artemis AMQP Protocol ..................... SUCCESS [  5.956 s]
[INFO] ActiveMQ Artemis STOMP Protocol .................... SUCCESS [  2.131 s]
[INFO] ActiveMQ Artemis OpenWire Protocol ................. SUCCESS [  2.740 s]
[INFO] ActiveMQ Artemis HQClient Protocol ................. SUCCESS [  0.937 s]
[INFO] ActiveMQ Artemis HornetQ Protocol .................. SUCCESS [  1.173 s]
[INFO] ActiveMQ Artemis MQTT Protocol ..................... SUCCESS [  1.877 s]
[INFO] ActiveMQ Artemis DTO ............................... SUCCESS [  2.723 s]
[INFO] ActiveMQ Artemis Service Extensions ................ SUCCESS [  2.051 s]
[INFO] ActiveMQ Artemis JMS Server ........................ SUCCESS [  2.139 s]
[INFO] ActiveMQ Artemis CDI Integration ................... SUCCESS [  7.164 s]
[INFO] ActiveMQ Artemis Boot .............................. SUCCESS [  0.302 s]
[INFO] ActiveMQ Artemis Tools ............................. SUCCESS [  0.950 s]
[INFO] ActiveMQ Artemis CLI ............................... SUCCESS [ 35.440 s]
[INFO] ActiveMQ Artemis Web ............................... SUCCESS [  8.817 s]
[INFO] ActiveMQ Artemis Web ............................... SUCCESS [01:03 min]
[INFO] ActiveMQ Artemis Core Client All ................... SUCCESS [ 17.973 s]
[INFO] ActiveMQ Artemis Client OSGi ....................... SUCCESS [  1.658 s]
[INFO] ActiveMQ Artemis JUnit Rules ....................... SUCCESS [ 13.874 s]
[INFO] ActiveMQ Artemis JMS Client All .................... SUCCESS [ 13.444 s]
[INFO] ActiveMQ Artemis JMS Client OSGi ................... SUCCESS [  1.463 s]
[INFO] ActiveMQ Artemis RAR POM ........................... SUCCESS [  2.632 s]
[INFO] ActiveMQ Artemis REST Interface Implementation ..... SUCCESS [01:29 min]
[INFO] ActiveMQ Artemis Maven Plugin ...................... SUCCESS [  3.148 s]
[INFO] ActiveMQ Artemis Server OSGi ....................... SUCCESS [  5.638 s]
[INFO] ActiveMQ Artemis Cons .............................. SUCCESS [  0.162 s]
[INFO] ActiveMQ Artemis HawtIO Branding ................... SUCCESS [  6.371 s]
[INFO] ActiveMQ Artemis HawtIO Plugin ..................... SUCCESS [  0.871 s]
[INFO] ActiveMQ Artemis Console ........................... FAILURE [  0.033 s]
[INFO] ActiveMQ Artemis Spring Integration ................ SKIPPED
[INFO] Apache ActiveMQ Artemis Distribution ............... SKIPPED
[INFO] ActiveMQ Artemis Tests POM ......................... SKIPPED
[INFO] ActiveMQ Artemis Test Support ...................... SKIPPED
[INFO] ActiveMQ Artemis Unit Tests ........................ SKIPPED
[INFO] ActiveMQ Artemis Joram Tests ....................... SKIPPED
[INFO] ActiveMQ Artemis timing Tests ...................... SKIPPED
[INFO] ActiveMQ Artemis JMS Tests ......................... SKIPPED
[INFO] ActiveMQ Artemis Features .......................... SKIPPED
[INFO] ActiveMQ Artemis Integration Tests ................. SKIPPED
[INFO] ActiveMQ Artemis Client Integration Tests .......... SKIPPED
[INFO] ActiveMQ Artemis Compatibility Tests ............... SKIPPED
[INFO] ActiveMQ Artemis soak Tests ........................ SKIPPED
[INFO] ActiveMQ Artemis stress Tests ...................... SKIPPED
[INFO] ActiveMQ Artemis performance Tests ................. SKIPPED
[INFO] Smoke Tests ........................................ SKIPPED
[INFO] ActiveMQ Artemis Extra Tests ....................... SKIPPED
[INFO] ------------------------------------------------------------------------
[INFO] BUILD FAILURE
[INFO] ------------------------------------------------------------------------
[INFO] Total time: 10:06 min
[INFO] Finished at: 2018-02-05T20:37:35+00:00
[INFO] Final Memory: 293M/5120M
[INFO] ------------------------------------------------------------------------
[ERROR] Plugin com.google.code.maven-replacer-plugin:replacer:1.5.3 or one of its dependencies could not be resolved: Failed to read artifact descriptor for com.google.code.maven-replacer-plugin:replacer:jar:1.5.3: Could not transfer artifact com.google.code.maven-replacer-plugin:replacer:pom:1.5.3 from/to central (https://repo.maven.apache.org/maven2): /home/jenkins/.m2/repository/com/google/code/maven-replacer-plugin/replacer/1.5.3/replacer-1.5.3.pom.part.lock (No such file or directory) -> [Help 1]
[ERROR]
[ERROR] To see the full stack trace of the errors, re-run Maven with the -e switch.
[ERROR] Re-run Maven using the -X switch to enable full debug logging.
[ERROR]
[ERROR] For more information about the errors and possible solutions, please read the following articles:
[ERROR] [Help 1] http://cwiki.apache.org/confluence/display/MAVEN/PluginResolutionException
Build step 'Invoke top-level Maven targets' marked build as failure
Performing Post build task...
Could not match :Too many files with unapproved license  : False
Logical operation result is FALSE
Skipping script  : cat ratReport.txt
END OF POST BUILD TASK : 0
Recording test results
Not sending mail to unregistered user [hidden email]
Not sending mail to unregistered user [hidden email]
Reply | Threaded
Open this post in threaded view
|

Jenkins build is back to normal : ActiveMQ-Artemis-Master #1608

Apache Jenkins Server-2