Build failed in Jenkins: ActiveMQ-Artemis-Master #1543

Previous Topic Next Topic
 
classic Classic list List threaded Threaded
3 messages Options
Reply | Threaded
Open this post in threaded view
|

Build failed in Jenkins: ActiveMQ-Artemis-Master #1543

Apache Jenkins Server-2
See <https://builds.apache.org/job/ActiveMQ-Artemis-Master/1543/display/redirect?page=changes>

Changes:

[jmesnil] [ARTEMIS-1590] Properties-based SQLProvider

------------------------------------------
[...truncated 1.62 MB...]
[INFO] --- maven-install-plugin:2.4:install (default-install) @ activemq-branding ---
[INFO] Installing <https://builds.apache.org/job/ActiveMQ-Artemis-Master/ws/artemis-hawtio/activemq-branding/target/activemq-branding-2.5.0-SNAPSHOT.war> to /home/jenkins/.m2/repository/org/apache/activemq/activemq-branding/2.5.0-SNAPSHOT/activemq-branding-2.5.0-SNAPSHOT.war
[INFO] Installing <https://builds.apache.org/job/ActiveMQ-Artemis-Master/ws/artemis-hawtio/activemq-branding/pom.xml> to /home/jenkins/.m2/repository/org/apache/activemq/activemq-branding/2.5.0-SNAPSHOT/activemq-branding-2.5.0-SNAPSHOT.pom
[INFO] Installing <https://builds.apache.org/job/ActiveMQ-Artemis-Master/ws/artemis-hawtio/activemq-branding/target/activemq-branding-2.5.0-SNAPSHOT-sources.jar> to /home/jenkins/.m2/repository/org/apache/activemq/activemq-branding/2.5.0-SNAPSHOT/activemq-branding-2.5.0-SNAPSHOT-sources.jar
[INFO] Installing <https://builds.apache.org/job/ActiveMQ-Artemis-Master/ws/artemis-hawtio/activemq-branding/target/activemq-branding-2.5.0-SNAPSHOT-sources.jar> to /home/jenkins/.m2/repository/org/apache/activemq/activemq-branding/2.5.0-SNAPSHOT/activemq-branding-2.5.0-SNAPSHOT-sources.jar
[INFO]                                                                        
[INFO] ------------------------------------------------------------------------
[INFO] Building ActiveMQ Artemis HawtIO Plugin 2.5.0-SNAPSHOT
[INFO] ------------------------------------------------------------------------
[INFO]
[INFO] --- maven-enforcer-plugin:1.4:enforce (enforce-maven) @ artemis-plugin ---
[INFO]
[INFO] --- maven-enforcer-plugin:1.4:enforce (enforce-java) @ artemis-plugin ---
[INFO]
[INFO] --- maven-antrun-plugin:1.7:run (generate-sources) @ artemis-plugin ---
[INFO] Executing tasks

main:
     [echo] Building plugin javascript file list
     [echo] Files: plugin/js/address.js,plugin/js/addresses.js,plugin/js/artemisHelpers.js,plugin/js/artemisPlugin.js,plugin/js/artemisService.js,plugin/js/brokerDiagram.js,plugin/js/browse.js,plugin/js/connections.js,plugin/js/consumers.js,plugin/js/jmsHeaderSchema.js,plugin/js/preferences.js,plugin/js/producers.js,plugin/js/queue.js,plugin/js/queues.js,plugin/js/send.js,plugin/js/sessions.js,plugin/js/tree.js,plugin/lib/artemis-console.js
[INFO] Executed tasks
[INFO]
[INFO] --- maven-resources-plugin:2.6:resources (copy-resources) @ artemis-plugin ---
[INFO] Using 'UTF-8' encoding to copy filtered resources.
[INFO] Copying 1 resource
[INFO]
[INFO] --- maven-remote-resources-plugin:1.5:process (process-resource-bundles) @ artemis-plugin ---
[INFO]
[INFO] --- maven-resources-plugin:2.6:resources (default-resources) @ artemis-plugin ---
[INFO] Using 'UTF-8' encoding to copy filtered resources.
[INFO] Copying 1 resource
[INFO] Copying 3 resources
[INFO]
[INFO] --- maven-compiler-plugin:3.1:compile (default-compile) @ artemis-plugin ---
[INFO] Changes detected - recompiling the module!
[INFO] Compiling 1 source file to <https://builds.apache.org/job/ActiveMQ-Artemis-Master/ws/artemis-hawtio/artemis-plugin/target/classes>
[INFO]
[INFO] --- maven-checkstyle-plugin:2.17:check (default) @ artemis-plugin ---
[INFO] Starting audit...
Audit done.
[INFO]
[INFO] --- apache-rat-plugin:0.12:check (default) @ artemis-plugin ---
[INFO] Enabled default license matchers.
[INFO] Will parse SCM ignores for exclusions...
[INFO] Finished adding exclusions from SCM ignore files.
[INFO] 61 implicit excludes (use -debug for more details).
[INFO] Exclude: **/footer.html
[INFO] Exclude: **/*.txt
[INFO] Exclude: **/*.md
[INFO] Exclude: etc/ide-settings/**
[INFO] Exclude: docs/**/*.json
[INFO] Exclude: docs/**/_book/
[INFO] Exclude: **/target/
[INFO] Exclude: **/META-INF/services/*
[INFO] Exclude: **/META-INF/MANIFEST.MF
[INFO] Exclude: **/*.iml
[INFO] Exclude: **/*.jceks
[INFO] Exclude: **/*.jks
[INFO] Exclude: **/org/apache/activemq/artemis/utils/json/**
[INFO] Exclude: **/org/apache/activemq/artemis/utils/Base64.java
[INFO] Exclude: **/.settings/**
[INFO] Exclude: **/.project
[INFO] Exclude: **/.classpath
[INFO] Exclude: **/.editorconfig
[INFO] Exclude: **/.checkstyle
[INFO] Exclude: **/.factorypath
[INFO] Exclude: **/org.apache.activemq.artemis.cfg
[INFO] Exclude: **/nb-configuration.xml
[INFO] Exclude: **/*.data
[INFO] Exclude: **/*.bin
[INFO] Exclude: **/src/test/resources/keystore
[INFO] Exclude: **/*.log
[INFO] Exclude: **/*.redo
[INFO] Exclude: **/node/**
[INFO] Exclude: **/node_modules/**
[INFO] Exclude: **/package.json
[INFO] Exclude: **/npm-shrinkwrap.json
[INFO] Exclude: **/overlays/**
[INFO] Exclude: **/CMakeFiles/
[INFO] Exclude: **/Makefile
[INFO] Exclude: **/cmake_install.cmake
[INFO] Exclude: artemis-native/src/main/c/org_apache_activemq_artemis_jlibaio_LibaioContext.h
[INFO] Exclude: **/dependency-reduced-pom.xml
[INFO] 37 resources included (use -debug for more details)
[INFO] Rat check: Summary over all files. Unapproved: 0, unknown: 0, generated: 0, approved: 37 licenses.
[INFO]
[INFO] --- maven-bundle-plugin:3.0.1:manifest (bundle-manifest) @ artemis-plugin ---
[WARNING] Manifest org.apache.activemq:artemis-plugin:war:2.5.0-SNAPSHOT : No sub JAR or directory WEB-INF/classes
[INFO]
[INFO] --- maven-resources-plugin:2.6:testResources (default-testResources) @ artemis-plugin ---
[INFO] Using 'UTF-8' encoding to copy filtered resources.
[INFO] skip non existing resourceDirectory <https://builds.apache.org/job/ActiveMQ-Artemis-Master/ws/artemis-hawtio/artemis-plugin/src/test/resources>
[INFO] Copying 3 resources
[INFO]
[INFO] --- maven-compiler-plugin:3.1:testCompile (default-testCompile) @ artemis-plugin ---
[INFO] No sources to compile
[INFO]
[INFO] --- maven-surefire-plugin:2.18.1:test (default-test) @ artemis-plugin ---
[INFO]
[INFO] --- maven-war-plugin:2.6:war (default-war) @ artemis-plugin ---
[INFO] Packaging webapp
[INFO] Assembling webapp [artemis-plugin] in [<https://builds.apache.org/job/ActiveMQ-Artemis-Master/ws/artemis-hawtio/artemis-plugin/target/artemis-plugin-2.5.0-SNAPSHOT]>
[info] Copying manifest...
[INFO] Processing war project
[INFO] Copying webapp webResources [<https://builds.apache.org/job/ActiveMQ-Artemis-Master/ws/artemis-hawtio/artemis-plugin/src/main/resources]> to [<https://builds.apache.org/job/ActiveMQ-Artemis-Master/ws/artemis-hawtio/artemis-plugin/target/artemis-plugin-2.5.0-SNAPSHOT]>
[INFO] Copying webapp resources [<https://builds.apache.org/job/ActiveMQ-Artemis-Master/ws/artemis-hawtio/artemis-plugin/src/main/webapp]>
[INFO] Webapp assembled in [21 msecs]
[INFO] Building war: <https://builds.apache.org/job/ActiveMQ-Artemis-Master/ws/artemis-hawtio/artemis-plugin/target/artemis-plugin-2.5.0-SNAPSHOT.war>
[INFO]
[INFO] --- maven-site-plugin:3.3:attach-descriptor (attach-descriptor) @ artemis-plugin ---
[INFO]
[INFO] >>> maven-source-plugin:2.2.1:jar (attach-sources) > generate-sources @ artemis-plugin >>>
[INFO]
[INFO] --- maven-enforcer-plugin:1.4:enforce (enforce-maven) @ artemis-plugin ---
[INFO]
[INFO] --- maven-enforcer-plugin:1.4:enforce (enforce-java) @ artemis-plugin ---
[INFO]
[INFO] --- maven-antrun-plugin:1.7:run (generate-sources) @ artemis-plugin ---
[INFO] Executing tasks

main:
     [echo] Building plugin javascript file list
     [echo] Files: plugin/js/address.js,plugin/js/addresses.js,plugin/js/artemisHelpers.js,plugin/js/artemisPlugin.js,plugin/js/artemisService.js,plugin/js/brokerDiagram.js,plugin/js/browse.js,plugin/js/connections.js,plugin/js/consumers.js,plugin/js/jmsHeaderSchema.js,plugin/js/preferences.js,plugin/js/producers.js,plugin/js/queue.js,plugin/js/queues.js,plugin/js/send.js,plugin/js/sessions.js,plugin/js/tree.js,plugin/lib/artemis-console.js
[INFO] Executed tasks
[INFO]
[INFO] --- maven-resources-plugin:2.6:resources (copy-resources) @ artemis-plugin ---
[INFO] Using 'UTF-8' encoding to copy filtered resources.
[INFO] Copying 1 resource
[INFO] Copying 3 resources
[INFO]
[INFO] <<< maven-source-plugin:2.2.1:jar (attach-sources) < generate-sources @ artemis-plugin <<<
[INFO]
[INFO] --- maven-source-plugin:2.2.1:jar (attach-sources) @ artemis-plugin ---
[INFO] Building jar: <https://builds.apache.org/job/ActiveMQ-Artemis-Master/ws/artemis-hawtio/artemis-plugin/target/artemis-plugin-2.5.0-SNAPSHOT-sources.jar>
[INFO]
[INFO] >>> maven-source-plugin:2.2.1:jar (default) > generate-sources @ artemis-plugin >>>
[INFO]
[INFO] --- maven-enforcer-plugin:1.4:enforce (enforce-maven) @ artemis-plugin ---
[INFO]
[INFO] --- maven-enforcer-plugin:1.4:enforce (enforce-java) @ artemis-plugin ---
[INFO]
[INFO] --- maven-antrun-plugin:1.7:run (generate-sources) @ artemis-plugin ---
[INFO] Executing tasks

main:
     [echo] Building plugin javascript file list
     [echo] Files: plugin/js/address.js,plugin/js/addresses.js,plugin/js/artemisHelpers.js,plugin/js/artemisPlugin.js,plugin/js/artemisService.js,plugin/js/brokerDiagram.js,plugin/js/browse.js,plugin/js/connections.js,plugin/js/consumers.js,plugin/js/jmsHeaderSchema.js,plugin/js/preferences.js,plugin/js/producers.js,plugin/js/queue.js,plugin/js/queues.js,plugin/js/send.js,plugin/js/sessions.js,plugin/js/tree.js,plugin/lib/artemis-console.js
[INFO] Executed tasks
[INFO]
[INFO] --- maven-resources-plugin:2.6:resources (copy-resources) @ artemis-plugin ---
[INFO] Using 'UTF-8' encoding to copy filtered resources.
[INFO] Copying 1 resource
[INFO] Copying 3 resources
[INFO]
[INFO] <<< maven-source-plugin:2.2.1:jar (default) < generate-sources @ artemis-plugin <<<
[INFO]
[INFO] --- maven-source-plugin:2.2.1:jar (default) @ artemis-plugin ---
[INFO]
[INFO] --- dependency-check-maven:1.4.3:check (default) @ artemis-plugin ---
[INFO] Skipping dependency-check
[INFO]
[INFO] --- maven-install-plugin:2.4:install (default-install) @ artemis-plugin ---
[INFO] Installing <https://builds.apache.org/job/ActiveMQ-Artemis-Master/ws/artemis-hawtio/artemis-plugin/target/artemis-plugin-2.5.0-SNAPSHOT.war> to /home/jenkins/.m2/repository/org/apache/activemq/artemis-plugin/2.5.0-SNAPSHOT/artemis-plugin-2.5.0-SNAPSHOT.war
[INFO] Installing <https://builds.apache.org/job/ActiveMQ-Artemis-Master/ws/artemis-hawtio/artemis-plugin/pom.xml> to /home/jenkins/.m2/repository/org/apache/activemq/artemis-plugin/2.5.0-SNAPSHOT/artemis-plugin-2.5.0-SNAPSHOT.pom
[INFO] Installing <https://builds.apache.org/job/ActiveMQ-Artemis-Master/ws/artemis-hawtio/artemis-plugin/target/artemis-plugin-2.5.0-SNAPSHOT-sources.jar> to /home/jenkins/.m2/repository/org/apache/activemq/artemis-plugin/2.5.0-SNAPSHOT/artemis-plugin-2.5.0-SNAPSHOT-sources.jar
[INFO] Installing <https://builds.apache.org/job/ActiveMQ-Artemis-Master/ws/artemis-hawtio/artemis-plugin/target/artemis-plugin-2.5.0-SNAPSHOT-sources.jar> to /home/jenkins/.m2/repository/org/apache/activemq/artemis-plugin/2.5.0-SNAPSHOT/artemis-plugin-2.5.0-SNAPSHOT-sources.jar
[INFO]                                                                        
[INFO] ------------------------------------------------------------------------
[INFO] Building ActiveMQ Artemis Console 2.5.0-SNAPSHOT
[INFO] ------------------------------------------------------------------------
Downloading: https://repo.maven.apache.org/maven2/com/google/code/maven-replacer-plugin/replacer/1.5.3/replacer-1.5.3.pom
[WARNING] Failed to create parent directories for tracking file /home/jenkins/.m2/repository/com/google/code/maven-replacer-plugin/replacer/1.5.3/replacer-1.5.3.pom.lastUpdated
[INFO] ------------------------------------------------------------------------
[INFO] Reactor Summary:
[INFO]
[INFO] ActiveMQ Artemis Parent ............................ SUCCESS [  5.398 s]
[INFO] ActiveMQ Artemis Commons ........................... SUCCESS [ 20.771 s]
[INFO] ActiveMQ Artemis Core Client ....................... SUCCESS [ 13.515 s]
[INFO] ActiveMQ Artemis Selector Implementation ........... SUCCESS [  4.184 s]
[INFO] ActiveMQ Artemis JMS Client ........................ SUCCESS [  4.490 s]
[INFO] ActiveMQ Artemis Native POM ........................ SUCCESS [  5.994 s]
[INFO] ActiveMQ Artemis Journal ........................... SUCCESS [  3.661 s]
[INFO] ActiveMQ Artemis JDBC Store ........................ SUCCESS [ 18.357 s]
[INFO] ActiveMQ Artemis Server ............................ SUCCESS [01:40 min]
[INFO] ActiveMQ Artemis Protocols ......................... SUCCESS [  0.242 s]
[INFO] ActiveMQ Artemis AMQP Protocol ..................... SUCCESS [  5.475 s]
[INFO] ActiveMQ Artemis STOMP Protocol .................... SUCCESS [  2.075 s]
[INFO] ActiveMQ Artemis OpenWire Protocol ................. SUCCESS [  2.495 s]
[INFO] ActiveMQ Artemis HQClient Protocol ................. SUCCESS [  0.739 s]
[INFO] ActiveMQ Artemis HornetQ Protocol .................. SUCCESS [  1.131 s]
[INFO] ActiveMQ Artemis MQTT Protocol ..................... SUCCESS [  2.040 s]
[INFO] ActiveMQ Artemis DTO ............................... SUCCESS [  2.125 s]
[INFO] ActiveMQ Artemis Service Extensions ................ SUCCESS [  1.853 s]
[INFO] ActiveMQ Artemis JMS Server ........................ SUCCESS [  1.991 s]
[INFO] ActiveMQ Artemis CDI Integration ................... SUCCESS [  5.305 s]
[INFO] ActiveMQ Artemis Boot .............................. SUCCESS [  0.287 s]
[INFO] ActiveMQ Artemis Tools ............................. SUCCESS [  0.848 s]
[INFO] ActiveMQ Artemis CLI ............................... SUCCESS [ 35.446 s]
[INFO] ActiveMQ Artemis Web ............................... SUCCESS [  5.275 s]
[INFO] ActiveMQ Artemis Web ............................... SUCCESS [01:15 min]
[INFO] ActiveMQ Artemis Core Client All ................... SUCCESS [ 16.283 s]
[INFO] ActiveMQ Artemis JUnit Rules ....................... SUCCESS [ 17.505 s]
[INFO] ActiveMQ Artemis JMS Client All .................... SUCCESS [ 13.520 s]
[INFO] ActiveMQ Artemis RAR POM ........................... SUCCESS [  2.815 s]
[INFO] ActiveMQ Artemis REST Interface Implementation ..... SUCCESS [01:29 min]
[INFO] ActiveMQ Artemis Maven Plugin ...................... SUCCESS [  2.584 s]
[INFO] ActiveMQ Artemis Server OSGi ....................... SUCCESS [ 10.901 s]
[INFO] ActiveMQ Artemis Cons .............................. SUCCESS [  0.131 s]
[INFO] ActiveMQ Artemis HawtIO Branding ................... SUCCESS [  5.111 s]
[INFO] ActiveMQ Artemis HawtIO Plugin ..................... SUCCESS [  0.660 s]
[INFO] ActiveMQ Artemis Console ........................... FAILURE [  0.005 s]
[INFO] ActiveMQ Artemis Spring Integration ................ SKIPPED
[INFO] Apache ActiveMQ Artemis Distribution ............... SKIPPED
[INFO] ActiveMQ Artemis Tests POM ......................... SKIPPED
[INFO] ActiveMQ Artemis Test Support ...................... SKIPPED
[INFO] ActiveMQ Artemis Unit Tests ........................ SKIPPED
[INFO] ActiveMQ Artemis Joram Tests ....................... SKIPPED
[INFO] ActiveMQ Artemis timing Tests ...................... SKIPPED
[INFO] ActiveMQ Artemis JMS Tests ......................... SKIPPED
[INFO] ActiveMQ Artemis Features .......................... SKIPPED
[INFO] ActiveMQ Artemis Integration Tests ................. SKIPPED
[INFO] ActiveMQ Artemis Compatibility Tests ............... SKIPPED
[INFO] ActiveMQ Artemis soak Tests ........................ SKIPPED
[INFO] ActiveMQ Artemis stress Tests ...................... SKIPPED
[INFO] ActiveMQ Artemis performance Tests ................. SKIPPED
[INFO] Smoke Tests ........................................ SKIPPED
[INFO] ActiveMQ Artemis Extra Tests ....................... SKIPPED
[INFO] ------------------------------------------------------------------------
[INFO] BUILD FAILURE
[INFO] ------------------------------------------------------------------------
[INFO] Total time: 08:01 min
[INFO] Finished at: 2018-01-12T14:40:01+00:00
[INFO] Final Memory: 334M/5687M
[INFO] ------------------------------------------------------------------------
[ERROR] Plugin com.google.code.maven-replacer-plugin:replacer:1.5.3 or one of its dependencies could not be resolved: Failed to read artifact descriptor for com.google.code.maven-replacer-plugin:replacer:jar:1.5.3: Could not transfer artifact com.google.code.maven-replacer-plugin:replacer:pom:1.5.3 from/to central (https://repo.maven.apache.org/maven2): /home/jenkins/.m2/repository/com/google/code/maven-replacer-plugin/replacer/1.5.3/replacer-1.5.3.pom.part.lock (No such file or directory) -> [Help 1]
[ERROR]
[ERROR] To see the full stack trace of the errors, re-run Maven with the -e switch.
[ERROR] Re-run Maven using the -X switch to enable full debug logging.
[ERROR]
[ERROR] For more information about the errors and possible solutions, please read the following articles:
[ERROR] [Help 1] http://cwiki.apache.org/confluence/display/MAVEN/PluginResolutionException
Build step 'Invoke top-level Maven targets' marked build as failure
Performing Post build task...
Could not match :Too many files with unapproved license  : False
Logical operation result is FALSE
Skipping script  : cat ratReport.txt
END OF POST BUILD TASK : 0
Recording test results
Not sending mail to unregistered user [hidden email]
Reply | Threaded
Open this post in threaded view
|

Build failed in Jenkins: ActiveMQ-Artemis-Master #1544

Apache Jenkins Server-2
See <https://builds.apache.org/job/ActiveMQ-Artemis-Master/1544/display/redirect?page=changes>

Changes:

[jbertram] ARTEMIS-1596 wrong routing-type for STOMP autocreated address/queue

------------------------------------------
[...truncated 4.39 MB...]
[INFO]
[INFO] <<< maven-source-plugin:2.2.1:jar (default) < generate-sources @ jms-tests <<<
[INFO]
[INFO] --- maven-source-plugin:2.2.1:jar (default) @ jms-tests ---
[INFO]
[INFO] --- dependency-check-maven:1.4.3:check (default) @ jms-tests ---
[INFO] Skipping dependency-check
[INFO]
[INFO] --- maven-install-plugin:2.4:install (default-install) @ jms-tests ---
[INFO] Installing <https://builds.apache.org/job/ActiveMQ-Artemis-Master/ws/tests/jms-tests/target/jms-tests-2.5.0-SNAPSHOT.jar> to /home/jenkins/.m2/repository/org/apache/activemq/tests/jms-tests/2.5.0-SNAPSHOT/jms-tests-2.5.0-SNAPSHOT.jar
[INFO] Installing <https://builds.apache.org/job/ActiveMQ-Artemis-Master/ws/tests/jms-tests/pom.xml> to /home/jenkins/.m2/repository/org/apache/activemq/tests/jms-tests/2.5.0-SNAPSHOT/jms-tests-2.5.0-SNAPSHOT.pom
[INFO] Installing <https://builds.apache.org/job/ActiveMQ-Artemis-Master/ws/tests/jms-tests/target/jms-tests-2.5.0-SNAPSHOT-tests.jar> to /home/jenkins/.m2/repository/org/apache/activemq/tests/jms-tests/2.5.0-SNAPSHOT/jms-tests-2.5.0-SNAPSHOT-tests.jar
[INFO] Installing <https://builds.apache.org/job/ActiveMQ-Artemis-Master/ws/tests/jms-tests/target/jms-tests-2.5.0-SNAPSHOT-sources.jar> to /home/jenkins/.m2/repository/org/apache/activemq/tests/jms-tests/2.5.0-SNAPSHOT/jms-tests-2.5.0-SNAPSHOT-sources.jar
[INFO] Installing <https://builds.apache.org/job/ActiveMQ-Artemis-Master/ws/tests/jms-tests/target/jms-tests-2.5.0-SNAPSHOT-sources.jar> to /home/jenkins/.m2/repository/org/apache/activemq/tests/jms-tests/2.5.0-SNAPSHOT/jms-tests-2.5.0-SNAPSHOT-sources.jar
[INFO]                                                                        
[INFO] ------------------------------------------------------------------------
[INFO] Building ActiveMQ Artemis Features 2.5.0-SNAPSHOT
[INFO] ------------------------------------------------------------------------
[INFO]
[INFO] --- maven-enforcer-plugin:1.4:enforce (enforce-maven) @ artemis-features ---
[INFO]
[INFO] --- maven-enforcer-plugin:1.4:enforce (enforce-java) @ artemis-features ---
[INFO]
[INFO] --- maven-remote-resources-plugin:1.5:process (process-resource-bundles) @ artemis-features ---
[INFO]
[INFO] --- maven-resources-plugin:2.6:resources (filter) @ artemis-features ---
[INFO] Using 'UTF-8' encoding to copy filtered resources.
[INFO] Copying 3 resources
[INFO] Copying 3 resources
[INFO]
[INFO] --- maven-checkstyle-plugin:2.17:check (default) @ artemis-features ---
[INFO]
[INFO] --- apache-rat-plugin:0.12:check (default) @ artemis-features ---
[INFO] Enabled default license matchers.
[INFO] Will parse SCM ignores for exclusions...
[INFO] Finished adding exclusions from SCM ignore files.
[INFO] 61 implicit excludes (use -debug for more details).
[INFO] Exclude: **/footer.html
[INFO] Exclude: **/*.txt
[INFO] Exclude: **/*.md
[INFO] Exclude: etc/ide-settings/**
[INFO] Exclude: docs/**/*.json
[INFO] Exclude: docs/**/_book/
[INFO] Exclude: **/target/
[INFO] Exclude: **/META-INF/services/*
[INFO] Exclude: **/META-INF/MANIFEST.MF
[INFO] Exclude: **/*.iml
[INFO] Exclude: **/*.jceks
[INFO] Exclude: **/*.jks
[INFO] Exclude: **/org/apache/activemq/artemis/utils/json/**
[INFO] Exclude: **/org/apache/activemq/artemis/utils/Base64.java
[INFO] Exclude: **/.settings/**
[INFO] Exclude: **/.project
[INFO] Exclude: **/.classpath
[INFO] Exclude: **/.editorconfig
[INFO] Exclude: **/.checkstyle
[INFO] Exclude: **/.factorypath
[INFO] Exclude: **/org.apache.activemq.artemis.cfg
[INFO] Exclude: **/nb-configuration.xml
[INFO] Exclude: **/*.data
[INFO] Exclude: **/*.bin
[INFO] Exclude: **/src/test/resources/keystore
[INFO] Exclude: **/*.log
[INFO] Exclude: **/*.redo
[INFO] Exclude: **/node/**
[INFO] Exclude: **/node_modules/**
[INFO] Exclude: **/package.json
[INFO] Exclude: **/npm-shrinkwrap.json
[INFO] Exclude: **/overlays/**
[INFO] Exclude: **/CMakeFiles/
[INFO] Exclude: **/Makefile
[INFO] Exclude: **/cmake_install.cmake
[INFO] Exclude: artemis-native/src/main/c/org_apache_activemq_artemis_jlibaio_LibaioContext.h
[INFO] Exclude: **/dependency-reduced-pom.xml
[INFO] 3 resources included (use -debug for more details)
[INFO] Rat check: Summary over all files. Unapproved: 0, unknown: 0, generated: 0, approved: 3 licenses.
[INFO]
[INFO] --- maven-site-plugin:3.3:attach-descriptor (attach-descriptor) @ artemis-features ---
[INFO]
[INFO] >>> maven-source-plugin:2.2.1:jar (attach-sources) > generate-sources @ artemis-features >>>
[INFO]
[INFO] --- maven-enforcer-plugin:1.4:enforce (enforce-maven) @ artemis-features ---
[INFO]
[INFO] --- maven-enforcer-plugin:1.4:enforce (enforce-java) @ artemis-features ---
[INFO]
[INFO] <<< maven-source-plugin:2.2.1:jar (attach-sources) < generate-sources @ artemis-features <<<
[INFO]
[INFO] --- maven-source-plugin:2.2.1:jar (attach-sources) @ artemis-features ---
[INFO]
[INFO] --- build-helper-maven-plugin:1.8:attach-artifact (attach-artifacts) @ artemis-features ---
[INFO]
[INFO] >>> maven-source-plugin:2.2.1:jar (default) > generate-sources @ artemis-features >>>
[INFO]
[INFO] --- maven-enforcer-plugin:1.4:enforce (enforce-maven) @ artemis-features ---
[INFO]
[INFO] --- maven-enforcer-plugin:1.4:enforce (enforce-java) @ artemis-features ---
[INFO]
[INFO] <<< maven-source-plugin:2.2.1:jar (default) < generate-sources @ artemis-features <<<
[INFO]
[INFO] --- maven-source-plugin:2.2.1:jar (default) @ artemis-features ---
[INFO]
[INFO] --- dependency-check-maven:1.4.3:check (default) @ artemis-features ---
[INFO] Skipping dependency-check
[INFO]
[INFO] --- maven-install-plugin:2.4:install (default-install) @ artemis-features ---
[INFO] Installing <https://builds.apache.org/job/ActiveMQ-Artemis-Master/ws/artemis-features/pom.xml> to /home/jenkins/.m2/repository/org/apache/activemq/artemis-features/2.5.0-SNAPSHOT/artemis-features-2.5.0-SNAPSHOT.pom
[INFO] Installing <https://builds.apache.org/job/ActiveMQ-Artemis-Master/ws/artemis-features/target/classes/features.xml> to /home/jenkins/.m2/repository/org/apache/activemq/artemis-features/2.5.0-SNAPSHOT/artemis-features-2.5.0-SNAPSHOT-features.xml
[INFO] Installing <https://builds.apache.org/job/ActiveMQ-Artemis-Master/ws/artemis-features/target/classes/artemis.xml> to /home/jenkins/.m2/repository/org/apache/activemq/artemis-features/2.5.0-SNAPSHOT/artemis-features-2.5.0-SNAPSHOT-artemis.xml
[INFO] Installing <https://builds.apache.org/job/ActiveMQ-Artemis-Master/ws/artemis-features/target/classes/org.apache.activemq.artemis.cfg> to /home/jenkins/.m2/repository/org/apache/activemq/artemis-features/2.5.0-SNAPSHOT/artemis-features-2.5.0-SNAPSHOT.cfg
[INFO]
[INFO] --- karaf-maven-plugin:4.1.1:verify (verify) @ artemis-features ---
[INFO] Using repositories: http://repository.apache.org/snapshots@id=Nexus@noreleases@snapshots,https://repo.maven.apache.org/maven2@id=central
[INFO] Verification of feature transaction-api/1.2.0 succeeded
[INFO] Verification of feature transaction-manager-geronimo/1.3.2 succeeded
[INFO] Verification of feature transaction-manager-narayana/5.5.2.Final succeeded
[INFO] Verification of feature transaction/2.0.0 succeeded
[INFO] Verification of feature [transaction/2.0.0, aries-blueprint] succeeded
[INFO] Verification of feature connector/3.1.1 succeeded
[INFO] Verification of feature jpa/2.6.0 succeeded
[INFO] Verification of feature [jpa/2.6.0, aries-blueprint] succeeded
[INFO] Verification of feature openjpa/2.4.1 succeeded
[INFO] Verification of feature hibernate/5.2.8.Final succeeded
[INFO] Verification of feature eclipselink/2.6.4 succeeded
[INFO] Verification of feature jndi/4.1.1 succeeded
[INFO] Verification of feature jdbc/4.1.1 succeeded
[INFO] Verification of feature jms/4.1.1 succeeded
[INFO] Verification of feature application-without-isolation/1.0.0 succeeded
[INFO] Verification of feature subsystems/2.0.8 succeeded
[INFO] Verification of feature [subsystems/2.0.8, shell] succeeded
[INFO] Verification of feature artemis/2.5.0.SNAPSHOT succeeded
[INFO] Verification of feature netty-core/4.1.19.Final succeeded
[INFO] Verification of feature artemis-core/2.5.0.SNAPSHOT succeeded
[INFO] Verification of feature artemis-amqp/2.5.0.SNAPSHOT succeeded
[INFO] Verification of feature artemis-stomp/2.5.0.SNAPSHOT succeeded
[INFO] Verification of feature artemis-mqtt/2.5.0.SNAPSHOT succeeded
[INFO] Verification of feature artemis-hornetq/2.5.0.SNAPSHOT succeeded
[INFO] Verification of feature artemis-openwire/2.5.0.SNAPSHOT succeeded
[INFO] Verification of feature framework/4.1.1 succeeded
[INFO] Verification of feature framework-logback/4.1.1 succeeded
[INFO]                                                                        
[INFO] ------------------------------------------------------------------------
[INFO] Building ActiveMQ Artemis Integration Tests 2.5.0-SNAPSHOT
[INFO] ------------------------------------------------------------------------
[INFO]
[INFO] --- maven-enforcer-plugin:1.4:enforce (enforce-maven) @ integration-tests ---
[INFO]
[INFO] --- maven-enforcer-plugin:1.4:enforce (enforce-java) @ integration-tests ---
[INFO]
[INFO] --- maven-remote-resources-plugin:1.5:process (process-resource-bundles) @ integration-tests ---
[INFO]
[INFO] --- depends-maven-plugin:1.2:generate-depends-file (generate-depends-file) @ integration-tests ---
[INFO] Created: <https://builds.apache.org/job/ActiveMQ-Artemis-Master/ws/tests/integration-tests/target/classes/META-INF/maven/dependencies.properties>
[INFO]
[INFO] --- maven-resources-plugin:2.6:resources (default-resources) @ integration-tests ---
[INFO] Using 'UTF-8' encoding to copy filtered resources.
[INFO] skip non existing resourceDirectory <https://builds.apache.org/job/ActiveMQ-Artemis-Master/ws/tests/integration-tests/src/main/resources>
[INFO] Copying 3 resources
[INFO]
[INFO] --- maven-compiler-plugin:3.1:compile (default-compile) @ integration-tests ---
[INFO] No sources to compile
[INFO]
[INFO] --- maven-checkstyle-plugin:2.17:check (default) @ integration-tests ---
[INFO] Starting audit...
[ERROR] <https://builds.apache.org/job/ActiveMQ-Artemis-Master/ws/tests/integration-tests/src/test/java/org/apache/activemq/artemis/tests/integration/stomp/StompTest.java>:53:8: Unused import - org.apache.activemq.artemis.core.server.AddressQueryResult. [UnusedImports]
[ERROR] <https://builds.apache.org/job/ActiveMQ-Artemis-Master/ws/tests/integration-tests/src/test/java/org/apache/activemq/artemis/tests/integration/stomp/StompTest.java>:55:8: Unused import - org.apache.activemq.artemis.core.server.QueueQueryResult. [UnusedImports]
Audit done.
[INFO] There are 2 errors reported by Checkstyle 7.7 with <https://builds.apache.org/job/ActiveMQ-Artemis-Master/ws/tests/integration-tests/../../etc/checkstyle.xml> ruleset.
[ERROR] src/test/java/org/apache/activemq/artemis/tests/integration/stomp/StompTest.java:[53,8] (imports) UnusedImports: Unused import - org.apache.activemq.artemis.core.server.AddressQueryResult.
[ERROR] src/test/java/org/apache/activemq/artemis/tests/integration/stomp/StompTest.java:[55,8] (imports) UnusedImports: Unused import - org.apache.activemq.artemis.core.server.QueueQueryResult.
[INFO] ------------------------------------------------------------------------
[INFO] Reactor Summary:
[INFO]
[INFO] ActiveMQ Artemis Parent ............................ SUCCESS [  6.158 s]
[INFO] ActiveMQ Artemis Commons ........................... SUCCESS [ 16.542 s]
[INFO] ActiveMQ Artemis Core Client ....................... SUCCESS [ 10.543 s]
[INFO] ActiveMQ Artemis Selector Implementation ........... SUCCESS [  3.873 s]
[INFO] ActiveMQ Artemis JMS Client ........................ SUCCESS [  3.290 s]
[INFO] ActiveMQ Artemis Native POM ........................ SUCCESS [  8.489 s]
[INFO] ActiveMQ Artemis Journal ........................... SUCCESS [  2.819 s]
[INFO] ActiveMQ Artemis JDBC Store ........................ SUCCESS [ 23.629 s]
[INFO] ActiveMQ Artemis Server ............................ SUCCESS [01:28 min]
[INFO] ActiveMQ Artemis Protocols ......................... SUCCESS [  0.130 s]
[INFO] ActiveMQ Artemis AMQP Protocol ..................... SUCCESS [  4.271 s]
[INFO] ActiveMQ Artemis STOMP Protocol .................... SUCCESS [  1.487 s]
[INFO] ActiveMQ Artemis OpenWire Protocol ................. SUCCESS [  1.771 s]
[INFO] ActiveMQ Artemis HQClient Protocol ................. SUCCESS [  0.580 s]
[INFO] ActiveMQ Artemis HornetQ Protocol .................. SUCCESS [  0.894 s]
[INFO] ActiveMQ Artemis MQTT Protocol ..................... SUCCESS [  1.373 s]
[INFO] ActiveMQ Artemis DTO ............................... SUCCESS [  1.719 s]
[INFO] ActiveMQ Artemis Service Extensions ................ SUCCESS [  1.445 s]
[INFO] ActiveMQ Artemis JMS Server ........................ SUCCESS [  1.717 s]
[INFO] ActiveMQ Artemis CDI Integration ................... SUCCESS [  4.109 s]
[INFO] ActiveMQ Artemis Boot .............................. SUCCESS [  0.174 s]
[INFO] ActiveMQ Artemis Tools ............................. SUCCESS [  0.656 s]
[INFO] ActiveMQ Artemis CLI ............................... SUCCESS [ 34.774 s]
[INFO] ActiveMQ Artemis Web ............................... SUCCESS [  5.617 s]
[INFO] ActiveMQ Artemis Web ............................... SUCCESS [ 59.164 s]
[INFO] ActiveMQ Artemis Core Client All ................... SUCCESS [ 12.827 s]
[INFO] ActiveMQ Artemis JUnit Rules ....................... SUCCESS [ 18.720 s]
[INFO] ActiveMQ Artemis JMS Client All .................... SUCCESS [ 11.700 s]
[INFO] ActiveMQ Artemis RAR POM ........................... SUCCESS [  1.734 s]
[INFO] ActiveMQ Artemis REST Interface Implementation ..... SUCCESS [01:28 min]
[INFO] ActiveMQ Artemis Maven Plugin ...................... SUCCESS [  3.205 s]
[INFO] ActiveMQ Artemis Server OSGi ....................... SUCCESS [  8.190 s]
[INFO] ActiveMQ Artemis Cons .............................. SUCCESS [  0.201 s]
[INFO] ActiveMQ Artemis HawtIO Branding ................... SUCCESS [  4.102 s]
[INFO] ActiveMQ Artemis HawtIO Plugin ..................... SUCCESS [  0.920 s]
[INFO] ActiveMQ Artemis Console ........................... SUCCESS [  3.829 s]
[INFO] ActiveMQ Artemis Spring Integration ................ SUCCESS [  0.800 s]
[INFO] Apache ActiveMQ Artemis Distribution ............... SUCCESS [ 24.351 s]
[INFO] ActiveMQ Artemis Tests POM ......................... SUCCESS [  0.436 s]
[INFO] ActiveMQ Artemis Test Support ...................... SUCCESS [  1.435 s]
[INFO] ActiveMQ Artemis Unit Tests ........................ SUCCESS [03:45 min]
[INFO] ActiveMQ Artemis Joram Tests ....................... SUCCESS [ 42.798 s]
[INFO] ActiveMQ Artemis timing Tests ...................... SUCCESS [  0.745 s]
[INFO] ActiveMQ Artemis JMS Tests ......................... SUCCESS [07:25 min]
[INFO] ActiveMQ Artemis Features .......................... SUCCESS [ 15.189 s]
[INFO] ActiveMQ Artemis Integration Tests ................. FAILURE [ 11.133 s]
[INFO] ActiveMQ Artemis Compatibility Tests ............... SKIPPED
[INFO] ActiveMQ Artemis soak Tests ........................ SKIPPED
[INFO] ActiveMQ Artemis stress Tests ...................... SKIPPED
[INFO] ActiveMQ Artemis performance Tests ................. SKIPPED
[INFO] Smoke Tests ........................................ SKIPPED
[INFO] ActiveMQ Artemis Extra Tests ....................... SKIPPED
[INFO] ------------------------------------------------------------------------
[INFO] BUILD FAILURE
[INFO] ------------------------------------------------------------------------
[INFO] Total time: 20:06 min
[INFO] Finished at: 2018-01-12T21:33:36+00:00
[INFO] Final Memory: 317M/7675M
[INFO] ------------------------------------------------------------------------
[ERROR] Failed to execute goal org.apache.maven.plugins:maven-checkstyle-plugin:2.17:check (default) on project integration-tests: You have 2 Checkstyle violations. -> [Help 1]
[ERROR]
[ERROR] To see the full stack trace of the errors, re-run Maven with the -e switch.
[ERROR] Re-run Maven using the -X switch to enable full debug logging.
[ERROR]
[ERROR] For more information about the errors and possible solutions, please read the following articles:
[ERROR] [Help 1] http://cwiki.apache.org/confluence/display/MAVEN/MojoFailureException
[ERROR]
[ERROR] After correcting the problems, you can resume the build with the command
[ERROR]   mvn <goals> -rf :integration-tests
Build step 'Invoke top-level Maven targets' marked build as failure
Performing Post build task...
Could not match :Too many files with unapproved license  : False
Logical operation result is FALSE
Skipping script  : cat ratReport.txt
END OF POST BUILD TASK : 0
Recording test results
Not sending mail to unregistered user [hidden email]
Reply | Threaded
Open this post in threaded view
|

Jenkins build is back to normal : ActiveMQ-Artemis-Master #1545

Apache Jenkins Server-2