Build failed in Jenkins: ActiveMQ-Artemis-Master #1467

Previous Topic Next Topic
 
classic Classic list List threaded Threaded
2 messages Options
Reply | Threaded
Open this post in threaded view
|

Build failed in Jenkins: ActiveMQ-Artemis-Master #1467

Apache Jenkins Server-2
See <https://builds.apache.org/job/ActiveMQ-Artemis-Master/1467/display/redirect?page=changes>

Changes:

[clebertsuconic] ARTEMIS-1531 Adding timedbuffer operations on critical analyzer

------------------------------------------
[...truncated 3.74 MB...]
[INFO] Using 'UTF-8' encoding to copy filtered resources.
[INFO] skip non existing resourceDirectory <https://builds.apache.org/job/ActiveMQ-Artemis-Master/ws/tests/smoke-tests/src/test/resources>
[INFO] Copying 3 resources
[INFO]
[INFO] --- maven-compiler-plugin:3.1:testCompile (default-testCompile) @ smoke-tests ---
[INFO] Changes detected - recompiling the module!
[INFO] Compiling 3 source files to <https://builds.apache.org/job/ActiveMQ-Artemis-Master/ws/tests/smoke-tests/target/test-classes>
Note: <https://builds.apache.org/job/ActiveMQ-Artemis-Master/ws/tests/smoke-tests/src/test/java/org/apache/activemq/artemis/tests/smoke/common/SmokeTestBase.java> uses unchecked or unsafe operations.
Note: Recompile with -Xlint:unchecked for details.
[INFO]
[INFO] --- artemis-maven-plugin:2.5.0-SNAPSHOT:create (create0) @ smoke-tests ---
[INFO] Local       id: local
      url: file:///home/jenkins/.m2/repository/
   layout: default
snapshots: [enabled => true, update => always]
 releases: [enabled => true, update => always]

[INFO] Entries.size 2
[INFO] ... key=project = MavenProject: org.apache.activemq.tests:smoke-tests:2.5.0-SNAPSHOT @ <https://builds.apache.org/job/ActiveMQ-Artemis-Master/ws/tests/smoke-tests/pom.xml>
[INFO] ... key=pluginDescriptor = Component Descriptor: role: 'org.apache.maven.plugin.Mojo', implementation: 'org.apache.activemq.artemis.maven.ArtemisCLIPlugin', role hint: 'org.apache.activemq:artemis-maven-plugin:2.5.0-SNAPSHOT:cli'
role: 'org.apache.maven.plugin.Mojo', implementation: 'org.apache.activemq.artemis.maven.ArtemisCreatePlugin', role hint: 'org.apache.activemq:artemis-maven-plugin:2.5.0-SNAPSHOT:create'
role: 'org.apache.maven.plugin.Mojo', implementation: 'org.apache.activemq.artemis.maven.ArtemisDependencyScanPlugin', role hint: 'org.apache.activemq:artemis-maven-plugin:2.5.0-SNAPSHOT:dependency-scan'
role: 'org.apache.maven.plugin.Mojo', implementation: 'org.apache.activemq.artemis.maven.ArtemisClientPlugin', role hint: 'org.apache.activemq:artemis-maven-plugin:2.5.0-SNAPSHOT:runClient'
---
Executing org.apache.activemq.artemis.cli.commands.Create create --allow-anonymous --silent --force --no-web --user guest --password guest --role guest --port-offset 0 --data ./data --allow-anonymous --java-options -Djava.net.preferIPv4Stack=true --no-autotune --verbose --aio <https://builds.apache.org/job/ActiveMQ-Artemis-Master/ws/tests/smoke-tests/target/replicated-static0>
Home::<https://builds.apache.org/job/ActiveMQ-Artemis-Master/ws/tests/smoke-tests/../../artemis-distribution/target/apache-artemis-2.5.0-SNAPSHOT-bin/apache-artemis-2.5.0-SNAPSHOT,> Instance::null
Creating ActiveMQ Artemis instance at: <https://builds.apache.org/job/ActiveMQ-Artemis-Master/ws/tests/smoke-tests/target/replicated-static0>

You can now start the broker by executing:  

   "<https://builds.apache.org/job/ActiveMQ-Artemis-Master/ws/tests/smoke-tests/target/replicated-static0/bin/artemis"> run

Or you can run the broker in the background using:

   "<https://builds.apache.org/job/ActiveMQ-Artemis-Master/ws/tests/smoke-tests/target/replicated-static0/bin/artemis-service"> start

[INFO] ###################################################################################################
[INFO] create-replicated-static0.sh created with commands to reproduce replicated-static0
[INFO] under <https://builds.apache.org/job/ActiveMQ-Artemis-Master/ws/tests/smoke-tests/target>
[INFO] ###################################################################################################
[INFO]
[INFO] --- artemis-maven-plugin:2.5.0-SNAPSHOT:create (create1) @ smoke-tests ---
[INFO] Local       id: local
      url: file:///home/jenkins/.m2/repository/
   layout: default
snapshots: [enabled => true, update => always]
 releases: [enabled => true, update => always]

[INFO] Entries.size 2
[INFO] ... key=project = MavenProject: org.apache.activemq.tests:smoke-tests:2.5.0-SNAPSHOT @ <https://builds.apache.org/job/ActiveMQ-Artemis-Master/ws/tests/smoke-tests/pom.xml>
[INFO] ... key=pluginDescriptor = Component Descriptor: role: 'org.apache.maven.plugin.Mojo', implementation: 'org.apache.activemq.artemis.maven.ArtemisCLIPlugin', role hint: 'org.apache.activemq:artemis-maven-plugin:2.5.0-SNAPSHOT:cli'
role: 'org.apache.maven.plugin.Mojo', implementation: 'org.apache.activemq.artemis.maven.ArtemisCreatePlugin', role hint: 'org.apache.activemq:artemis-maven-plugin:2.5.0-SNAPSHOT:create'
role: 'org.apache.maven.plugin.Mojo', implementation: 'org.apache.activemq.artemis.maven.ArtemisDependencyScanPlugin', role hint: 'org.apache.activemq:artemis-maven-plugin:2.5.0-SNAPSHOT:dependency-scan'
role: 'org.apache.maven.plugin.Mojo', implementation: 'org.apache.activemq.artemis.maven.ArtemisClientPlugin', role hint: 'org.apache.activemq:artemis-maven-plugin:2.5.0-SNAPSHOT:runClient'
---
Executing org.apache.activemq.artemis.cli.commands.Create create --allow-anonymous --silent --force --no-web --user guest --password guest --role guest --port-offset 0 --data ./data --allow-anonymous --java-options -Djava.net.preferIPv4Stack=true --no-autotune --verbose --aio <https://builds.apache.org/job/ActiveMQ-Artemis-Master/ws/tests/smoke-tests/target/replicated-static1>
Home::<https://builds.apache.org/job/ActiveMQ-Artemis-Master/ws/tests/smoke-tests/../../artemis-distribution/target/apache-artemis-2.5.0-SNAPSHOT-bin/apache-artemis-2.5.0-SNAPSHOT,> Instance::null
Creating ActiveMQ Artemis instance at: <https://builds.apache.org/job/ActiveMQ-Artemis-Master/ws/tests/smoke-tests/target/replicated-static1>

You can now start the broker by executing:  

   "<https://builds.apache.org/job/ActiveMQ-Artemis-Master/ws/tests/smoke-tests/target/replicated-static1/bin/artemis"> run

Or you can run the broker in the background using:

   "<https://builds.apache.org/job/ActiveMQ-Artemis-Master/ws/tests/smoke-tests/target/replicated-static1/bin/artemis-service"> start

[INFO] ###################################################################################################
[INFO] create-replicated-static1.sh created with commands to reproduce replicated-static1
[INFO] under <https://builds.apache.org/job/ActiveMQ-Artemis-Master/ws/tests/smoke-tests/target>
[INFO] ###################################################################################################
[INFO]
[INFO] --- artemis-maven-plugin:2.5.0-SNAPSHOT:create (create-expire) @ smoke-tests ---
[INFO] Local       id: local
      url: file:///home/jenkins/.m2/repository/
   layout: default
snapshots: [enabled => true, update => always]
 releases: [enabled => true, update => always]

[INFO] Entries.size 2
[INFO] ... key=project = MavenProject: org.apache.activemq.tests:smoke-tests:2.5.0-SNAPSHOT @ <https://builds.apache.org/job/ActiveMQ-Artemis-Master/ws/tests/smoke-tests/pom.xml>
[INFO] ... key=pluginDescriptor = Component Descriptor: role: 'org.apache.maven.plugin.Mojo', implementation: 'org.apache.activemq.artemis.maven.ArtemisCLIPlugin', role hint: 'org.apache.activemq:artemis-maven-plugin:2.5.0-SNAPSHOT:cli'
role: 'org.apache.maven.plugin.Mojo', implementation: 'org.apache.activemq.artemis.maven.ArtemisCreatePlugin', role hint: 'org.apache.activemq:artemis-maven-plugin:2.5.0-SNAPSHOT:create'
role: 'org.apache.maven.plugin.Mojo', implementation: 'org.apache.activemq.artemis.maven.ArtemisDependencyScanPlugin', role hint: 'org.apache.activemq:artemis-maven-plugin:2.5.0-SNAPSHOT:dependency-scan'
role: 'org.apache.maven.plugin.Mojo', implementation: 'org.apache.activemq.artemis.maven.ArtemisClientPlugin', role hint: 'org.apache.activemq:artemis-maven-plugin:2.5.0-SNAPSHOT:runClient'
---
Executing org.apache.activemq.artemis.cli.commands.Create create --allow-anonymous --silent --force --no-web --user admin --password admin --role guest --port-offset 0 --data ./data --allow-anonymous --java-options -Dartemis.debug.paging.interval=1 --no-autotune --verbose --aio <https://builds.apache.org/job/ActiveMQ-Artemis-Master/ws/tests/smoke-tests/target/expire>
Home::<https://builds.apache.org/job/ActiveMQ-Artemis-Master/ws/tests/smoke-tests/../../artemis-distribution/target/apache-artemis-2.5.0-SNAPSHOT-bin/apache-artemis-2.5.0-SNAPSHOT,> Instance::null
Creating ActiveMQ Artemis instance at: <https://builds.apache.org/job/ActiveMQ-Artemis-Master/ws/tests/smoke-tests/target/expire>

You can now start the broker by executing:  

   "<https://builds.apache.org/job/ActiveMQ-Artemis-Master/ws/tests/smoke-tests/target/expire/bin/artemis"> run

Or you can run the broker in the background using:

   "<https://builds.apache.org/job/ActiveMQ-Artemis-Master/ws/tests/smoke-tests/target/expire/bin/artemis-service"> start

[INFO] ###################################################################################################
[INFO] create-expire.sh created with commands to reproduce expire
[INFO] under <https://builds.apache.org/job/ActiveMQ-Artemis-Master/ws/tests/smoke-tests/target>
[INFO] ###################################################################################################
[INFO]
[INFO] --- maven-surefire-plugin:2.18.1:test (default-test) @ smoke-tests ---
[INFO] Tests are skipped.
[INFO]
[INFO] --- maven-jar-plugin:2.4:test-jar (default) @ smoke-tests ---
[INFO] Building jar: <https://builds.apache.org/job/ActiveMQ-Artemis-Master/ws/tests/smoke-tests/target/smoke-tests-2.5.0-SNAPSHOT-tests.jar>
[INFO]
[INFO] --- maven-jar-plugin:2.4:jar (default-jar) @ smoke-tests ---
[INFO] Building jar: <https://builds.apache.org/job/ActiveMQ-Artemis-Master/ws/tests/smoke-tests/target/smoke-tests-2.5.0-SNAPSHOT.jar>
[INFO]
[INFO] --- maven-site-plugin:3.3:attach-descriptor (attach-descriptor) @ smoke-tests ---
[INFO]
[INFO] >>> maven-source-plugin:2.2.1:jar (attach-sources) > generate-sources @ smoke-tests >>>
[INFO]
[INFO] --- maven-enforcer-plugin:1.4:enforce (enforce-maven) @ smoke-tests ---
[INFO]
[INFO] --- maven-enforcer-plugin:1.4:enforce (enforce-java) @ smoke-tests ---
[INFO]
[INFO] <<< maven-source-plugin:2.2.1:jar (attach-sources) < generate-sources @ smoke-tests <<<
[INFO]
[INFO] --- maven-source-plugin:2.2.1:jar (attach-sources) @ smoke-tests ---
[INFO] Building jar: <https://builds.apache.org/job/ActiveMQ-Artemis-Master/ws/tests/smoke-tests/target/smoke-tests-2.5.0-SNAPSHOT-sources.jar>
[INFO]
[INFO] >>> maven-source-plugin:2.2.1:jar (default) > generate-sources @ smoke-tests >>>
[INFO]
[INFO] --- maven-enforcer-plugin:1.4:enforce (enforce-maven) @ smoke-tests ---
[INFO]
[INFO] --- maven-enforcer-plugin:1.4:enforce (enforce-java) @ smoke-tests ---
[INFO]
[INFO] <<< maven-source-plugin:2.2.1:jar (default) < generate-sources @ smoke-tests <<<
[INFO]
[INFO] --- maven-source-plugin:2.2.1:jar (default) @ smoke-tests ---
[INFO]
[INFO] --- dependency-check-maven:1.4.3:check (default) @ smoke-tests ---
[INFO] Skipping dependency-check
[INFO]
[INFO] --- maven-install-plugin:2.4:install (default-install) @ smoke-tests ---
[INFO] Installing <https://builds.apache.org/job/ActiveMQ-Artemis-Master/ws/tests/smoke-tests/target/smoke-tests-2.5.0-SNAPSHOT.jar> to /home/jenkins/.m2/repository/org/apache/activemq/tests/smoke-tests/2.5.0-SNAPSHOT/smoke-tests-2.5.0-SNAPSHOT.jar
[INFO] Installing <https://builds.apache.org/job/ActiveMQ-Artemis-Master/ws/tests/smoke-tests/pom.xml> to /home/jenkins/.m2/repository/org/apache/activemq/tests/smoke-tests/2.5.0-SNAPSHOT/smoke-tests-2.5.0-SNAPSHOT.pom
[INFO] Installing <https://builds.apache.org/job/ActiveMQ-Artemis-Master/ws/tests/smoke-tests/target/smoke-tests-2.5.0-SNAPSHOT-tests.jar> to /home/jenkins/.m2/repository/org/apache/activemq/tests/smoke-tests/2.5.0-SNAPSHOT/smoke-tests-2.5.0-SNAPSHOT-tests.jar
[INFO] Installing <https://builds.apache.org/job/ActiveMQ-Artemis-Master/ws/tests/smoke-tests/target/smoke-tests-2.5.0-SNAPSHOT-sources.jar> to /home/jenkins/.m2/repository/org/apache/activemq/tests/smoke-tests/2.5.0-SNAPSHOT/smoke-tests-2.5.0-SNAPSHOT-sources.jar
[INFO] Installing <https://builds.apache.org/job/ActiveMQ-Artemis-Master/ws/tests/smoke-tests/target/smoke-tests-2.5.0-SNAPSHOT-sources.jar> to /home/jenkins/.m2/repository/org/apache/activemq/tests/smoke-tests/2.5.0-SNAPSHOT/smoke-tests-2.5.0-SNAPSHOT-sources.jar
[INFO]                                                                        
[INFO] ------------------------------------------------------------------------
[INFO] Building ActiveMQ Artemis Extra Tests 2.5.0-SNAPSHOT
[INFO] ------------------------------------------------------------------------
[INFO]
[INFO] --- maven-enforcer-plugin:1.4:enforce (enforce-maven) @ extra-tests ---
[INFO]
[INFO] --- maven-enforcer-plugin:1.4:enforce (enforce-java) @ extra-tests ---
[INFO]
[INFO] --- maven-remote-resources-plugin:1.5:process (process-resource-bundles) @ extra-tests ---
[INFO]
[INFO] --- maven-resources-plugin:2.6:resources (default-resources) @ extra-tests ---
[INFO] Using 'UTF-8' encoding to copy filtered resources.
[INFO] skip non existing resourceDirectory <https://builds.apache.org/job/ActiveMQ-Artemis-Master/ws/tests/extra-tests/src/main/resources>
[INFO] Copying 3 resources
[INFO]
[INFO] --- maven-compiler-plugin:3.1:compile (default-compile) @ extra-tests ---
[INFO] No sources to compile
[INFO]
[INFO] --- maven-checkstyle-plugin:2.17:check (default) @ extra-tests ---
[INFO] Starting audit...
[ERROR] <https://builds.apache.org/job/ActiveMQ-Artemis-Master/ws/tests/extra-tests/src/test/java/org/apache/activemq/artemis/tests/extras/byteman/critical/analyzer/FileSystemSyncBlockedTest.java>:58:4: '{' at column 4 should be on the previous line. [LeftCurly]
[ERROR] <https://builds.apache.org/job/ActiveMQ-Artemis-Master/ws/tests/extra-tests/src/test/java/org/apache/activemq/artemis/tests/extras/byteman/critical/analyzer/FileSystemSyncBlockedTest.java>:66:7: '{' at column 7 should be on the previous line. [LeftCurly]
Audit done.
[INFO] There are 2 errors reported by Checkstyle 7.7 with <https://builds.apache.org/job/ActiveMQ-Artemis-Master/ws/tests/extra-tests/../../etc/checkstyle.xml> ruleset.
[ERROR] src/test/java/org/apache/activemq/artemis/tests/extras/byteman/critical/analyzer/FileSystemSyncBlockedTest.java:[58,4] (blocks) LeftCurly: '{' at column 4 should be on the previous line.
[ERROR] src/test/java/org/apache/activemq/artemis/tests/extras/byteman/critical/analyzer/FileSystemSyncBlockedTest.java:[66,7] (blocks) LeftCurly: '{' at column 7 should be on the previous line.
[INFO] ------------------------------------------------------------------------
[INFO] Reactor Summary:
[INFO]
[INFO] ActiveMQ Artemis Parent ............................ SUCCESS [  4.227 s]
[INFO] ActiveMQ Artemis Commons ........................... SUCCESS [ 19.273 s]
[INFO] ActiveMQ Artemis Core Client ....................... SUCCESS [ 12.818 s]
[INFO] ActiveMQ Artemis Selector Implementation ........... SUCCESS [  4.234 s]
[INFO] ActiveMQ Artemis JMS Client ........................ SUCCESS [  4.780 s]
[INFO] ActiveMQ Artemis Native POM ........................ SUCCESS [  6.388 s]
[INFO] ActiveMQ Artemis Journal ........................... SUCCESS [  4.032 s]
[INFO] ActiveMQ Artemis JDBC Store ........................ SUCCESS [ 22.327 s]
[INFO] ActiveMQ Artemis Server ............................ SUCCESS [01:49 min]
[INFO] ActiveMQ Artemis Protocols ......................... SUCCESS [  0.175 s]
[INFO] ActiveMQ Artemis AMQP Protocol ..................... SUCCESS [  5.465 s]
[INFO] ActiveMQ Artemis STOMP Protocol .................... SUCCESS [  2.134 s]
[INFO] ActiveMQ Artemis OpenWire Protocol ................. SUCCESS [  2.269 s]
[INFO] ActiveMQ Artemis HQClient Protocol ................. SUCCESS [  0.818 s]
[INFO] ActiveMQ Artemis HornetQ Protocol .................. SUCCESS [  1.187 s]
[INFO] ActiveMQ Artemis MQTT Protocol ..................... SUCCESS [  1.987 s]
[INFO] ActiveMQ Artemis DTO ............................... SUCCESS [  2.205 s]
[INFO] ActiveMQ Artemis Service Extensions ................ SUCCESS [  1.952 s]
[INFO] ActiveMQ Artemis JMS Server ........................ SUCCESS [  2.223 s]
[INFO] ActiveMQ Artemis CDI Integration ................... SUCCESS [  5.681 s]
[INFO] ActiveMQ Artemis Boot .............................. SUCCESS [  0.256 s]
[INFO] ActiveMQ Artemis Tools ............................. SUCCESS [  0.873 s]
[INFO] ActiveMQ Artemis CLI ............................... SUCCESS [ 36.894 s]
[INFO] ActiveMQ Artemis Web ............................... SUCCESS [  5.388 s]
[INFO] ActiveMQ Artemis Web ............................... SUCCESS [01:22 min]
[INFO] ActiveMQ Artemis Core Client All ................... SUCCESS [ 18.552 s]
[INFO] ActiveMQ Artemis JUnit Rules ....................... SUCCESS [ 13.749 s]
[INFO] ActiveMQ Artemis JMS Client All .................... SUCCESS [ 18.148 s]
[INFO] ActiveMQ Artemis RAR POM ........................... SUCCESS [  2.691 s]
[INFO] ActiveMQ Artemis REST Interface Implementation ..... SUCCESS [01:29 min]
[INFO] ActiveMQ Artemis Maven Plugin ...................... SUCCESS [  2.932 s]
[INFO] ActiveMQ Artemis Server OSGi ....................... SUCCESS [ 13.861 s]
[INFO] ActiveMQ Artemis Cons .............................. SUCCESS [  0.235 s]
[INFO] ActiveMQ Artemis HawtIO Branding ................... SUCCESS [  6.179 s]
[INFO] ActiveMQ Artemis HawtIO Plugin ..................... SUCCESS [  1.137 s]
[INFO] ActiveMQ Artemis Console ........................... SUCCESS [  4.576 s]
[INFO] ActiveMQ Artemis Spring Integration ................ SUCCESS [  0.749 s]
[INFO] Apache ActiveMQ Artemis Distribution ............... SUCCESS [ 32.681 s]
[INFO] ActiveMQ Artemis Tests POM ......................... SUCCESS [  0.915 s]
[INFO] ActiveMQ Artemis Test Support ...................... SUCCESS [  1.842 s]
[INFO] ActiveMQ Artemis Unit Tests ........................ SUCCESS [03:50 min]
[INFO] ActiveMQ Artemis Joram Tests ....................... SUCCESS [ 44.373 s]
[INFO] ActiveMQ Artemis timing Tests ...................... SUCCESS [  0.948 s]
[INFO] ActiveMQ Artemis JMS Tests ......................... SUCCESS [06:45 min]
[INFO] ActiveMQ Artemis Features .......................... SUCCESS [ 20.103 s]
[INFO] ActiveMQ Artemis Integration Tests ................. SUCCESS [ 34.702 s]
[INFO] ActiveMQ Artemis soak Tests ........................ SUCCESS [  1.890 s]
[INFO] ActiveMQ Artemis stress Tests ...................... SUCCESS [  1.453 s]
[INFO] ActiveMQ Artemis performance Tests ................. SUCCESS [  0.923 s]
[INFO] Smoke Tests ........................................ SUCCESS [  4.167 s]
[INFO] ActiveMQ Artemis Extra Tests ....................... FAILURE [  1.696 s]
[INFO] ------------------------------------------------------------------------
[INFO] BUILD FAILURE
[INFO] ------------------------------------------------------------------------
[INFO] Total time: 21:37 min
[INFO] Finished at: 2017-11-29T23:38:50+00:00
[INFO] Final Memory: 482M/9206M
[INFO] ------------------------------------------------------------------------
[ERROR] Failed to execute goal org.apache.maven.plugins:maven-checkstyle-plugin:2.17:check (default) on project extra-tests: You have 2 Checkstyle violations. -> [Help 1]
[ERROR]
[ERROR] To see the full stack trace of the errors, re-run Maven with the -e switch.
[ERROR] Re-run Maven using the -X switch to enable full debug logging.
[ERROR]
[ERROR] For more information about the errors and possible solutions, please read the following articles:
[ERROR] [Help 1] http://cwiki.apache.org/confluence/display/MAVEN/MojoFailureException
[ERROR]
[ERROR] After correcting the problems, you can resume the build with the command
[ERROR]   mvn <goals> -rf :extra-tests
Build step 'Invoke top-level Maven targets' marked build as failure
Performing Post build task...
Could not match :Too many files with unapproved license  : False
Logical operation result is FALSE
Skipping script  : cat ratReport.txt
END OF POST BUILD TASK : 0
Recording test results
Reply | Threaded
Open this post in threaded view
|

Jenkins build is back to normal : ActiveMQ-Artemis-Master #1468

Apache Jenkins Server-2