Build failed in Jenkins: ActiveMQ-Artemis-Master #1098

Previous Topic Next Topic
 
classic Classic list List threaded Threaded
6 messages Options
Reply | Threaded
Open this post in threaded view
|

Build failed in Jenkins: ActiveMQ-Artemis-Master #1098

Apache Jenkins Server-2
See <https://builds.apache.org/job/ActiveMQ-Artemis-Master/1098/display/redirect?page=changes>

Changes:

[clebertsuconic] ARTEMIS-1173: Don't set routing type if null

------------------------------------------
Started by an SCM change
Started by an SCM change
[EnvInject] - Loading node environment variables.
Building remotely on H22 (ubuntu xenial) in workspace <https://builds.apache.org/job/ActiveMQ-Artemis-Master/ws/>
 > git rev-parse --is-inside-work-tree # timeout=10
Fetching changes from the remote Git repository
 > git config remote.origin.url https://git-wip-us.apache.org/repos/asf/activemq-artemis.git # timeout=10
Cleaning workspace
 > git rev-parse --verify HEAD # timeout=10
Resetting working tree
 > git reset --hard # timeout=10
 > git clean -fdx # timeout=10
Fetching upstream changes from https://git-wip-us.apache.org/repos/asf/activemq-artemis.git
 > git --version # timeout=10
 > git fetch --tags --progress https://git-wip-us.apache.org/repos/asf/activemq-artemis.git +refs/heads/*:refs/remotes/origin/*
 > git rev-parse origin/master^{commit} # timeout=10
Checking out Revision c7ca494458c89dd0d551276b7f941a6eac80228e (origin/master)
 > git config core.sparsecheckout # timeout=10
 > git checkout -f c7ca494458c89dd0d551276b7f941a6eac80228e
 > git rev-list cc81cdf45d5cc621b3e32dd9ef1f71b18961665e # timeout=10
[ActiveMQ-Artemis-Master] $ /home/jenkins/tools/maven/apache-maven-3.2.5/bin/mvn -Pfast-tests -Pextra-tests install
[INFO] Scanning for projects...
[ERROR] The build could not read 1 project -> [Help 1]
[ERROR]  
[ERROR]   The project org.apache.activemq:artemis-server-osgi:2.2.0-SNAPSHOT (<https://builds.apache.org/job/ActiveMQ-Artemis-Master/ws/artemis-server-osgi/pom.xml)> has 2 errors
[ERROR]     Unresolveable build extension: Plugin org.apache.felix:maven-bundle-plugin:3.3.0 or one of its dependencies could not be resolved: Failure to find org.apache.felix:maven-bundle-plugin:jar:3.3.0 in http://sevntu-checkstyle.github.io/sevntu.checkstyle/maven2 was cached in the local repository, resolution will not be reattempted until the update interval of sevntu-maven has elapsed or updates are forced -> [Help 2]
[ERROR]     Unknown packaging: bundle @ org.apache.activemq:artemis-server-osgi:[unknown-version], <https://builds.apache.org/job/ActiveMQ-Artemis-Master/ws/artemis-server-osgi/pom.xml,> line 21, column 15
[ERROR]
[ERROR] To see the full stack trace of the errors, re-run Maven with the -e switch.
[ERROR] Re-run Maven using the -X switch to enable full debug logging.
[ERROR]
[ERROR] For more information about the errors and possible solutions, please read the following articles:
[ERROR] [Help 1] http://cwiki.apache.org/confluence/display/MAVEN/ProjectBuildingException
[ERROR] [Help 2] http://cwiki.apache.org/confluence/display/MAVEN/PluginResolutionException
Build step 'Invoke top-level Maven targets' marked build as failure
Performing Post build task...
Could not match :Too many files with unapproved license  : False
Logical operation result is FALSE
Skipping script  : cat ratReport.txt
END OF POST BUILD TASK : 0
Recording test results
ERROR: Step ?Publish JUnit test result report? failed: No test report files were found. Configuration error?

Reply | Threaded
Open this post in threaded view
|

Jenkins build is unstable: ActiveMQ-Artemis-Master #1099

Apache Jenkins Server-2
Reply | Threaded
Open this post in threaded view
|

Build failed in Jenkins: ActiveMQ-Artemis-Master #1100

Apache Jenkins Server-2
See <https://builds.apache.org/job/ActiveMQ-Artemis-Master/1100/display/redirect?page=changes>

Changes:

[michael.andre.pearce] ARTEMIS-1129: Fixing tests after client all

------------------------------------------
Started by an SCM change
[EnvInject] - Loading node environment variables.
Building remotely on H22 (ubuntu xenial) in workspace <https://builds.apache.org/job/ActiveMQ-Artemis-Master/ws/>
 > git rev-parse --is-inside-work-tree # timeout=10
Fetching changes from the remote Git repository
 > git config remote.origin.url https://git-wip-us.apache.org/repos/asf/activemq-artemis.git # timeout=10
Cleaning workspace
 > git rev-parse --verify HEAD # timeout=10
Resetting working tree
 > git reset --hard # timeout=10
 > git clean -fdx # timeout=10
Fetching upstream changes from https://git-wip-us.apache.org/repos/asf/activemq-artemis.git
 > git --version # timeout=10
 > git fetch --tags --progress https://git-wip-us.apache.org/repos/asf/activemq-artemis.git +refs/heads/*:refs/remotes/origin/*
 > git rev-parse origin/master^{commit} # timeout=10
Checking out Revision a05e36ece1f6e3a7207b7990bb1d0ae6d000580e (origin/master)
 > git config core.sparsecheckout # timeout=10
 > git checkout -f a05e36ece1f6e3a7207b7990bb1d0ae6d000580e
 > git rev-list 28314f3ca8f6ae20ea434d878adce18b9bbd6b1c # timeout=10
[ActiveMQ-Artemis-Master] $ /home/jenkins/tools/maven/apache-maven-3.2.5/bin/mvn -Pfast-tests -Pextra-tests install
[INFO] Scanning for projects...
[ERROR] The build could not read 1 project -> [Help 1]
[ERROR]  
[ERROR]   The project org.apache.activemq:artemis-server-osgi:2.2.0-SNAPSHOT (<https://builds.apache.org/job/ActiveMQ-Artemis-Master/ws/artemis-server-osgi/pom.xml)> has 2 errors
[ERROR]     Unresolveable build extension: Plugin org.apache.felix:maven-bundle-plugin:3.3.0 or one of its dependencies could not be resolved: Failure to find org.apache.felix:maven-bundle-plugin:jar:3.3.0 in http://sevntu-checkstyle.github.io/sevntu.checkstyle/maven2 was cached in the local repository, resolution will not be reattempted until the update interval of sevntu-maven has elapsed or updates are forced -> [Help 2]
[ERROR]     Unknown packaging: bundle @ org.apache.activemq:artemis-server-osgi:[unknown-version], <https://builds.apache.org/job/ActiveMQ-Artemis-Master/ws/artemis-server-osgi/pom.xml,> line 21, column 15
[ERROR]
[ERROR] To see the full stack trace of the errors, re-run Maven with the -e switch.
[ERROR] Re-run Maven using the -X switch to enable full debug logging.
[ERROR]
[ERROR] For more information about the errors and possible solutions, please read the following articles:
[ERROR] [Help 1] http://cwiki.apache.org/confluence/display/MAVEN/ProjectBuildingException
[ERROR] [Help 2] http://cwiki.apache.org/confluence/display/MAVEN/PluginResolutionException
Build step 'Invoke top-level Maven targets' marked build as failure
Performing Post build task...
Could not match :Too many files with unapproved license  : False
Logical operation result is FALSE
Skipping script  : cat ratReport.txt
END OF POST BUILD TASK : 0
Recording test results
ERROR: Step ?Publish JUnit test result report? failed: No test report files were found. Configuration error?
Not sending mail to unregistered user [hidden email]
Reply | Threaded
Open this post in threaded view
|

Jenkins build is unstable: ActiveMQ-Artemis-Master #1101

Apache Jenkins Server-2
Reply | Threaded
Open this post in threaded view
|

Jenkins build is still unstable: ActiveMQ-Artemis-Master #1102

Apache Jenkins Server-2
Reply | Threaded
Open this post in threaded view
|

Jenkins build is back to stable : ActiveMQ-Artemis-Master #1103

Apache Jenkins Server-2