Build failed in Jenkins: ActiveMQ-Artemis-Master #1090

Previous Topic Next Topic
classic Classic list List threaded Threaded
2 messages Options
Reply | Threaded
Open this post in threaded view

Build failed in Jenkins: ActiveMQ-Artemis-Master #1090

Apache Jenkins Server-2
See <>


[tabish121] ARTEMIS-1168 Update Qpid JMS and Proton-J to latest versions

Started by an SCM change
[EnvInject] - Loading node environment variables.
Building remotely on H22 (ubuntu xenial) in workspace <>
 > git rev-parse --is-inside-work-tree # timeout=10
Fetching changes from the remote Git repository
 > git config remote.origin.url # timeout=10
Cleaning workspace
 > git rev-parse --verify HEAD # timeout=10
Resetting working tree
 > git reset --hard # timeout=10
 > git clean -fdx # timeout=10
Fetching upstream changes from
 > git --version # timeout=10
 > git fetch --tags --progress +refs/heads/*:refs/remotes/origin/*
 > git rev-parse origin/master^{commit} # timeout=10
Checking out Revision 044df11694993229e9cfe3c83e86a58d489deac2 (origin/master)
 > git config core.sparsecheckout # timeout=10
 > git checkout -f 044df11694993229e9cfe3c83e86a58d489deac2
 > git rev-list 1a621092f9675ffddaeea58a25ba0a3dc7da9ef3 # timeout=10
[ActiveMQ-Artemis-Master] $ /home/jenkins/tools/maven/apache-maven-3.2.5/bin/mvn -Pfast-tests -Pextra-tests install
[INFO] Scanning for projects...
[ERROR] The build could not read 1 project -> [Help 1]
[ERROR]   The project org.apache.activemq:artemis-server-osgi:2.2.0-SNAPSHOT (<> has 2 errors
[ERROR]     Unresolveable build extension: Plugin org.apache.felix:maven-bundle-plugin:3.3.0 or one of its dependencies could not be resolved: Could not find artifact org.apache.felix:maven-bundle-plugin:jar:3.3.0 in sevntu-maven ( -> [Help 2]
[ERROR]     Unknown packaging: bundle @ org.apache.activemq:artemis-server-osgi:[unknown-version], <,> line 21, column 15
[ERROR] To see the full stack trace of the errors, re-run Maven with the -e switch.
[ERROR] Re-run Maven using the -X switch to enable full debug logging.
[ERROR] For more information about the errors and possible solutions, please read the following articles:
[ERROR] [Help 1]
[ERROR] [Help 2]
Build step 'Invoke top-level Maven targets' marked build as failure
Performing Post build task...
Could not match :Too many files with unapproved license  : False
Logical operation result is FALSE
Skipping script  : cat ratReport.txt
Recording test results
ERROR: Step ?Publish JUnit test result report? failed: No test report files were found. Configuration error?
Not sending mail to unregistered user [hidden email]
Reply | Threaded
Open this post in threaded view

Jenkins build is back to normal : ActiveMQ-Artemis-Master #1091

Apache Jenkins Server-2