Build failed in Jenkins: ActiveMQ-Artemis-Master #1082

Previous Topic Next Topic
 
classic Classic list List threaded Threaded
4 messages Options
Reply | Threaded
Open this post in threaded view
|

Build failed in Jenkins: ActiveMQ-Artemis-Master #1082

Apache Jenkins Server-2
See <https://builds.apache.org/job/ActiveMQ-Artemis-Master/1082/display/redirect?page=changes>

Changes:

[clebertsuconic] NO-JIRA: trivial test fixes on AMQP

------------------------------------------
Started by an SCM change
[EnvInject] - Loading node environment variables.
Building remotely on H22 (ubuntu xenial) in workspace <https://builds.apache.org/job/ActiveMQ-Artemis-Master/ws/>
 > git rev-parse --is-inside-work-tree # timeout=10
Fetching changes from the remote Git repository
 > git config remote.origin.url https://git-wip-us.apache.org/repos/asf/activemq-artemis.git # timeout=10
Cleaning workspace
 > git rev-parse --verify HEAD # timeout=10
Resetting working tree
 > git reset --hard # timeout=10
 > git clean -fdx # timeout=10
Fetching upstream changes from https://git-wip-us.apache.org/repos/asf/activemq-artemis.git
 > git --version # timeout=10
 > git fetch --tags --progress https://git-wip-us.apache.org/repos/asf/activemq-artemis.git +refs/heads/*:refs/remotes/origin/*
 > git rev-parse origin/master^{commit} # timeout=10
Checking out Revision ac97d6f05735c4f2065044760e7567bbe4168b9c (origin/master)
 > git config core.sparsecheckout # timeout=10
 > git checkout -f ac97d6f05735c4f2065044760e7567bbe4168b9c
 > git rev-list 5e6687e0e2d1cd1f18ff74842863cbc9d22d06b7 # timeout=10
[ActiveMQ-Artemis-Master] $ /home/jenkins/tools/maven/apache-maven-3.2.5/bin/mvn -Pfast-tests -Pextra-tests install
[INFO] Scanning for projects...
Downloading: http://sevntu-checkstyle.github.io/sevntu.checkstyle/maven2/org/apache/felix/maven-bundle-plugin/3.3.0/maven-bundle-plugin-3.3.0.jar
[ERROR] The build could not read 1 project -> [Help 1]
[ERROR]  
[ERROR]   The project org.apache.activemq:artemis-server-osgi:2.2.0-SNAPSHOT (<https://builds.apache.org/job/ActiveMQ-Artemis-Master/ws/artemis-server-osgi/pom.xml)> has 2 errors
[ERROR]     Unresolveable build extension: Plugin org.apache.felix:maven-bundle-plugin:3.3.0 or one of its dependencies could not be resolved: Could not find artifact org.apache.felix:maven-bundle-plugin:jar:3.3.0 in sevntu-maven (http://sevntu-checkstyle.github.io/sevntu.checkstyle/maven2) -> [Help 2]
[ERROR]     Unknown packaging: bundle @ org.apache.activemq:artemis-server-osgi:[unknown-version], <https://builds.apache.org/job/ActiveMQ-Artemis-Master/ws/artemis-server-osgi/pom.xml,> line 21, column 15
[ERROR]
[ERROR] To see the full stack trace of the errors, re-run Maven with the -e switch.
[ERROR] Re-run Maven using the -X switch to enable full debug logging.
[ERROR]
[ERROR] For more information about the errors and possible solutions, please read the following articles:
[ERROR] [Help 1] http://cwiki.apache.org/confluence/display/MAVEN/ProjectBuildingException
[ERROR] [Help 2] http://cwiki.apache.org/confluence/display/MAVEN/PluginResolutionException
Build step 'Invoke top-level Maven targets' marked build as failure
Performing Post build task...
Could not match :Too many files with unapproved license  : False
Logical operation result is FALSE
Skipping script  : cat ratReport.txt
END OF POST BUILD TASK : 0
Recording test results
ERROR: Step ?Publish JUnit test result report? failed: No test report files were found. Configuration error?

Reply | Threaded
Open this post in threaded view
|

Build failed in Jenkins: ActiveMQ-Artemis-Master #1083

Apache Jenkins Server-2
See <https://builds.apache.org/job/ActiveMQ-Artemis-Master/1083/display/redirect?page=changes>

Changes:

[tabish121] ARTEMIS-1160 AMQP test client should configure netty WS maxFrameSize

------------------------------------------
[...truncated 1.70 MB...]
Running org.apache.activemq.artemis.tests.unit.util.LinkedListTest
[main] 13:10:44,922 INFO  [org.apache.activemq.artemis.core.server] #*#*# Starting test: testAddHead()...
#test testAddHead
[main] 13:10:44,925 INFO  [org.apache.activemq.artemis.core.server] #*#*# Finished test: testAddHead()...
[main] 13:10:44,927 INFO  [org.apache.activemq.artemis.core.server] #*#*# Starting test: testAddTail()...
#test testAddTail
[main] 13:10:44,930 INFO  [org.apache.activemq.artemis.core.server] #*#*# Finished test: testAddTail()...
[main] 13:10:44,930 INFO  [org.apache.activemq.artemis.core.server] #*#*# Starting test: testAddHeadAndTail()...
#test testAddHeadAndTail
[main] 13:10:44,934 INFO  [org.apache.activemq.artemis.core.server] #*#*# Finished test: testAddHeadAndTail()...
[main] 13:10:44,934 INFO  [org.apache.activemq.artemis.core.server] #*#*# Starting test: testCreateIteratorAfterAddElements()...
#test testCreateIteratorAfterAddElements
[main] 13:10:44,938 INFO  [org.apache.activemq.artemis.core.server] #*#*# Finished test: testCreateIteratorAfterAddElements()...
[main] 13:10:44,938 INFO  [org.apache.activemq.artemis.core.server] #*#*# Starting test: testClear()...
#test testClear
[main] 13:10:44,942 INFO  [org.apache.activemq.artemis.core.server] #*#*# Finished test: testClear()...
[main] 13:10:44,943 INFO  [org.apache.activemq.artemis.core.server] #*#*# Starting test: testPoll()...
#test testPoll
[main] 13:10:44,946 INFO  [org.apache.activemq.artemis.core.server] #*#*# Finished test: testPoll()...
[main] 13:10:44,947 INFO  [org.apache.activemq.artemis.core.server] #*#*# Starting test: testRemoveHead1()...
#test testRemoveHead1
[main] 13:10:44,950 INFO  [org.apache.activemq.artemis.core.server] #*#*# Finished test: testRemoveHead1()...
[main] 13:10:44,950 INFO  [org.apache.activemq.artemis.core.server] #*#*# Starting test: testRemoveHead2()...
#test testRemoveHead2
[main] 13:10:44,953 INFO  [org.apache.activemq.artemis.core.server] #*#*# Finished test: testRemoveHead2()...
[main] 13:10:44,954 INFO  [org.apache.activemq.artemis.core.server] #*#*# Starting test: testRemoveHead3()...
#test testRemoveHead3
[main] 13:10:44,957 INFO  [org.apache.activemq.artemis.core.server] #*#*# Finished test: testRemoveHead3()...
[main] 13:10:44,957 INFO  [org.apache.activemq.artemis.core.server] #*#*# Starting test: testRemoveTail1()...
#test testRemoveTail1
[main] 13:10:44,961 INFO  [org.apache.activemq.artemis.core.server] #*#*# Finished test: testRemoveTail1()...
[main] 13:10:44,961 INFO  [org.apache.activemq.artemis.core.server] #*#*# Starting test: testRemoveTail2()...
#test testRemoveTail2
[main] 13:10:44,964 INFO  [org.apache.activemq.artemis.core.server] #*#*# Finished test: testRemoveTail2()...
[main] 13:10:44,964 INFO  [org.apache.activemq.artemis.core.server] #*#*# Starting test: testRemoveTail3()...
#test testRemoveTail3
[main] 13:10:44,967 INFO  [org.apache.activemq.artemis.core.server] #*#*# Finished test: testRemoveTail3()...
[main] 13:10:44,968 INFO  [org.apache.activemq.artemis.core.server] #*#*# Starting test: testRemoveInTurn()...
#test testRemoveInTurn
[main] 13:10:44,971 INFO  [org.apache.activemq.artemis.core.server] #*#*# Finished test: testRemoveInTurn()...
[main] 13:10:44,971 INFO  [org.apache.activemq.artemis.core.server] #*#*# Starting test: testRemoveMiddle()...
#test testRemoveMiddle
[main] 13:10:44,974 INFO  [org.apache.activemq.artemis.core.server] #*#*# Finished test: testRemoveMiddle()...
[main] 13:10:44,974 INFO  [org.apache.activemq.artemis.core.server] #*#*# Starting test: testAddHeadAndRemove()...
#test testAddHeadAndRemove
Jumping 500
[main] 13:10:44,979 INFO  [org.apache.activemq.artemis.utils.ThreadLeakCheckRule] #test forceGC
[main] 13:10:45,155 INFO  [org.apache.activemq.artemis.utils.ThreadLeakCheckRule] #test forceGC Done
[main] 13:10:45,158 INFO  [org.apache.activemq.artemis.core.server] #*#*# Finished test: testAddHeadAndRemove()...
[main] 13:10:45,159 INFO  [org.apache.activemq.artemis.core.server] #*#*# Starting test: testMultipleIterators1()...
#test testMultipleIterators1
[main] 13:10:45,162 INFO  [org.apache.activemq.artemis.core.server] #*#*# Finished test: testMultipleIterators1()...
[main] 13:10:45,162 INFO  [org.apache.activemq.artemis.core.server] #*#*# Starting test: testMultipleIterators2()...
#test testMultipleIterators2
[main] 13:10:45,165 INFO  [org.apache.activemq.artemis.core.server] #*#*# Finished test: testMultipleIterators2()...
[main] 13:10:45,165 INFO  [org.apache.activemq.artemis.core.server] #*#*# Starting test: testResizing()...
#test testResizing
[main] 13:10:45,172 INFO  [org.apache.activemq.artemis.core.server] #*#*# Finished test: testResizing()...
[main] 13:10:45,173 INFO  [org.apache.activemq.artemis.core.server] #*#*# Starting test: testRepeatAndRemove()...
#test testRepeatAndRemove
[main] 13:10:45,176 INFO  [org.apache.activemq.artemis.core.server] #*#*# Finished test: testRepeatAndRemove()...
[main] 13:10:45,176 INFO  [org.apache.activemq.artemis.core.server] #*#*# Starting test: testIterateNoElements()...
#test testIterateNoElements
[main] 13:10:45,179 INFO  [org.apache.activemq.artemis.core.server] #*#*# Finished test: testIterateNoElements()...
[main] 13:10:45,179 INFO  [org.apache.activemq.artemis.core.server] #*#*# Starting test: testAddAndRemove()...
#test testAddAndRemove
[main] 13:10:45,186 INFO  [org.apache.activemq.artemis.utils.ThreadLeakCheckRule] #test forceGC
[main] 13:10:45,251 INFO  [org.apache.activemq.artemis.utils.ThreadLeakCheckRule] #test forceGC Done
[main] 13:10:45,660 INFO  [org.apache.activemq.artemis.utils.ThreadLeakCheckRule] #test forceGC
[main] 13:10:47,028 INFO  [org.apache.activemq.artemis.utils.ThreadLeakCheckRule] #test forceGC Done
[main] 13:10:47,565 INFO  [org.apache.activemq.artemis.utils.ThreadLeakCheckRule] #test forceGC
[main] 13:10:47,941 INFO  [org.apache.activemq.artemis.utils.ThreadLeakCheckRule] #test forceGC Done
[main] 13:10:48,452 INFO  [org.apache.activemq.artemis.utils.ThreadLeakCheckRule] #test forceGC
[main] 13:10:48,703 INFO  [org.apache.activemq.artemis.utils.ThreadLeakCheckRule] #test forceGC Done
[main] 13:10:49,226 INFO  [org.apache.activemq.artemis.utils.ThreadLeakCheckRule] #test forceGC
[main] 13:10:49,323 INFO  [org.apache.activemq.artemis.utils.ThreadLeakCheckRule] #test forceGC Done
[main] 13:10:49,885 INFO  [org.apache.activemq.artemis.utils.ThreadLeakCheckRule] #test forceGC
[main] 13:10:49,980 INFO  [org.apache.activemq.artemis.utils.ThreadLeakCheckRule] #test forceGC Done
[main] 13:10:49,980 INFO  [org.apache.activemq.artemis.utils.ThreadLeakCheckRule] #test forceGC
[main] 13:10:50,015 INFO  [org.apache.activemq.artemis.utils.ThreadLeakCheckRule] #test forceGC Done
[main] 13:10:50,018 INFO  [org.apache.activemq.artemis.core.server] #*#*# Finished test: testAddAndRemove()...
[main] 13:10:50,019 INFO  [org.apache.activemq.artemis.core.server] #*#*# Starting test: testRemoveHeadAndTail1()...
#test testRemoveHeadAndTail1
[main] 13:10:50,022 INFO  [org.apache.activemq.artemis.core.server] #*#*# Finished test: testRemoveHeadAndTail1()...
[main] 13:10:50,023 INFO  [org.apache.activemq.artemis.core.server] #*#*# Starting test: testRemoveHeadAndTail2()...
#test testRemoveHeadAndTail2
[main] 13:10:50,028 INFO  [org.apache.activemq.artemis.core.server] #*#*# Finished test: testRemoveHeadAndTail2()...
[main] 13:10:50,028 INFO  [org.apache.activemq.artemis.core.server] #*#*# Starting test: testRemoveHeadAndTail3()...
#test testRemoveHeadAndTail3
[main] 13:10:50,031 INFO  [org.apache.activemq.artemis.core.server] #*#*# Finished test: testRemoveHeadAndTail3()...
[main] 13:10:50,032 INFO  [org.apache.activemq.artemis.core.server] #*#*# Starting test: testRepeat()...
#test testRepeat
[main] 13:10:50,038 INFO  [org.apache.activemq.artemis.core.server] #*#*# Finished test: testRepeat()...
[main] 13:10:50,038 INFO  [org.apache.activemq.artemis.core.server] #*#*# Starting test: testCreateIteratorBeforeAddElements()...
#test testCreateIteratorBeforeAddElements
[main] 13:10:50,041 INFO  [org.apache.activemq.artemis.core.server] #*#*# Finished test: testCreateIteratorBeforeAddElements()...
[main] 13:10:50,041 INFO  [org.apache.activemq.artemis.core.server] #*#*# Starting test: testRemoveAll()...
#test testRemoveAll
[main] 13:10:50,044 INFO  [org.apache.activemq.artemis.core.server] #*#*# Finished test: testRemoveAll()...
[main] 13:10:50,044 INFO  [org.apache.activemq.artemis.core.server] #*#*# Starting test: testRemoveOdd()...
#test testRemoveOdd
[main] 13:10:50,051 INFO  [org.apache.activemq.artemis.core.server] #*#*# Finished test: testRemoveOdd()...
[main] 13:10:50,051 INFO  [org.apache.activemq.artemis.core.server] #*#*# Starting test: testIterateThenAddMoreAndIterateAgain()...
#test testIterateThenAddMoreAndIterateAgain
[main] 13:10:50,054 INFO  [org.apache.activemq.artemis.core.server] #*#*# Finished test: testIterateThenAddMoreAndIterateAgain()...
Tests run: 29, Failures: 0, Errors: 0, Skipped: 0, Time elapsed: 5.136 sec - in org.apache.activemq.artemis.tests.unit.util.LinkedListTest
Running org.apache.activemq.artemis.tests.unit.util.MemorySizeTest
[main] 13:10:58,748 WARN  [org.apache.activemq.artemis.core.client] AMQ212047: Warning: JVM allocated more data what would make results invalid 2,215,641,088:1,748,500,480
[main] 13:10:58,749 INFO  [org.apache.activemq.artemis.tests.unit] Server message size is 1216
[main] 13:11:06,894 WARN  [org.apache.activemq.artemis.core.client] AMQ212047: Warning: JVM allocated more data what would make results invalid 1,748,500,480:1,867,513,856
[main] 13:11:06,894 INFO  [org.apache.activemq.artemis.tests.unit] Message reference size is 64
Tests run: 1, Failures: 0, Errors: 0, Skipped: 0, Time elapsed: 16.84 sec - in org.apache.activemq.artemis.tests.unit.util.MemorySizeTest
Running org.apache.activemq.artemis.tests.unit.util.ObjectInputStreamWithClassLoaderTest
[main] 13:11:06,896 INFO  [org.apache.activemq.artemis.core.server] #*#*# Starting test: testClassLoaderIsolationWithProxy()...
#test testClassLoaderIsolationWithProxy
Deserialized Object org.apache.activemq.artemis.tests.unit.util.ObjectInputStreamWithClassLoaderTest$AnObjectImpl@71a3a190
[main] 13:11:06,932 INFO  [org.apache.activemq.artemis.core.server] #*#*# Finished test: testClassLoaderIsolationWithProxy()...
[main] 13:11:06,933 INFO  [org.apache.activemq.artemis.core.server] #*#*# Starting test: testWhiteBlackListAgainstListObject()...
#test testWhiteBlackListAgainstListObject
[main] 13:11:06,944 INFO  [org.apache.activemq.artemis.core.server] #*#*# Finished test: testWhiteBlackListAgainstListObject()...
[main] 13:11:06,944 INFO  [org.apache.activemq.artemis.core.server] #*#*# Starting test: testWhiteBlackListAgainstArrayObject()...
#test testWhiteBlackListAgainstArrayObject
[main] 13:11:06,948 INFO  [org.apache.activemq.artemis.core.server] #*#*# Finished test: testWhiteBlackListAgainstArrayObject()...
[main] 13:11:06,949 INFO  [org.apache.activemq.artemis.core.server] #*#*# Starting test: testWhiteBlackListAnonymousObject()...
#test testWhiteBlackListAnonymousObject
[main] 13:11:06,961 INFO  [org.apache.activemq.artemis.core.server] #*#*# Finished test: testWhiteBlackListAnonymousObject()...
[main] 13:11:06,962 INFO  [org.apache.activemq.artemis.core.server] #*#*# Starting test: testWhiteBlackListLocalObject()...
#test testWhiteBlackListLocalObject
[main] 13:11:06,968 INFO  [org.apache.activemq.artemis.core.server] #*#*# Finished test: testWhiteBlackListLocalObject()...
[main] 13:11:06,968 INFO  [org.apache.activemq.artemis.core.server] #*#*# Starting test: testWhiteBlackListSystemProperty()...
#test testWhiteBlackListSystemProperty
[main] 13:11:06,972 INFO  [org.apache.activemq.artemis.core.server] #*#*# Finished test: testWhiteBlackListSystemProperty()...
[main] 13:11:06,973 INFO  [org.apache.activemq.artemis.core.server] #*#*# Starting test: testClassLoaderIsolation()...
#test testClassLoaderIsolation
[main] 13:11:06,985 INFO  [org.apache.activemq.artemis.core.server] #*#*# Finished test: testClassLoaderIsolation()...
[main] 13:11:06,985 INFO  [org.apache.activemq.artemis.core.server] #*#*# Starting test: testWhiteBlackList()...
#test testWhiteBlackList
[main] 13:11:06,995 INFO  [org.apache.activemq.artemis.core.server] #*#*# Finished test: testWhiteBlackList()...
[main] 13:11:06,996 INFO  [org.apache.activemq.artemis.core.server] #*#*# Starting test: testWhiteBlackListAgainstListMapObject()...
#test testWhiteBlackListAgainstListMapObject
[main] 13:11:07,004 INFO  [org.apache.activemq.artemis.core.server] #*#*# Finished test: testWhiteBlackListAgainstListMapObject()...
Tests run: 9, Failures: 0, Errors: 0, Skipped: 0, Time elapsed: 0.106 sec - in org.apache.activemq.artemis.tests.unit.util.ObjectInputStreamWithClassLoaderTest
Running org.apache.activemq.artemis.tests.unit.util.ReusableLatchTest
[main] 13:11:07,006 INFO  [org.apache.activemq.artemis.core.server] #*#*# Starting test: testLatchWithParameterizedDown()...
#test testLatchWithParameterizedDown
[main] 13:11:07,009 INFO  [org.apache.activemq.artemis.core.server] #*#*# Finished test: testLatchWithParameterizedDown()...
[main] 13:11:07,010 INFO  [org.apache.activemq.artemis.core.server] #*#*# Starting test: testLatchOnSingleThread()...
#test testLatchOnSingleThread
[main] 13:11:07,016 INFO  [org.apache.activemq.artemis.core.server] #*#*# Finished test: testLatchOnSingleThread()...
[main] 13:11:07,016 INFO  [org.apache.activemq.artemis.core.server] #*#*# Starting test: testReuseLatch()...
#test testReuseLatch
[main] 13:11:07,022 INFO  [org.apache.activemq.artemis.core.server] #*#*# Finished test: testReuseLatch()...
[main] 13:11:07,022 INFO  [org.apache.activemq.artemis.core.server] #*#*# Starting test: testLatchOnMultiThread()...
#test testLatchOnMultiThread
[main] 13:11:07,114 INFO  [org.apache.activemq.artemis.core.server] #*#*# Finished test: testLatchOnMultiThread()...
Tests run: 4, Failures: 0, Errors: 0, Skipped: 0, Time elapsed: 0.11 sec - in org.apache.activemq.artemis.tests.unit.util.ReusableLatchTest
Running org.apache.activemq.artemis.tests.unit.util.SoftValueMapTest
[main] 13:11:07,115 INFO  [org.apache.activemq.artemis.core.server] #*#*# Starting test: testEvictionsLeastUsed()...
#test testEvictionsLeastUsed
[main] 13:11:07,117 INFO  [org.apache.activemq.artemis.utils.ThreadLeakCheckRule] #test forceGC
[main] 13:11:07,197 INFO  [org.apache.activemq.artemis.utils.ThreadLeakCheckRule] #test forceGC Done
SoftCache.size 200
Soft cache has 200 elements
[main] 13:11:07,203 INFO  [org.apache.activemq.artemis.core.server] #*#*# Finished test: testEvictionsLeastUsed()...
[main] 13:11:07,203 INFO  [org.apache.activemq.artemis.core.server] #*#*# Starting test: testEvictions()...
#test testEvictions
[main] 13:11:07,205 INFO  [org.apache.activemq.artemis.utils.ThreadLeakCheckRule] #test forceGC
[main] 13:11:07,247 INFO  [org.apache.activemq.artemis.utils.ThreadLeakCheckRule] #test forceGC Done
Killed

Results :

Tests run: 599, Failures: 0, Errors: 0, Skipped: 0

[INFO] ------------------------------------------------------------------------
[INFO] Reactor Summary:
[INFO]
[INFO] ActiveMQ Artemis Parent ............................ SUCCESS [  7.925 s]
[INFO] ActiveMQ Artemis Commons ........................... SUCCESS [ 16.547 s]
[INFO] ActiveMQ Artemis Core Client ....................... SUCCESS [  8.860 s]
[INFO] ActiveMQ Artemis Selector Implementation ........... SUCCESS [  3.027 s]
[INFO] ActiveMQ Artemis JMS Client ........................ SUCCESS [  3.751 s]
[INFO] ActiveMQ Artemis Native POM ........................ SUCCESS [  7.108 s]
[INFO] ActiveMQ Artemis Journal ........................... SUCCESS [  2.685 s]
[INFO] ActiveMQ Artemis JDBC Store ........................ SUCCESS [  5.795 s]
[INFO] ActiveMQ Artemis Server ............................ SUCCESS [ 41.831 s]
[INFO] ActiveMQ Artemis Protocols ......................... SUCCESS [  0.245 s]
[INFO] ActiveMQ Artemis AMQP Protocol ..................... SUCCESS [  3.479 s]
[INFO] ActiveMQ Artemis STOMP Protocol .................... SUCCESS [  1.559 s]
[INFO] ActiveMQ Artemis OpenWire Protocol ................. SUCCESS [  1.913 s]
[INFO] ActiveMQ Artemis HQClient Protocol ................. SUCCESS [  0.724 s]
[INFO] ActiveMQ Artemis HornetQ Protocol .................. SUCCESS [  0.757 s]
[INFO] ActiveMQ Artemis MQTT Protocol ..................... SUCCESS [  1.209 s]
[INFO] ActiveMQ Artemis DTO ............................... SUCCESS [  2.721 s]
[INFO] ActiveMQ Artemis Service Extensions ................ SUCCESS [  1.362 s]
[INFO] ActiveMQ Artemis JMS Server ........................ SUCCESS [  1.304 s]
[INFO] ActiveMQ Artemis CDI Integration ................... SUCCESS [  4.763 s]
[INFO] ActiveMQ Artemis Boot .............................. SUCCESS [  0.334 s]
[INFO] ActiveMQ Artemis Tools ............................. SUCCESS [  1.107 s]
[INFO] ActiveMQ Artemis CLI ............................... SUCCESS [ 18.706 s]
[INFO] ActiveMQ Artemis Web ............................... SUCCESS [  4.933 s]
[INFO] ActiveMQ Artemis Web ............................... SUCCESS [01:12 min]
[INFO] ActiveMQ Artemis JUnit Rules ....................... SUCCESS [ 14.231 s]
[INFO] ActiveMQ Artemis RAR POM ........................... SUCCESS [  2.216 s]
[INFO] ActiveMQ Artemis REST Interface Implementation ..... SUCCESS [01:24 min]
[INFO] ActiveMQ Artemis Maven Plugin ...................... SUCCESS [  3.588 s]
[INFO] ActiveMQ Artemis Server OSGi ....................... SUCCESS [  8.145 s]
[INFO] ActiveMQ Artemis Spring Integration ................ SUCCESS [  0.669 s]
[INFO] Apache ActiveMQ Artemis Distribution ............... SUCCESS [ 16.681 s]
[INFO] ActiveMQ Artemis Tests POM ......................... SUCCESS [  0.548 s]
[INFO] ActiveMQ Artemis Unit Tests ........................ FAILURE [02:04 min]
[INFO] ActiveMQ Artemis Joram Tests ....................... SKIPPED
[INFO] ActiveMQ Artemis timing Tests ...................... SKIPPED
[INFO] ActiveMQ Artemis JMS Tests ......................... SKIPPED
[INFO] ActiveMQ Artemis Features .......................... SKIPPED
[INFO] ActiveMQ Artemis Test Support ...................... SKIPPED
[INFO] ActiveMQ Artemis Integration Tests ................. SKIPPED
[INFO] ActiveMQ Artemis soak Tests ........................ SKIPPED
[INFO] ActiveMQ Artemis stress Tests ...................... SKIPPED
[INFO] ActiveMQ Artemis performance Tests ................. SKIPPED
[INFO] Smoke Tests ........................................ SKIPPED
[INFO] ActiveMQ Artemis Extra Tests ....................... SKIPPED
[INFO] ------------------------------------------------------------------------
[INFO] BUILD FAILURE
[INFO] ------------------------------------------------------------------------
[INFO] Total time: 07:54 min
[INFO] Finished at: 2017-05-15T13:11:11+00:00
[INFO] Final Memory: 233M/1620M
[INFO] ------------------------------------------------------------------------
[ERROR] Failed to execute goal org.apache.maven.plugins:maven-surefire-plugin:2.18.1:test (default-test) on project unit-tests: Execution default-test of goal org.apache.maven.plugins:maven-surefire-plugin:2.18.1:test failed: The forked VM terminated without properly saying goodbye. VM crash or System.exit called?
[ERROR] Command was /bin/sh -c cd <https://builds.apache.org/job/ActiveMQ-Artemis-Master/ws/tests/unit-tests> && /usr/local/asfpackages/java/jdk1.8.0_121/jre/bin/java -Djava.util.logging.manager=org.jboss.logmanager.LogManager -Dlogging.configuration=<https://builds.apache.org/job/ActiveMQ-Artemis-Master/ws/tests/unit-tests/../../tests/config/logging.properties> -Djava.library.path=<https://builds.apache.org/job/ActiveMQ-Artemis-Master/ws/tests/unit-tests/../../artemis-native/bin> -Djgroups.bind_addr=localhost -Dorg.apache.activemq.artemis.api.core.UDPBroadcastEndpointFactory.localBindAddress=localhost -Djava.net.preferIPv4Stack=true -Dbasedir=<https://builds.apache.org/job/ActiveMQ-Artemis-Master/ws/tests/unit-tests> -jar <https://builds.apache.org/job/ActiveMQ-Artemis-Master/ws/tests/unit-tests/target/surefire/surefirebooter2440454552028842032.jar> <https://builds.apache.org/job/ActiveMQ-Artemis-Master/ws/tests/unit-tests/target/surefire/surefire5857151233768773415tmp> <https://builds.apache.org/job/ActiveMQ-Artemis-Master/ws/tests/unit-tests/target/surefire/surefire_161093811202971687934tmp>
[ERROR] -> [Help 1]
[ERROR]
[ERROR] To see the full stack trace of the errors, re-run Maven with the -e switch.
[ERROR] Re-run Maven using the -X switch to enable full debug logging.
[ERROR]
[ERROR] For more information about the errors and possible solutions, please read the following articles:
[ERROR] [Help 1] http://cwiki.apache.org/confluence/display/MAVEN/PluginExecutionException
[ERROR]
[ERROR] After correcting the problems, you can resume the build with the command
[ERROR]   mvn <goals> -rf :unit-tests
Build step 'Invoke top-level Maven targets' marked build as failure
Performing Post build task...
Could not match :Too many files with unapproved license  : False
Logical operation result is FALSE
Skipping script  : cat ratReport.txt
END OF POST BUILD TASK : 0
Recording test results
Not sending mail to unregistered user [hidden email]
Reply | Threaded
Open this post in threaded view
|

Build failed in Jenkins: ActiveMQ-Artemis-Master #1084

Apache Jenkins Server-2
See <https://builds.apache.org/job/ActiveMQ-Artemis-Master/1084/display/redirect?page=changes>

Changes:

[clebertsuconic] ARTEMIS-1160 Fixing Checkstyle

------------------------------------------
Started by an SCM change
[EnvInject] - Loading node environment variables.
Building remotely on H22 (ubuntu xenial) in workspace <https://builds.apache.org/job/ActiveMQ-Artemis-Master/ws/>
 > git rev-parse --is-inside-work-tree # timeout=10
Fetching changes from the remote Git repository
 > git config remote.origin.url https://git-wip-us.apache.org/repos/asf/activemq-artemis.git # timeout=10
Cleaning workspace
 > git rev-parse --verify HEAD # timeout=10
Resetting working tree
 > git reset --hard # timeout=10
 > git clean -fdx # timeout=10
Fetching upstream changes from https://git-wip-us.apache.org/repos/asf/activemq-artemis.git
 > git --version # timeout=10
 > git fetch --tags --progress https://git-wip-us.apache.org/repos/asf/activemq-artemis.git +refs/heads/*:refs/remotes/origin/*
 > git rev-parse origin/master^{commit} # timeout=10
Checking out Revision 502f9c544c8ba6e18d1164dd7ebb3b9ec9a6ef28 (origin/master)
 > git config core.sparsecheckout # timeout=10
 > git checkout -f 502f9c544c8ba6e18d1164dd7ebb3b9ec9a6ef28
 > git rev-list 47e0cffc924cdb3b57e2c9cb60b57f08631b565b # timeout=10
[ActiveMQ-Artemis-Master] $ /home/jenkins/tools/maven/apache-maven-3.2.5/bin/mvn -Pfast-tests -Pextra-tests install
[INFO] Scanning for projects...
Downloading: http://sevntu-checkstyle.github.io/sevntu.checkstyle/maven2/org/apache/felix/maven-bundle-plugin/3.3.0/maven-bundle-plugin-3.3.0.jar
[ERROR] The build could not read 1 project -> [Help 1]
[ERROR]  
[ERROR]   The project org.apache.activemq:artemis-server-osgi:2.2.0-SNAPSHOT (<https://builds.apache.org/job/ActiveMQ-Artemis-Master/ws/artemis-server-osgi/pom.xml)> has 2 errors
[ERROR]     Unresolveable build extension: Plugin org.apache.felix:maven-bundle-plugin:3.3.0 or one of its dependencies could not be resolved: Could not find artifact org.apache.felix:maven-bundle-plugin:jar:3.3.0 in sevntu-maven (http://sevntu-checkstyle.github.io/sevntu.checkstyle/maven2) -> [Help 2]
[ERROR]     Unknown packaging: bundle @ org.apache.activemq:artemis-server-osgi:[unknown-version], <https://builds.apache.org/job/ActiveMQ-Artemis-Master/ws/artemis-server-osgi/pom.xml,> line 21, column 15
[ERROR]
[ERROR] To see the full stack trace of the errors, re-run Maven with the -e switch.
[ERROR] Re-run Maven using the -X switch to enable full debug logging.
[ERROR]
[ERROR] For more information about the errors and possible solutions, please read the following articles:
[ERROR] [Help 1] http://cwiki.apache.org/confluence/display/MAVEN/ProjectBuildingException
[ERROR] [Help 2] http://cwiki.apache.org/confluence/display/MAVEN/PluginResolutionException
Build step 'Invoke top-level Maven targets' marked build as failure
Performing Post build task...
Could not match :Too many files with unapproved license  : False
Logical operation result is FALSE
Skipping script  : cat ratReport.txt
END OF POST BUILD TASK : 0
Recording test results
ERROR: Step ?Publish JUnit test result report? failed: No test report files were found. Configuration error?
Not sending mail to unregistered user [hidden email]
Reply | Threaded
Open this post in threaded view
|

Jenkins build is back to normal : ActiveMQ-Artemis-Master #1085

Apache Jenkins Server-2