Build failed in Jenkins: ActiveMQ » ActiveMQ-Artemis-Master-JDK8 #60

Previous Topic Next Topic
 
classic Classic list List threaded Threaded
3 messages Options
Reply | Threaded
Open this post in threaded view
|

Build failed in Jenkins: ActiveMQ » ActiveMQ-Artemis-Master-JDK8 #60

Apache Jenkins Server-2
See <https://ci-builds.apache.org/job/ActiveMQ/job/ActiveMQ-Artemis-Master-JDK8/60/display/redirect?page=changes>

Changes:

[Domenico Francesco Bruscino] ARTEMIS-2924 prevent NPE


------------------------------------------
[...truncated 4.11 MB...]
[INFO]
[ERROR] Failures:
[ERROR]   HornetQSoakTest.testSoakHornetQ:115->checkErrors:125 the script finished with errors expected:<0> but was:<10>
[INFO]
[ERROR] Tests run: 203, Failures: 1, Errors: 0, Skipped: 0
[INFO]
[JENKINS] Recording test results
[INFO] ------------------------------------------------------------------------
[INFO] Reactor Summary for ActiveMQ Artemis Parent 2.16.0-SNAPSHOT:
[INFO]
[INFO] ActiveMQ Artemis Parent ............................ SUCCESS [ 14.377 s]
[INFO] ActiveMQ Artemis Commons ........................... SUCCESS [01:12 min]
[INFO] ActiveMQ Artemis Core Client ....................... SUCCESS [ 34.870 s]
[INFO] ActiveMQ Artemis Selector Implementation ........... SUCCESS [ 12.314 s]
[INFO] ActiveMQ Artemis JMS Client ........................ SUCCESS [ 13.647 s]
[INFO] ActiveMQ Artemis Journal ........................... SUCCESS [ 11.628 s]
[INFO] ActiveMQ Artemis JDBC Store ........................ SUCCESS [ 44.562 s]
[INFO] ActiveMQ Artemis Server ............................ SUCCESS [06:54 min]
[INFO] ActiveMQ Artemis Protocols ......................... SUCCESS [  3.900 s]
[INFO] ActiveMQ Artemis AMQP Protocol ..................... SUCCESS [ 24.950 s]
[INFO] ActiveMQ Artemis STOMP Protocol .................... SUCCESS [ 10.309 s]
[INFO] ActiveMQ Artemis OpenWire Protocol ................. SUCCESS [ 15.582 s]
[INFO] ActiveMQ Artemis HQClient Protocol ................. SUCCESS [  7.724 s]
[INFO] ActiveMQ Artemis HornetQ Protocol .................. SUCCESS [ 10.859 s]
[INFO] ActiveMQ Artemis Service Extensions ................ SUCCESS [  8.988 s]
[INFO] ActiveMQ Artemis JMS Server ........................ SUCCESS [  8.938 s]
[INFO] ActiveMQ Artemis JUnit Rules ....................... SUCCESS [ 15.651 s]
[INFO] ActiveMQ Artemis MQTT Protocol ..................... SUCCESS [ 24.225 s]
[INFO] ActiveMQ Artemis DTO ............................... SUCCESS [ 10.610 s]
[INFO] ActiveMQ Artemis CDI Integration ................... SUCCESS [ 13.966 s]
[INFO] ActiveMQ Artemis Boot .............................. SUCCESS [  6.468 s]
[INFO] ActiveMQ Artemis Tools ............................. SUCCESS [  7.985 s]
[INFO] ActiveMQ Artemis CLI ............................... SUCCESS [02:02 min]
[INFO] ActiveMQ Artemis Web ............................... SUCCESS [ 21.382 s]
[INFO] ActiveMQ Artemis Web ............................... SUCCESS [ 23.828 s]
[INFO] ActiveMQ Artemis Core Client All ................... SUCCESS [ 27.626 s]
[INFO] ActiveMQ Artemis Client OSGi ....................... SUCCESS [  7.967 s]
[INFO] ActiveMQ Artemis JMS Client All .................... SUCCESS [ 24.655 s]
[INFO] ActiveMQ Artemis JMS Client OSGi ................... SUCCESS [  8.695 s]
[INFO] ActiveMQ Artemis RAR POM ........................... SUCCESS [  9.102 s]
[INFO] ActiveMQ Artemis REST Interface Implementation ..... SUCCESS [ 11.192 s]
[INFO] ActiveMQ Artemis Maven Plugin ...................... SUCCESS [ 11.303 s]
[INFO] ActiveMQ Artemis Server OSGi ....................... SUCCESS [ 12.706 s]
[INFO] ActiveMQ Artemis Cons .............................. SUCCESS [  3.863 s]
[INFO] ActiveMQ Artemis HawtIO Branding ................... SUCCESS [ 12.309 s]
[INFO] ActiveMQ Artemis HawtIO Plugin ..................... SUCCESS [  8.223 s]
[INFO] ActiveMQ Artemis Console ........................... SUCCESS [  9.539 s]
[INFO] ActiveMQ Artemis Spring Integration ................ SUCCESS [  6.986 s]
[INFO] Apache ActiveMQ Artemis Distribution ............... SUCCESS [01:04 min]
[INFO] ActiveMQ Artemis Tests POM ......................... SUCCESS [  4.520 s]
[INFO] ActiveMQ Artemis Test Support ...................... SUCCESS [  8.478 s]
[INFO] ActiveMQ Artemis Unit Tests ........................ SUCCESS [33:05 min]
[INFO] ActiveMQ Artemis Joram Tests ....................... SUCCESS [02:40 min]
[INFO] ActiveMQ Artemis timing Tests ...................... SUCCESS [  7.635 s]
[INFO] ActiveMQ Artemis JMS Tests ......................... SUCCESS [06:44 min]
[INFO] ActiveMQ Artemis Features .......................... SUCCESS [ 55.432 s]
[INFO] ActiveMQ Artemis Integration Tests ................. SUCCESS [01:07 min]
[INFO] ActiveMQ Artemis Client Integration Tests .......... SUCCESS [ 10.044 s]
[INFO] ActiveMQ Artemis Compatibility Tests ............... FAILURE [15:22 min]
[INFO] ActiveMQ Artemis soak Tests ........................ SKIPPED
[INFO] ActiveMQ Artemis stress Tests ...................... SKIPPED
[INFO] ActiveMQ Artemis performance Tests ................. SKIPPED
[INFO] Smoke Tests ........................................ SKIPPED
[INFO] ActiveMQ Artemis Extra Tests ....................... SKIPPED
[INFO] ------------------------------------------------------------------------
[INFO] BUILD FAILURE
[INFO] ------------------------------------------------------------------------
[INFO] Total time:  01:25 h
[INFO] Finished at: 2020-09-30T18:58:24Z
[INFO] ------------------------------------------------------------------------
Waiting for Jenkins to finish collecting data
[ERROR] Failed to execute goal org.apache.maven.plugins:maven-surefire-plugin:2.22.2:test (default-test) on project compatibility-tests: There are test failures.
[ERROR]
[ERROR] Please refer to <https://ci-builds.apache.org/job/ActiveMQ/job/ActiveMQ-Artemis-Master-JDK8/ws/tests/compatibility-tests/target/surefire-reports> for the individual test results.
[ERROR] Please refer to dump files (if any exist) [date].dump, [date]-jvmRun[N].dump and [date].dumpstream.
[ERROR] -> [Help 1]
[ERROR]
[ERROR] To see the full stack trace of the errors, re-run Maven with the -e switch.
[ERROR] Re-run Maven using the -X switch to enable full debug logging.
[ERROR]
[ERROR] For more information about the errors and possible solutions, please read the following articles:
[ERROR] [Help 1] http://cwiki.apache.org/confluence/display/MAVEN/MojoFailureException
[ERROR]
[ERROR] After correcting the problems, you can resume the build with the command
[ERROR]   mvn <goals> -rf :compatibility-tests
[JENKINS] Archiving <https://ci-builds.apache.org/job/ActiveMQ/job/ActiveMQ-Artemis-Master-JDK8/ws/artemis-server/pom.xml> to org.apache.activemq/artemis-server/2.16.0-SNAPSHOT/artemis-server-2.16.0-SNAPSHOT.pom
[JENKINS] Archiving <https://ci-builds.apache.org/job/ActiveMQ/job/ActiveMQ-Artemis-Master-JDK8/ws/artemis-server/target/artemis-server-2.16.0-SNAPSHOT.jar> to org.apache.activemq/artemis-server/2.16.0-SNAPSHOT/artemis-server-2.16.0-SNAPSHOT.jar
[JENKINS] Archiving <https://ci-builds.apache.org/job/ActiveMQ/job/ActiveMQ-Artemis-Master-JDK8/ws/artemis-server/target/artemis-server-2.16.0-SNAPSHOT-tests.jar> to org.apache.activemq/artemis-server/2.16.0-SNAPSHOT/artemis-server-2.16.0-SNAPSHOT-tests.jar
[JENKINS] Archiving <https://ci-builds.apache.org/job/ActiveMQ/job/ActiveMQ-Artemis-Master-JDK8/ws/artemis-server/target/artemis-server-2.16.0-SNAPSHOT-sources.jar> to org.apache.activemq/artemis-server/2.16.0-SNAPSHOT/artemis-server-2.16.0-SNAPSHOT-sources.jar
[Fast Archiver] Compressed 4.52 MB of artifacts by 24.2% relative to #59
[JENKINS] Archiving <https://ci-builds.apache.org/job/ActiveMQ/job/ActiveMQ-Artemis-Master-JDK8/ws/tests/compatibility-tests/pom.xml> to org.apache.activemq.tests/compatibility-tests/2.16.0-SNAPSHOT/compatibility-tests-2.16.0-SNAPSHOT.pom
[JENKINS] Archiving <https://ci-builds.apache.org/job/ActiveMQ/job/ActiveMQ-Artemis-Master-JDK8/ws/artemis-jms-client/pom.xml> to org.apache.activemq/artemis-jms-client/2.16.0-SNAPSHOT/artemis-jms-client-2.16.0-SNAPSHOT.pom
[JENKINS] Archiving <https://ci-builds.apache.org/job/ActiveMQ/job/ActiveMQ-Artemis-Master-JDK8/ws/artemis-jms-client/target/artemis-jms-client-2.16.0-SNAPSHOT.jar> to org.apache.activemq/artemis-jms-client/2.16.0-SNAPSHOT/artemis-jms-client-2.16.0-SNAPSHOT.jar
[JENKINS] Archiving <https://ci-builds.apache.org/job/ActiveMQ/job/ActiveMQ-Artemis-Master-JDK8/ws/artemis-jms-client/target/artemis-jms-client-2.16.0-SNAPSHOT-sources.jar> to org.apache.activemq/artemis-jms-client/2.16.0-SNAPSHOT/artemis-jms-client-2.16.0-SNAPSHOT-sources.jar
[JENKINS] Archiving <https://ci-builds.apache.org/job/ActiveMQ/job/ActiveMQ-Artemis-Master-JDK8/ws/artemis-hawtio/activemq-branding/pom.xml> to org.apache.activemq/activemq-branding/2.16.0-SNAPSHOT/activemq-branding-2.16.0-SNAPSHOT.pom
[JENKINS] Archiving <https://ci-builds.apache.org/job/ActiveMQ/job/ActiveMQ-Artemis-Master-JDK8/ws/artemis-hawtio/activemq-branding/target/activemq-branding-2.16.0-SNAPSHOT.war> to org.apache.activemq/activemq-branding/2.16.0-SNAPSHOT/activemq-branding-2.16.0-SNAPSHOT.war
[JENKINS] Archiving <https://ci-builds.apache.org/job/ActiveMQ/job/ActiveMQ-Artemis-Master-JDK8/ws/artemis-hawtio/activemq-branding/target/activemq-branding-2.16.0-SNAPSHOT-sources.jar> to org.apache.activemq/activemq-branding/2.16.0-SNAPSHOT/activemq-branding-2.16.0-SNAPSHOT-sources.jar
[Fast Archiver] Compressed 947.60 KB of artifacts by 84.4% relative to #59
[JENKINS] Archiving <https://ci-builds.apache.org/job/ActiveMQ/job/ActiveMQ-Artemis-Master-JDK8/ws/tests/smoke-tests/pom.xml> to org.apache.activemq.tests/smoke-tests/2.16.0-SNAPSHOT/smoke-tests-2.16.0-SNAPSHOT.pom
[JENKINS] Archiving <https://ci-builds.apache.org/job/ActiveMQ/job/ActiveMQ-Artemis-Master-JDK8/ws/tests/joram-tests/pom.xml> to org.apache.activemq.tests/joram-tests/2.16.0-SNAPSHOT/joram-tests-2.16.0-SNAPSHOT.pom
[JENKINS] Archiving <https://ci-builds.apache.org/job/ActiveMQ/job/ActiveMQ-Artemis-Master-JDK8/ws/tests/joram-tests/target/joram-tests-2.16.0-SNAPSHOT.jar> to org.apache.activemq.tests/joram-tests/2.16.0-SNAPSHOT/joram-tests-2.16.0-SNAPSHOT.jar
[JENKINS] Archiving <https://ci-builds.apache.org/job/ActiveMQ/job/ActiveMQ-Artemis-Master-JDK8/ws/tests/joram-tests/target/joram-tests-2.16.0-SNAPSHOT-tests.jar> to org.apache.activemq.tests/joram-tests/2.16.0-SNAPSHOT/joram-tests-2.16.0-SNAPSHOT-tests.jar
[JENKINS] Archiving <https://ci-builds.apache.org/job/ActiveMQ/job/ActiveMQ-Artemis-Master-JDK8/ws/tests/joram-tests/target/joram-tests-2.16.0-SNAPSHOT-sources.jar> to org.apache.activemq.tests/joram-tests/2.16.0-SNAPSHOT/joram-tests-2.16.0-SNAPSHOT-sources.jar
[JENKINS] Archiving <https://ci-builds.apache.org/job/ActiveMQ/job/ActiveMQ-Artemis-Master-JDK8/ws/artemis-jms-server/pom.xml> to org.apache.activemq/artemis-jms-server/2.16.0-SNAPSHOT/artemis-jms-server-2.16.0-SNAPSHOT.pom
[JENKINS] Archiving <https://ci-builds.apache.org/job/ActiveMQ/job/ActiveMQ-Artemis-Master-JDK8/ws/artemis-jms-server/target/artemis-jms-server-2.16.0-SNAPSHOT.jar> to org.apache.activemq/artemis-jms-server/2.16.0-SNAPSHOT/artemis-jms-server-2.16.0-SNAPSHOT.jar
[JENKINS] Archiving <https://ci-builds.apache.org/job/ActiveMQ/job/ActiveMQ-Artemis-Master-JDK8/ws/artemis-jms-server/target/artemis-jms-server-2.16.0-SNAPSHOT-sources.jar> to org.apache.activemq/artemis-jms-server/2.16.0-SNAPSHOT/artemis-jms-server-2.16.0-SNAPSHOT-sources.jar
[JENKINS] Archiving <https://ci-builds.apache.org/job/ActiveMQ/job/ActiveMQ-Artemis-Master-JDK8/ws/artemis-cli/pom.xml> to org.apache.activemq/artemis-cli/2.16.0-SNAPSHOT/artemis-cli-2.16.0-SNAPSHOT.pom
[JENKINS] Archiving <https://ci-builds.apache.org/job/ActiveMQ/job/ActiveMQ-Artemis-Master-JDK8/ws/artemis-cli/target/artemis-cli-2.16.0-SNAPSHOT.jar> to org.apache.activemq/artemis-cli/2.16.0-SNAPSHOT/artemis-cli-2.16.0-SNAPSHOT.jar
[JENKINS] Archiving <https://ci-builds.apache.org/job/ActiveMQ/job/ActiveMQ-Artemis-Master-JDK8/ws/artemis-cli/target/artemis-cli-2.16.0-SNAPSHOT-sources.jar> to org.apache.activemq/artemis-cli/2.16.0-SNAPSHOT/artemis-cli-2.16.0-SNAPSHOT-sources.jar
[Fast Archiver] Compressed 719.16 KB of artifacts by 26.7% relative to #59
[JENKINS] Archiving <https://ci-builds.apache.org/job/ActiveMQ/job/ActiveMQ-Artemis-Master-JDK8/ws/artemis-core-client-all/dependency-reduced-pom.xml> to org.apache.activemq/artemis-core-client-all/2.16.0-SNAPSHOT/artemis-core-client-all-2.16.0-SNAPSHOT.pom
[JENKINS] Archiving <https://ci-builds.apache.org/job/ActiveMQ/job/ActiveMQ-Artemis-Master-JDK8/ws/artemis-core-client-all/target/artemis-core-client-all-2.16.0-SNAPSHOT.jar> to org.apache.activemq/artemis-core-client-all/2.16.0-SNAPSHOT/artemis-core-client-all-2.16.0-SNAPSHOT.jar
[JENKINS] Archiving <https://ci-builds.apache.org/job/ActiveMQ/job/ActiveMQ-Artemis-Master-JDK8/ws/artemis-core-client-all/target/artemis-core-client-all-2.16.0-SNAPSHOT-sources.jar> to org.apache.activemq/artemis-core-client-all/2.16.0-SNAPSHOT/artemis-core-client-all-2.16.0-SNAPSHOT-sources.jar
[Fast Archiver] Compressed 13.77 MB of artifacts by 48.4% relative to #59
[JENKINS] Archiving <https://ci-builds.apache.org/job/ActiveMQ/job/ActiveMQ-Artemis-Master-JDK8/ws/tests/pom.xml> to org.apache.activemq.tests/artemis-tests-pom/2.16.0-SNAPSHOT/artemis-tests-pom-2.16.0-SNAPSHOT.pom
[JENKINS] Archiving <https://ci-builds.apache.org/job/ActiveMQ/job/ActiveMQ-Artemis-Master-JDK8/ws/artemis-protocols/artemis-openwire-protocol/pom.xml> to org.apache.activemq/artemis-openwire-protocol/2.16.0-SNAPSHOT/artemis-openwire-protocol-2.16.0-SNAPSHOT.pom
[JENKINS] Archiving <https://ci-builds.apache.org/job/ActiveMQ/job/ActiveMQ-Artemis-Master-JDK8/ws/artemis-protocols/artemis-openwire-protocol/target/artemis-openwire-protocol-2.16.0-SNAPSHOT.jar> to org.apache.activemq/artemis-openwire-protocol/2.16.0-SNAPSHOT/artemis-openwire-protocol-2.16.0-SNAPSHOT.jar
[JENKINS] Archiving <https://ci-builds.apache.org/job/ActiveMQ/job/ActiveMQ-Artemis-Master-JDK8/ws/artemis-protocols/artemis-openwire-protocol/target/artemis-openwire-protocol-2.16.0-SNAPSHOT-sources.jar> to org.apache.activemq/artemis-openwire-protocol/2.16.0-SNAPSHOT/artemis-openwire-protocol-2.16.0-SNAPSHOT-sources.jar
[Fast Archiver] Compressed 1.38 MB of artifacts by 83.9% relative to #59
[JENKINS] Archiving <https://ci-builds.apache.org/job/ActiveMQ/job/ActiveMQ-Artemis-Master-JDK8/ws/artemis-distribution/pom.xml> to org.apache.activemq/apache-artemis/2.16.0-SNAPSHOT/apache-artemis-2.16.0-SNAPSHOT.pom
[JENKINS] Archiving <https://ci-builds.apache.org/job/ActiveMQ/job/ActiveMQ-Artemis-Master-JDK8/ws/artemis-distribution/target/apache-artemis-2.16.0-SNAPSHOT-source-release.zip> to org.apache.activemq/apache-artemis/2.16.0-SNAPSHOT/apache-artemis-2.16.0-SNAPSHOT-source-release.zip
[JENKINS] Archiving <https://ci-builds.apache.org/job/ActiveMQ/job/ActiveMQ-Artemis-Master-JDK8/ws/artemis-distribution/target/apache-artemis-2.16.0-SNAPSHOT-source-release.tar.gz> to org.apache.activemq/apache-artemis/2.16.0-SNAPSHOT/apache-artemis-2.16.0-SNAPSHOT-source-release.tar.gz
[JENKINS] Archiving <https://ci-builds.apache.org/job/ActiveMQ/job/ActiveMQ-Artemis-Master-JDK8/ws/artemis-distribution/target/apache-artemis-2.16.0-SNAPSHOT-bin.zip> to org.apache.activemq/apache-artemis/2.16.0-SNAPSHOT/apache-artemis-2.16.0-SNAPSHOT-bin.zip
[JENKINS] Archiving <https://ci-builds.apache.org/job/ActiveMQ/job/ActiveMQ-Artemis-Master-JDK8/ws/artemis-distribution/target/apache-artemis-2.16.0-SNAPSHOT-bin.tar.gz> to org.apache.activemq/apache-artemis/2.16.0-SNAPSHOT/apache-artemis-2.16.0-SNAPSHOT-bin.tar.gz
[Fast Archiver] Compressed 132.81 MB of artifacts by 33.1% relative to #59
[JENKINS] Archiving <https://ci-builds.apache.org/job/ActiveMQ/job/ActiveMQ-Artemis-Master-JDK8/ws/artemis-hawtio/artemis-console/pom.xml> to org.apache.activemq/artemis-console/2.16.0-SNAPSHOT/artemis-console-2.16.0-SNAPSHOT.pom
[JENKINS] Archiving <https://ci-builds.apache.org/job/ActiveMQ/job/ActiveMQ-Artemis-Master-JDK8/ws/artemis-hawtio/artemis-console/target/artemis-console-2.16.0-SNAPSHOT.war> to org.apache.activemq/artemis-console/2.16.0-SNAPSHOT/artemis-console-2.16.0-SNAPSHOT.war
[JENKINS] Archiving <https://ci-builds.apache.org/job/ActiveMQ/job/ActiveMQ-Artemis-Master-JDK8/ws/artemis-hawtio/artemis-console/target/artemis-console-2.16.0-SNAPSHOT-sources.jar> to org.apache.activemq/artemis-console/2.16.0-SNAPSHOT/artemis-console-2.16.0-SNAPSHOT-sources.jar
[Fast Archiver] Compressed 12.57 MB of artifacts by 69.9% relative to #59
[JENKINS] Archiving <https://ci-builds.apache.org/job/ActiveMQ/job/ActiveMQ-Artemis-Master-JDK8/ws/tests/artemis-test-support/pom.xml> to org.apache.activemq.tests/artemis-test-support/2.16.0-SNAPSHOT/artemis-test-support-2.16.0-SNAPSHOT.pom
[JENKINS] Archiving <https://ci-builds.apache.org/job/ActiveMQ/job/ActiveMQ-Artemis-Master-JDK8/ws/tests/artemis-test-support/target/artemis-test-support-2.16.0-SNAPSHOT.jar> to org.apache.activemq.tests/artemis-test-support/2.16.0-SNAPSHOT/artemis-test-support-2.16.0-SNAPSHOT.jar
[JENKINS] Archiving <https://ci-builds.apache.org/job/ActiveMQ/job/ActiveMQ-Artemis-Master-JDK8/ws/tests/artemis-test-support/target/artemis-test-support-2.16.0-SNAPSHOT-sources.jar> to org.apache.activemq.tests/artemis-test-support/2.16.0-SNAPSHOT/artemis-test-support-2.16.0-SNAPSHOT-sources.jar
[JENKINS] Archiving <https://ci-builds.apache.org/job/ActiveMQ/job/ActiveMQ-Artemis-Master-JDK8/ws/artemis-selector/pom.xml> to org.apache.activemq/artemis-selector/2.16.0-SNAPSHOT/artemis-selector-2.16.0-SNAPSHOT.pom
[JENKINS] Archiving <https://ci-builds.apache.org/job/ActiveMQ/job/ActiveMQ-Artemis-Master-JDK8/ws/artemis-selector/target/artemis-selector-2.16.0-SNAPSHOT.jar> to org.apache.activemq/artemis-selector/2.16.0-SNAPSHOT/artemis-selector-2.16.0-SNAPSHOT.jar
[JENKINS] Archiving <https://ci-builds.apache.org/job/ActiveMQ/job/ActiveMQ-Artemis-Master-JDK8/ws/artemis-selector/target/artemis-selector-2.16.0-SNAPSHOT-sources.jar> to org.apache.activemq/artemis-selector/2.16.0-SNAPSHOT/artemis-selector-2.16.0-SNAPSHOT-sources.jar
[JENKINS] Archiving <https://ci-builds.apache.org/job/ActiveMQ/job/ActiveMQ-Artemis-Master-JDK8/ws/artemis-jdbc-store/pom.xml> to org.apache.activemq/artemis-jdbc-store/2.16.0-SNAPSHOT/artemis-jdbc-store-2.16.0-SNAPSHOT.pom
[JENKINS] Archiving <https://ci-builds.apache.org/job/ActiveMQ/job/ActiveMQ-Artemis-Master-JDK8/ws/artemis-jdbc-store/target/artemis-jdbc-store-2.16.0-SNAPSHOT.jar> to org.apache.activemq/artemis-jdbc-store/2.16.0-SNAPSHOT/artemis-jdbc-store-2.16.0-SNAPSHOT.jar
[JENKINS] Archiving <https://ci-builds.apache.org/job/ActiveMQ/job/ActiveMQ-Artemis-Master-JDK8/ws/artemis-jdbc-store/target/artemis-jdbc-store-2.16.0-SNAPSHOT-sources.jar> to org.apache.activemq/artemis-jdbc-store/2.16.0-SNAPSHOT/artemis-jdbc-store-2.16.0-SNAPSHOT-sources.jar
[JENKINS] Archiving <https://ci-builds.apache.org/job/ActiveMQ/job/ActiveMQ-Artemis-Master-JDK8/ws/integration/activemq-spring-integration/pom.xml> to org.apache.activemq/artemis-spring-integration/2.16.0-SNAPSHOT/artemis-spring-integration-2.16.0-SNAPSHOT.pom
[JENKINS] Archiving <https://ci-builds.apache.org/job/ActiveMQ/job/ActiveMQ-Artemis-Master-JDK8/ws/integration/activemq-spring-integration/target/artemis-spring-integration-2.16.0-SNAPSHOT.jar> to org.apache.activemq/artemis-spring-integration/2.16.0-SNAPSHOT/artemis-spring-integration-2.16.0-SNAPSHOT.jar
[JENKINS] Archiving <https://ci-builds.apache.org/job/ActiveMQ/job/ActiveMQ-Artemis-Master-JDK8/ws/integration/activemq-spring-integration/target/artemis-spring-integration-2.16.0-SNAPSHOT-sources.jar> to org.apache.activemq/artemis-spring-integration/2.16.0-SNAPSHOT/artemis-spring-integration-2.16.0-SNAPSHOT-sources.jar
[JENKINS] Archiving <https://ci-builds.apache.org/job/ActiveMQ/job/ActiveMQ-Artemis-Master-JDK8/ws/artemis-web/pom.xml> to org.apache.activemq/artemis-web/2.16.0-SNAPSHOT/artemis-web-2.16.0-SNAPSHOT.pom
[JENKINS] Archiving <https://ci-builds.apache.org/job/ActiveMQ/job/ActiveMQ-Artemis-Master-JDK8/ws/artemis-web/target/artemis-web-2.16.0-SNAPSHOT.jar> to org.apache.activemq/artemis-web/2.16.0-SNAPSHOT/artemis-web-2.16.0-SNAPSHOT.jar
[JENKINS] Archiving <https://ci-builds.apache.org/job/ActiveMQ/job/ActiveMQ-Artemis-Master-JDK8/ws/artemis-web/target/artemis-web-2.16.0-SNAPSHOT-sources.jar> to org.apache.activemq/artemis-web/2.16.0-SNAPSHOT/artemis-web-2.16.0-SNAPSHOT-sources.jar
[JENKINS] Archiving <https://ci-builds.apache.org/job/ActiveMQ/job/ActiveMQ-Artemis-Master-JDK8/ws/artemis-cdi-client/pom.xml> to org.apache.activemq/artemis-cdi-client/2.16.0-SNAPSHOT/artemis-cdi-client-2.16.0-SNAPSHOT.pom
[JENKINS] Archiving <https://ci-builds.apache.org/job/ActiveMQ/job/ActiveMQ-Artemis-Master-JDK8/ws/artemis-cdi-client/target/artemis-cdi-client-2.16.0-SNAPSHOT.jar> to org.apache.activemq/artemis-cdi-client/2.16.0-SNAPSHOT/artemis-cdi-client-2.16.0-SNAPSHOT.jar
[JENKINS] Archiving <https://ci-builds.apache.org/job/ActiveMQ/job/ActiveMQ-Artemis-Master-JDK8/ws/artemis-cdi-client/target/artemis-cdi-client-2.16.0-SNAPSHOT-sources.jar> to org.apache.activemq/artemis-cdi-client/2.16.0-SNAPSHOT/artemis-cdi-client-2.16.0-SNAPSHOT-sources.jar
[JENKINS] Archiving <https://ci-builds.apache.org/job/ActiveMQ/job/ActiveMQ-Artemis-Master-JDK8/ws/tests/jms-tests/pom.xml> to org.apache.activemq.tests/jms-tests/2.16.0-SNAPSHOT/jms-tests-2.16.0-SNAPSHOT.pom
[JENKINS] Archiving <https://ci-builds.apache.org/job/ActiveMQ/job/ActiveMQ-Artemis-Master-JDK8/ws/tests/jms-tests/target/jms-tests-2.16.0-SNAPSHOT.jar> to org.apache.activemq.tests/jms-tests/2.16.0-SNAPSHOT/jms-tests-2.16.0-SNAPSHOT.jar
[JENKINS] Archiving <https://ci-builds.apache.org/job/ActiveMQ/job/ActiveMQ-Artemis-Master-JDK8/ws/tests/jms-tests/target/jms-tests-2.16.0-SNAPSHOT-tests.jar> to org.apache.activemq.tests/jms-tests/2.16.0-SNAPSHOT/jms-tests-2.16.0-SNAPSHOT-tests.jar
[JENKINS] Archiving <https://ci-builds.apache.org/job/ActiveMQ/job/ActiveMQ-Artemis-Master-JDK8/ws/tests/jms-tests/target/jms-tests-2.16.0-SNAPSHOT-sources.jar> to org.apache.activemq.tests/jms-tests/2.16.0-SNAPSHOT/jms-tests-2.16.0-SNAPSHOT-sources.jar
[JENKINS] Archiving <https://ci-builds.apache.org/job/ActiveMQ/job/ActiveMQ-Artemis-Master-JDK8/ws/artemis-ra/pom.xml> to org.apache.activemq/artemis-ra/2.16.0-SNAPSHOT/artemis-ra-2.16.0-SNAPSHOT.pom
[JENKINS] Archiving <https://ci-builds.apache.org/job/ActiveMQ/job/ActiveMQ-Artemis-Master-JDK8/ws/artemis-ra/target/artemis-ra-2.16.0-SNAPSHOT.jar> to org.apache.activemq/artemis-ra/2.16.0-SNAPSHOT/artemis-ra-2.16.0-SNAPSHOT.jar
[JENKINS] Archiving <https://ci-builds.apache.org/job/ActiveMQ/job/ActiveMQ-Artemis-Master-JDK8/ws/artemis-ra/target/artemis-ra-2.16.0-SNAPSHOT-sources.jar> to org.apache.activemq/artemis-ra/2.16.0-SNAPSHOT/artemis-ra-2.16.0-SNAPSHOT-sources.jar
[JENKINS] Archiving <https://ci-builds.apache.org/job/ActiveMQ/job/ActiveMQ-Artemis-Master-JDK8/ws/pom.xml> to org.apache.activemq/artemis-pom/2.16.0-SNAPSHOT/artemis-pom-2.16.0-SNAPSHOT.pom
[Fast Archiver] Compressed 79.58 KB of artifacts by 80.4% relative to #59
[JENKINS] Archiving <https://ci-builds.apache.org/job/ActiveMQ/job/ActiveMQ-Artemis-Master-JDK8/ws/artemis-tools/pom.xml> to org.apache.activemq/artemis-tools/2.16.0-SNAPSHOT/artemis-tools-2.16.0-SNAPSHOT.pom
[JENKINS] Archiving <https://ci-builds.apache.org/job/ActiveMQ/job/ActiveMQ-Artemis-Master-JDK8/ws/artemis-tools/target/artemis-tools-2.16.0-SNAPSHOT.jar> to org.apache.activemq/artemis-tools/2.16.0-SNAPSHOT/artemis-tools-2.16.0-SNAPSHOT.jar
[JENKINS] Archiving <https://ci-builds.apache.org/job/ActiveMQ/job/ActiveMQ-Artemis-Master-JDK8/ws/artemis-tools/target/artemis-tools-2.16.0-SNAPSHOT-sources.jar> to org.apache.activemq/artemis-tools/2.16.0-SNAPSHOT/artemis-tools-2.16.0-SNAPSHOT-sources.jar
[JENKINS] Archiving <https://ci-builds.apache.org/job/ActiveMQ/job/ActiveMQ-Artemis-Master-JDK8/ws/tests/karaf-client-integration-tests/pom.xml> to org.apache.activemq.tests/karaf-client-integration-tests/2.16.0-SNAPSHOT/karaf-client-integration-tests-2.16.0-SNAPSHOT.pom
[JENKINS] Archiving <https://ci-builds.apache.org/job/ActiveMQ/job/ActiveMQ-Artemis-Master-JDK8/ws/tests/karaf-client-integration-tests/target/karaf-client-integration-tests-2.16.0-SNAPSHOT.jar> to org.apache.activemq.tests/karaf-client-integration-tests/2.16.0-SNAPSHOT/karaf-client-integration-tests-2.16.0-SNAPSHOT.jar
[JENKINS] Archiving <https://ci-builds.apache.org/job/ActiveMQ/job/ActiveMQ-Artemis-Master-JDK8/ws/tests/karaf-client-integration-tests/target/karaf-client-integration-tests-2.16.0-SNAPSHOT-sources.jar> to org.apache.activemq.tests/karaf-client-integration-tests/2.16.0-SNAPSHOT/karaf-client-integration-tests-2.16.0-SNAPSHOT-sources.jar
[JENKINS] Archiving <https://ci-builds.apache.org/job/ActiveMQ/job/ActiveMQ-Artemis-Master-JDK8/ws/artemis-maven-plugin/pom.xml> to org.apache.activemq/artemis-maven-plugin/2.16.0-SNAPSHOT/artemis-maven-plugin-2.16.0-SNAPSHOT.pom
[JENKINS] Archiving <https://ci-builds.apache.org/job/ActiveMQ/job/ActiveMQ-Artemis-Master-JDK8/ws/artemis-maven-plugin/target/artemis-maven-plugin-2.16.0-SNAPSHOT.jar> to org.apache.activemq/artemis-maven-plugin/2.16.0-SNAPSHOT/artemis-maven-plugin-2.16.0-SNAPSHOT.jar
[JENKINS] Archiving <https://ci-builds.apache.org/job/ActiveMQ/job/ActiveMQ-Artemis-Master-JDK8/ws/artemis-maven-plugin/target/artemis-maven-plugin-2.16.0-SNAPSHOT-sources.jar> to org.apache.activemq/artemis-maven-plugin/2.16.0-SNAPSHOT/artemis-maven-plugin-2.16.0-SNAPSHOT-sources.jar
[JENKINS] Archiving <https://ci-builds.apache.org/job/ActiveMQ/job/ActiveMQ-Artemis-Master-JDK8/ws/artemis-junit/pom.xml> to org.apache.activemq/artemis-junit/2.16.0-SNAPSHOT/artemis-junit-2.16.0-SNAPSHOT.pom
[JENKINS] Archiving <https://ci-builds.apache.org/job/ActiveMQ/job/ActiveMQ-Artemis-Master-JDK8/ws/artemis-junit/target/artemis-junit-2.16.0-SNAPSHOT.jar> to org.apache.activemq/artemis-junit/2.16.0-SNAPSHOT/artemis-junit-2.16.0-SNAPSHOT.jar
[JENKINS] Archiving <https://ci-builds.apache.org/job/ActiveMQ/job/ActiveMQ-Artemis-Master-JDK8/ws/artemis-junit/target/artemis-junit-2.16.0-SNAPSHOT-sources.jar> to org.apache.activemq/artemis-junit/2.16.0-SNAPSHOT/artemis-junit-2.16.0-SNAPSHOT-sources.jar
[JENKINS] Archiving <https://ci-builds.apache.org/job/ActiveMQ/job/ActiveMQ-Artemis-Master-JDK8/ws/artemis-service-extensions/pom.xml> to org.apache.activemq/artemis-service-extensions/2.16.0-SNAPSHOT/artemis-service-extensions-2.16.0-SNAPSHOT.pom
[JENKINS] Archiving <https://ci-builds.apache.org/job/ActiveMQ/job/ActiveMQ-Artemis-Master-JDK8/ws/artemis-service-extensions/target/artemis-service-extensions-2.16.0-SNAPSHOT.jar> to org.apache.activemq/artemis-service-extensions/2.16.0-SNAPSHOT/artemis-service-extensions-2.16.0-SNAPSHOT.jar
[JENKINS] Archiving <https://ci-builds.apache.org/job/ActiveMQ/job/ActiveMQ-Artemis-Master-JDK8/ws/artemis-service-extensions/target/artemis-service-extensions-2.16.0-SNAPSHOT-sources.jar> to org.apache.activemq/artemis-service-extensions/2.16.0-SNAPSHOT/artemis-service-extensions-2.16.0-SNAPSHOT-sources.jar
[JENKINS] Archiving <https://ci-builds.apache.org/job/ActiveMQ/job/ActiveMQ-Artemis-Master-JDK8/ws/artemis-server-osgi/pom.xml> to org.apache.activemq/artemis-server-osgi/2.16.0-SNAPSHOT/artemis-server-osgi-2.16.0-SNAPSHOT.pom
[JENKINS] Archiving <https://ci-builds.apache.org/job/ActiveMQ/job/ActiveMQ-Artemis-Master-JDK8/ws/artemis-server-osgi/target/artemis-server-osgi-2.16.0-SNAPSHOT.jar> to org.apache.activemq/artemis-server-osgi/2.16.0-SNAPSHOT/artemis-server-osgi-2.16.0-SNAPSHOT.jar
[JENKINS] Archiving <https://ci-builds.apache.org/job/ActiveMQ/job/ActiveMQ-Artemis-Master-JDK8/ws/artemis-server-osgi/target/artemis-server-osgi-2.16.0-SNAPSHOT-sources.jar> to org.apache.activemq/artemis-server-osgi/2.16.0-SNAPSHOT/artemis-server-osgi-2.16.0-SNAPSHOT-sources.jar
[JENKINS] Archiving <https://ci-builds.apache.org/job/ActiveMQ/job/ActiveMQ-Artemis-Master-JDK8/ws/tests/unit-tests/pom.xml> to org.apache.activemq.tests/unit-tests/2.16.0-SNAPSHOT/unit-tests-2.16.0-SNAPSHOT.pom
[JENKINS] Archiving <https://ci-builds.apache.org/job/ActiveMQ/job/ActiveMQ-Artemis-Master-JDK8/ws/tests/unit-tests/target/unit-tests-2.16.0-SNAPSHOT.jar> to org.apache.activemq.tests/unit-tests/2.16.0-SNAPSHOT/unit-tests-2.16.0-SNAPSHOT.jar
[JENKINS] Archiving <https://ci-builds.apache.org/job/ActiveMQ/job/ActiveMQ-Artemis-Master-JDK8/ws/tests/unit-tests/target/unit-tests-2.16.0-SNAPSHOT-tests.jar> to org.apache.activemq.tests/unit-tests/2.16.0-SNAPSHOT/unit-tests-2.16.0-SNAPSHOT-tests.jar
[JENKINS] Archiving <https://ci-builds.apache.org/job/ActiveMQ/job/ActiveMQ-Artemis-Master-JDK8/ws/tests/unit-tests/target/unit-tests-2.16.0-SNAPSHOT-sources.jar> to org.apache.activemq.tests/unit-tests/2.16.0-SNAPSHOT/unit-tests-2.16.0-SNAPSHOT-sources.jar
[JENKINS] Archiving <https://ci-builds.apache.org/job/ActiveMQ/job/ActiveMQ-Artemis-Master-JDK8/ws/artemis-protocols/artemis-stomp-protocol/pom.xml> to org.apache.activemq/artemis-stomp-protocol/2.16.0-SNAPSHOT/artemis-stomp-protocol-2.16.0-SNAPSHOT.pom
[JENKINS] Archiving <https://ci-builds.apache.org/job/ActiveMQ/job/ActiveMQ-Artemis-Master-JDK8/ws/artemis-protocols/artemis-stomp-protocol/target/artemis-stomp-protocol-2.16.0-SNAPSHOT.jar> to org.apache.activemq/artemis-stomp-protocol/2.16.0-SNAPSHOT/artemis-stomp-protocol-2.16.0-SNAPSHOT.jar
[JENKINS] Archiving <https://ci-builds.apache.org/job/ActiveMQ/job/ActiveMQ-Artemis-Master-JDK8/ws/artemis-protocols/artemis-stomp-protocol/target/artemis-stomp-protocol-2.16.0-SNAPSHOT-sources.jar> to org.apache.activemq/artemis-stomp-protocol/2.16.0-SNAPSHOT/artemis-stomp-protocol-2.16.0-SNAPSHOT-sources.jar
[JENKINS] Archiving <https://ci-builds.apache.org/job/ActiveMQ/job/ActiveMQ-Artemis-Master-JDK8/ws/artemis-rest/pom.xml> to org.apache.activemq.rest/artemis-rest/2.16.0-SNAPSHOT/artemis-rest-2.16.0-SNAPSHOT.pom
[JENKINS] Archiving <https://ci-builds.apache.org/job/ActiveMQ/job/ActiveMQ-Artemis-Master-JDK8/ws/artemis-rest/target/artemis-rest-2.16.0-SNAPSHOT.jar> to org.apache.activemq.rest/artemis-rest/2.16.0-SNAPSHOT/artemis-rest-2.16.0-SNAPSHOT.jar
[JENKINS] Archiving <https://ci-builds.apache.org/job/ActiveMQ/job/ActiveMQ-Artemis-Master-JDK8/ws/artemis-rest/target/artemis-rest-2.16.0-SNAPSHOT-sources.jar> to org.apache.activemq.rest/artemis-rest/2.16.0-SNAPSHOT/artemis-rest-2.16.0-SNAPSHOT-sources.jar
[JENKINS] Archiving <https://ci-builds.apache.org/job/ActiveMQ/job/ActiveMQ-Artemis-Master-JDK8/ws/artemis-protocols/artemis-hornetq-protocol/pom.xml> to org.apache.activemq/artemis-hornetq-protocol/2.16.0-SNAPSHOT/artemis-hornetq-protocol-2.16.0-SNAPSHOT.pom
[JENKINS] Archiving <https://ci-builds.apache.org/job/ActiveMQ/job/ActiveMQ-Artemis-Master-JDK8/ws/artemis-protocols/artemis-hornetq-protocol/target/artemis-hornetq-protocol-2.16.0-SNAPSHOT.jar> to org.apache.activemq/artemis-hornetq-protocol/2.16.0-SNAPSHOT/artemis-hornetq-protocol-2.16.0-SNAPSHOT.jar
[JENKINS] Archiving <https://ci-builds.apache.org/job/ActiveMQ/job/ActiveMQ-Artemis-Master-JDK8/ws/artemis-protocols/artemis-hornetq-protocol/target/artemis-hornetq-protocol-2.16.0-SNAPSHOT-sources.jar> to org.apache.activemq/artemis-hornetq-protocol/2.16.0-SNAPSHOT/artemis-hornetq-protocol-2.16.0-SNAPSHOT-sources.jar
[JENKINS] Archiving <https://ci-builds.apache.org/job/ActiveMQ/job/ActiveMQ-Artemis-Master-JDK8/ws/artemis-core-client-osgi/pom.xml> to org.apache.activemq/artemis-core-client-osgi/2.16.0-SNAPSHOT/artemis-core-client-osgi-2.16.0-SNAPSHOT.pom
[JENKINS] Archiving <https://ci-builds.apache.org/job/ActiveMQ/job/ActiveMQ-Artemis-Master-JDK8/ws/artemis-core-client-osgi/target/artemis-core-client-osgi-2.16.0-SNAPSHOT.jar> to org.apache.activemq/artemis-core-client-osgi/2.16.0-SNAPSHOT/artemis-core-client-osgi-2.16.0-SNAPSHOT.jar
[JENKINS] Archiving <https://ci-builds.apache.org/job/ActiveMQ/job/ActiveMQ-Artemis-Master-JDK8/ws/artemis-core-client-osgi/target/artemis-core-client-osgi-2.16.0-SNAPSHOT-sources.jar> to org.apache.activemq/artemis-core-client-osgi/2.16.0-SNAPSHOT/artemis-core-client-osgi-2.16.0-SNAPSHOT-sources.jar
[JENKINS] Archiving <https://ci-builds.apache.org/job/ActiveMQ/job/ActiveMQ-Artemis-Master-JDK8/ws/tests/performance-tests/pom.xml> to org.apache.activemq.tests/performance-tests/2.16.0-SNAPSHOT/performance-tests-2.16.0-SNAPSHOT.pom
[JENKINS] Archiving <https://ci-builds.apache.org/job/ActiveMQ/job/ActiveMQ-Artemis-Master-JDK8/ws/artemis-features/pom.xml> to org.apache.activemq/artemis-features/2.16.0-SNAPSHOT/artemis-features-2.16.0-SNAPSHOT.pom
[JENKINS] Archiving <https://ci-builds.apache.org/job/ActiveMQ/job/ActiveMQ-Artemis-Master-JDK8/ws/artemis-features/target/classes/features.xml> to org.apache.activemq/artemis-features/2.16.0-SNAPSHOT/artemis-features-2.16.0-SNAPSHOT-features.xml
[JENKINS] Archiving <https://ci-builds.apache.org/job/ActiveMQ/job/ActiveMQ-Artemis-Master-JDK8/ws/artemis-features/target/classes/artemis.xml> to org.apache.activemq/artemis-features/2.16.0-SNAPSHOT/artemis-features-2.16.0-SNAPSHOT-artemis.xml
[JENKINS] Archiving <https://ci-builds.apache.org/job/ActiveMQ/job/ActiveMQ-Artemis-Master-JDK8/ws/artemis-features/target/classes/org.apache.activemq.artemis.cfg> to org.apache.activemq/artemis-features/2.16.0-SNAPSHOT/artemis-features-2.16.0-SNAPSHOT.cfg
[JENKINS] Archiving <https://ci-builds.apache.org/job/ActiveMQ/job/ActiveMQ-Artemis-Master-JDK8/ws/artemis-commons/pom.xml> to org.apache.activemq/artemis-commons/2.16.0-SNAPSHOT/artemis-commons-2.16.0-SNAPSHOT.pom
[JENKINS] Archiving <https://ci-builds.apache.org/job/ActiveMQ/job/ActiveMQ-Artemis-Master-JDK8/ws/artemis-commons/target/artemis-commons-2.16.0-SNAPSHOT.jar> to org.apache.activemq/artemis-commons/2.16.0-SNAPSHOT/artemis-commons-2.16.0-SNAPSHOT.jar
[JENKINS] Archiving <https://ci-builds.apache.org/job/ActiveMQ/job/ActiveMQ-Artemis-Master-JDK8/ws/artemis-commons/target/artemis-commons-2.16.0-SNAPSHOT-tests.jar> to org.apache.activemq/artemis-commons/2.16.0-SNAPSHOT/artemis-commons-2.16.0-SNAPSHOT-tests.jar
[JENKINS] Archiving <https://ci-builds.apache.org/job/ActiveMQ/job/ActiveMQ-Artemis-Master-JDK8/ws/artemis-commons/target/artemis-commons-2.16.0-SNAPSHOT-sources.jar> to org.apache.activemq/artemis-commons/2.16.0-SNAPSHOT/artemis-commons-2.16.0-SNAPSHOT-sources.jar
[JENKINS] Archiving <https://ci-builds.apache.org/job/ActiveMQ/job/ActiveMQ-Artemis-Master-JDK8/ws/artemis-journal/pom.xml> to org.apache.activemq/artemis-journal/2.16.0-SNAPSHOT/artemis-journal-2.16.0-SNAPSHOT.pom
[JENKINS] Archiving <https://ci-builds.apache.org/job/ActiveMQ/job/ActiveMQ-Artemis-Master-JDK8/ws/artemis-journal/target/artemis-journal-2.16.0-SNAPSHOT.jar> to org.apache.activemq/artemis-journal/2.16.0-SNAPSHOT/artemis-journal-2.16.0-SNAPSHOT.jar
[JENKINS] Archiving <https://ci-builds.apache.org/job/ActiveMQ/job/ActiveMQ-Artemis-Master-JDK8/ws/artemis-journal/target/artemis-journal-2.16.0-SNAPSHOT-sources.jar> to org.apache.activemq/artemis-journal/2.16.0-SNAPSHOT/artemis-journal-2.16.0-SNAPSHOT-sources.jar
[JENKINS] Archiving <https://ci-builds.apache.org/job/ActiveMQ/job/ActiveMQ-Artemis-Master-JDK8/ws/tests/soak-tests/pom.xml> to org.apache.activemq.tests/soak-tests/2.16.0-SNAPSHOT/soak-tests-2.16.0-SNAPSHOT.pom
[JENKINS] Archiving <https://ci-builds.apache.org/job/ActiveMQ/job/ActiveMQ-Artemis-Master-JDK8/ws/artemis-core-client/pom.xml> to org.apache.activemq/artemis-core-client/2.16.0-SNAPSHOT/artemis-core-client-2.16.0-SNAPSHOT.pom
[JENKINS] Archiving <https://ci-builds.apache.org/job/ActiveMQ/job/ActiveMQ-Artemis-Master-JDK8/ws/artemis-core-client/target/artemis-core-client-2.16.0-SNAPSHOT.jar> to org.apache.activemq/artemis-core-client/2.16.0-SNAPSHOT/artemis-core-client-2.16.0-SNAPSHOT.jar
[JENKINS] Archiving <https://ci-builds.apache.org/job/ActiveMQ/job/ActiveMQ-Artemis-Master-JDK8/ws/artemis-core-client/target/artemis-core-client-2.16.0-SNAPSHOT-tests.jar> to org.apache.activemq/artemis-core-client/2.16.0-SNAPSHOT/artemis-core-client-2.16.0-SNAPSHOT-tests.jar
[JENKINS] Archiving <https://ci-builds.apache.org/job/ActiveMQ/job/ActiveMQ-Artemis-Master-JDK8/ws/artemis-core-client/target/artemis-core-client-2.16.0-SNAPSHOT-sources.jar> to org.apache.activemq/artemis-core-client/2.16.0-SNAPSHOT/artemis-core-client-2.16.0-SNAPSHOT-sources.jar
[JENKINS] Archiving <https://ci-builds.apache.org/job/ActiveMQ/job/ActiveMQ-Artemis-Master-JDK8/ws/tests/timing-tests/pom.xml> to org.apache.activemq.tests/timing-tests/2.16.0-SNAPSHOT/timing-tests-2.16.0-SNAPSHOT.pom
[JENKINS] Archiving <https://ci-builds.apache.org/job/ActiveMQ/job/ActiveMQ-Artemis-Master-JDK8/ws/tests/timing-tests/target/timing-tests-2.16.0-SNAPSHOT.jar> to org.apache.activemq.tests/timing-tests/2.16.0-SNAPSHOT/timing-tests-2.16.0-SNAPSHOT.jar
[JENKINS] Archiving <https://ci-builds.apache.org/job/ActiveMQ/job/ActiveMQ-Artemis-Master-JDK8/ws/tests/timing-tests/target/timing-tests-2.16.0-SNAPSHOT-sources.jar> to org.apache.activemq.tests/timing-tests/2.16.0-SNAPSHOT/timing-tests-2.16.0-SNAPSHOT-sources.jar
[JENKINS] Archiving <https://ci-builds.apache.org/job/ActiveMQ/job/ActiveMQ-Artemis-Master-JDK8/ws/tests/extra-tests/pom.xml> to org.apache.activemq.tests/extra-tests/2.16.0-SNAPSHOT/extra-tests-2.16.0-SNAPSHOT.pom
[JENKINS] Archiving <https://ci-builds.apache.org/job/ActiveMQ/job/ActiveMQ-Artemis-Master-JDK8/ws/artemis-jms-client-all/dependency-reduced-pom.xml> to org.apache.activemq/artemis-jms-client-all/2.16.0-SNAPSHOT/artemis-jms-client-all-2.16.0-SNAPSHOT.pom
[JENKINS] Archiving <https://ci-builds.apache.org/job/ActiveMQ/job/ActiveMQ-Artemis-Master-JDK8/ws/artemis-jms-client-all/target/artemis-jms-client-all-2.16.0-SNAPSHOT.jar> to org.apache.activemq/artemis-jms-client-all/2.16.0-SNAPSHOT/artemis-jms-client-all-2.16.0-SNAPSHOT.jar
[JENKINS] Archiving <https://ci-builds.apache.org/job/ActiveMQ/job/ActiveMQ-Artemis-Master-JDK8/ws/artemis-jms-client-all/target/artemis-jms-client-all-2.16.0-SNAPSHOT-sources.jar> to org.apache.activemq/artemis-jms-client-all/2.16.0-SNAPSHOT/artemis-jms-client-all-2.16.0-SNAPSHOT-sources.jar
[Fast Archiver] Compressed 13.96 MB of artifacts by 44.3% relative to #59
[JENKINS] Archiving <https://ci-builds.apache.org/job/ActiveMQ/job/ActiveMQ-Artemis-Master-JDK8/ws/artemis-protocols/pom.xml> to org.apache.activemq/artemis-protocols/2.16.0-SNAPSHOT/artemis-protocols-2.16.0-SNAPSHOT.pom
[JENKINS] Archiving <https://ci-builds.apache.org/job/ActiveMQ/job/ActiveMQ-Artemis-Master-JDK8/ws/artemis-hawtio/artemis-plugin/pom.xml> to org.apache.activemq/artemis-plugin/2.16.0-SNAPSHOT/artemis-plugin-2.16.0-SNAPSHOT.pom
[JENKINS] Archiving <https://ci-builds.apache.org/job/ActiveMQ/job/ActiveMQ-Artemis-Master-JDK8/ws/artemis-hawtio/artemis-plugin/target/artemis-plugin-2.16.0-SNAPSHOT.war> to org.apache.activemq/artemis-plugin/2.16.0-SNAPSHOT/artemis-plugin-2.16.0-SNAPSHOT.war
[JENKINS] Archiving <https://ci-builds.apache.org/job/ActiveMQ/job/ActiveMQ-Artemis-Master-JDK8/ws/artemis-hawtio/artemis-plugin/target/artemis-plugin-2.16.0-SNAPSHOT-sources.jar> to org.apache.activemq/artemis-plugin/2.16.0-SNAPSHOT/artemis-plugin-2.16.0-SNAPSHOT-sources.jar
[JENKINS] Archiving <https://ci-builds.apache.org/job/ActiveMQ/job/ActiveMQ-Artemis-Master-JDK8/ws/artemis-dto/pom.xml> to org.apache.activemq/artemis-dto/2.16.0-SNAPSHOT/artemis-dto-2.16.0-SNAPSHOT.pom
[JENKINS] Archiving <https://ci-builds.apache.org/job/ActiveMQ/job/ActiveMQ-Artemis-Master-JDK8/ws/artemis-dto/target/artemis-dto-2.16.0-SNAPSHOT.jar> to org.apache.activemq/artemis-dto/2.16.0-SNAPSHOT/artemis-dto-2.16.0-SNAPSHOT.jar
[JENKINS] Archiving <https://ci-builds.apache.org/job/ActiveMQ/job/ActiveMQ-Artemis-Master-JDK8/ws/artemis-dto/target/artemis-dto-2.16.0-SNAPSHOT-sources.jar> to org.apache.activemq/artemis-dto/2.16.0-SNAPSHOT/artemis-dto-2.16.0-SNAPSHOT-sources.jar
[JENKINS] Archiving <https://ci-builds.apache.org/job/ActiveMQ/job/ActiveMQ-Artemis-Master-JDK8/ws/artemis-protocols/artemis-hqclient-protocol/pom.xml> to org.apache.activemq/artemis-hqclient-protocol/2.16.0-SNAPSHOT/artemis-hqclient-protocol-2.16.0-SNAPSHOT.pom
[JENKINS] Archiving <https://ci-builds.apache.org/job/ActiveMQ/job/ActiveMQ-Artemis-Master-JDK8/ws/artemis-protocols/artemis-hqclient-protocol/target/artemis-hqclient-protocol-2.16.0-SNAPSHOT.jar> to org.apache.activemq/artemis-hqclient-protocol/2.16.0-SNAPSHOT/artemis-hqclient-protocol-2.16.0-SNAPSHOT.jar
[JENKINS] Archiving <https://ci-builds.apache.org/job/ActiveMQ/job/ActiveMQ-Artemis-Master-JDK8/ws/artemis-protocols/artemis-hqclient-protocol/target/artemis-hqclient-protocol-2.16.0-SNAPSHOT-sources.jar> to org.apache.activemq/artemis-hqclient-protocol/2.16.0-SNAPSHOT/artemis-hqclient-protocol-2.16.0-SNAPSHOT-sources.jar
[JENKINS] Archiving <https://ci-builds.apache.org/job/ActiveMQ/job/ActiveMQ-Artemis-Master-JDK8/ws/artemis-jms-client-osgi/pom.xml> to org.apache.activemq/artemis-jms-client-osgi/2.16.0-SNAPSHOT/artemis-jms-client-osgi-2.16.0-SNAPSHOT.pom
[JENKINS] Archiving <https://ci-builds.apache.org/job/ActiveMQ/job/ActiveMQ-Artemis-Master-JDK8/ws/artemis-jms-client-osgi/target/artemis-jms-client-osgi-2.16.0-SNAPSHOT.jar> to org.apache.activemq/artemis-jms-client-osgi/2.16.0-SNAPSHOT/artemis-jms-client-osgi-2.16.0-SNAPSHOT.jar
[JENKINS] Archiving <https://ci-builds.apache.org/job/ActiveMQ/job/ActiveMQ-Artemis-Master-JDK8/ws/artemis-jms-client-osgi/target/artemis-jms-client-osgi-2.16.0-SNAPSHOT-sources.jar> to org.apache.activemq/artemis-jms-client-osgi/2.16.0-SNAPSHOT/artemis-jms-client-osgi-2.16.0-SNAPSHOT-sources.jar
[JENKINS] Archiving <https://ci-builds.apache.org/job/ActiveMQ/job/ActiveMQ-Artemis-Master-JDK8/ws/tests/integration-tests/pom.xml> to org.apache.activemq.tests/integration-tests/2.16.0-SNAPSHOT/integration-tests-2.16.0-SNAPSHOT.pom
[JENKINS] Archiving <https://ci-builds.apache.org/job/ActiveMQ/job/ActiveMQ-Artemis-Master-JDK8/ws/tests/integration-tests/target/integration-tests-2.16.0-SNAPSHOT.jar> to org.apache.activemq.tests/integration-tests/2.16.0-SNAPSHOT/integration-tests-2.16.0-SNAPSHOT.jar
[JENKINS] Archiving <https://ci-builds.apache.org/job/ActiveMQ/job/ActiveMQ-Artemis-Master-JDK8/ws/tests/integration-tests/target/test-classes/rest/rest-test.war> to org.apache.activemq.tests/integration-tests/2.16.0-SNAPSHOT/integration-tests-2.16.0-SNAPSHOT.war
[JENKINS] Archiving <https://ci-builds.apache.org/job/ActiveMQ/job/ActiveMQ-Artemis-Master-JDK8/ws/tests/integration-tests/target/integration-tests-2.16.0-SNAPSHOT-tests.jar> to org.apache.activemq.tests/integration-tests/2.16.0-SNAPSHOT/integration-tests-2.16.0-SNAPSHOT-tests.jar
[JENKINS] Archiving <https://ci-builds.apache.org/job/ActiveMQ/job/ActiveMQ-Artemis-Master-JDK8/ws/tests/integration-tests/target/integration-tests-2.16.0-SNAPSHOT-sources.jar> to org.apache.activemq.tests/integration-tests/2.16.0-SNAPSHOT/integration-tests-2.16.0-SNAPSHOT-sources.jar
[JENKINS] Archiving <https://ci-builds.apache.org/job/ActiveMQ/job/ActiveMQ-Artemis-Master-JDK8/ws/artemis-boot/pom.xml> to org.apache.activemq/artemis-boot/2.16.0-SNAPSHOT/artemis-boot-2.16.0-SNAPSHOT.pom
[JENKINS] Archiving <https://ci-builds.apache.org/job/ActiveMQ/job/ActiveMQ-Artemis-Master-JDK8/ws/artemis-boot/target/artemis-boot-2.16.0-SNAPSHOT.jar> to org.apache.activemq/artemis-boot/2.16.0-SNAPSHOT/artemis-boot-2.16.0-SNAPSHOT.jar
[JENKINS] Archiving <https://ci-builds.apache.org/job/ActiveMQ/job/ActiveMQ-Artemis-Master-JDK8/ws/artemis-boot/target/artemis-boot-2.16.0-SNAPSHOT-sources.jar> to org.apache.activemq/artemis-boot/2.16.0-SNAPSHOT/artemis-boot-2.16.0-SNAPSHOT-sources.jar
[JENKINS] Archiving <https://ci-builds.apache.org/job/ActiveMQ/job/ActiveMQ-Artemis-Master-JDK8/ws/artemis-website/pom.xml> to org.apache.activemq/artemis-website/2.16.0-SNAPSHOT/artemis-website-2.16.0-SNAPSHOT.pom
[JENKINS] Archiving <https://ci-builds.apache.org/job/ActiveMQ/job/ActiveMQ-Artemis-Master-JDK8/ws/artemis-website/target/artemis-website-2.16.0-SNAPSHOT.jar> to org.apache.activemq/artemis-website/2.16.0-SNAPSHOT/artemis-website-2.16.0-SNAPSHOT.jar
[JENKINS] Archiving <https://ci-builds.apache.org/job/ActiveMQ/job/ActiveMQ-Artemis-Master-JDK8/ws/artemis-website/target/artemis-website-2.16.0-SNAPSHOT-javadoc.jar> to org.apache.activemq/artemis-website/2.16.0-SNAPSHOT/artemis-website-2.16.0-SNAPSHOT-javadoc.jar
[JENKINS] Archiving <https://ci-builds.apache.org/job/ActiveMQ/job/ActiveMQ-Artemis-Master-JDK8/ws/artemis-website/target/artemis-website-2.16.0-SNAPSHOT-sources.jar> to org.apache.activemq/artemis-website/2.16.0-SNAPSHOT/artemis-website-2.16.0-SNAPSHOT-sources.jar
[JENKINS] Archiving <https://ci-builds.apache.org/job/ActiveMQ/job/ActiveMQ-Artemis-Master-JDK8/ws/artemis-protocols/artemis-amqp-protocol/pom.xml> to org.apache.activemq/artemis-amqp-protocol/2.16.0-SNAPSHOT/artemis-amqp-protocol-2.16.0-SNAPSHOT.pom
[JENKINS] Archiving <https://ci-builds.apache.org/job/ActiveMQ/job/ActiveMQ-Artemis-Master-JDK8/ws/artemis-protocols/artemis-amqp-protocol/target/artemis-amqp-protocol-2.16.0-SNAPSHOT.jar> to org.apache.activemq/artemis-amqp-protocol/2.16.0-SNAPSHOT/artemis-amqp-protocol-2.16.0-SNAPSHOT.jar
[JENKINS] Archiving <https://ci-builds.apache.org/job/ActiveMQ/job/ActiveMQ-Artemis-Master-JDK8/ws/artemis-protocols/artemis-amqp-protocol/target/artemis-amqp-protocol-2.16.0-SNAPSHOT-sources.jar> to org.apache.activemq/artemis-amqp-protocol/2.16.0-SNAPSHOT/artemis-amqp-protocol-2.16.0-SNAPSHOT-sources.jar
[JENKINS] Archiving <https://ci-builds.apache.org/job/ActiveMQ/job/ActiveMQ-Artemis-Master-JDK8/ws/artemis-protocols/artemis-mqtt-protocol/pom.xml> to org.apache.activemq/artemis-mqtt-protocol/2.16.0-SNAPSHOT/artemis-mqtt-protocol-2.16.0-SNAPSHOT.pom
[JENKINS] Archiving <https://ci-builds.apache.org/job/ActiveMQ/job/ActiveMQ-Artemis-Master-JDK8/ws/artemis-protocols/artemis-mqtt-protocol/target/artemis-mqtt-protocol-2.16.0-SNAPSHOT.jar> to org.apache.activemq/artemis-mqtt-protocol/2.16.0-SNAPSHOT/artemis-mqtt-protocol-2.16.0-SNAPSHOT.jar
[JENKINS] Archiving <https://ci-builds.apache.org/job/ActiveMQ/job/ActiveMQ-Artemis-Master-JDK8/ws/artemis-protocols/artemis-mqtt-protocol/target/artemis-mqtt-protocol-2.16.0-SNAPSHOT-sources.jar> to org.apache.activemq/artemis-mqtt-protocol/2.16.0-SNAPSHOT/artemis-mqtt-protocol-2.16.0-SNAPSHOT-sources.jar
[JENKINS] Archiving <https://ci-builds.apache.org/job/ActiveMQ/job/ActiveMQ-Artemis-Master-JDK8/ws/artemis-hawtio/pom.xml> to org.apache.activemq/artemis-hawtio-pom/2.16.0-SNAPSHOT/artemis-hawtio-pom-2.16.0-SNAPSHOT.pom
[JENKINS] Archiving <https://ci-builds.apache.org/job/ActiveMQ/job/ActiveMQ-Artemis-Master-JDK8/ws/tests/stress-tests/pom.xml> to org.apache.activemq.tests/stress-tests/2.16.0-SNAPSHOT/stress-tests-2.16.0-SNAPSHOT.pom
channel stopped

Reply | Threaded
Open this post in threaded view
|

Build failed in Jenkins: ActiveMQ » ActiveMQ-Artemis-Master-JDK8 #61

Apache Jenkins Server-2
See <https://ci-builds.apache.org/job/ActiveMQ/job/ActiveMQ-Artemis-Master-JDK8/61/display/redirect?page=changes>

Changes:

[nigro.fra] ARTEMIS-2928 blocking CallbackCache can be replaced with a JCTools lock-free queue


------------------------------------------
[...truncated 419.69 KB...]
[main] 05:26:28,355 INFO  [org.apache.activemq.artemis.tests.util.ActiveMQTestBase] **** end #test shouldOtherAcquireExpiredLock[create_tables_prior_test=false]() ***
[main] 05:26:28,356 INFO  [org.apache.activemq.artemis.tests.util.ActiveMQTestBase] **** start #test shouldRenewAcquiredLock[create_tables_prior_test=false]() ***
[main] 05:26:36,810 INFO  [org.apache.activemq.artemis.tests.util.ActiveMQTestBase] **** end #test shouldRenewAcquiredLock[create_tables_prior_test=false]() ***
[main] 05:26:36,811 INFO  [org.apache.activemq.artemis.tests.util.ActiveMQTestBase] **** start #test shouldAcquireLock[create_tables_prior_test=false]() ***
[main] 05:26:44,984 INFO  [org.apache.activemq.artemis.tests.util.ActiveMQTestBase] **** end #test shouldAcquireLock[create_tables_prior_test=false]() ***
[main] 05:26:44,984 INFO  [org.apache.activemq.artemis.tests.util.ActiveMQTestBase] **** start #test shouldNotAcquireLockTwice[create_tables_prior_test=false]() ***
[main] 05:26:52,266 INFO  [org.apache.activemq.artemis.tests.util.ActiveMQTestBase] **** end #test shouldNotAcquireLockTwice[create_tables_prior_test=false]() ***
[main] 05:26:52,266 INFO  [org.apache.activemq.artemis.tests.util.ActiveMQTestBase] **** start #test shouldAcquireExpiredLock[create_tables_prior_test=false]() ***
[main] 05:27:02,122 INFO  [org.apache.activemq.artemis.tests.util.ActiveMQTestBase] **** end #test shouldAcquireExpiredLock[create_tables_prior_test=false]() ***
[INFO] Tests run: 20, Failures: 0, Errors: 0, Skipped: 0, Time elapsed: 188.653 s - in org.apache.activemq.artemis.core.server.impl.jdbc.JdbcLeaseLockTest
[INFO] Running org.apache.activemq.artemis.core.server.impl.jdbc.JdbcNodeManagerTest
[main] 05:27:02,133 INFO  [org.apache.activemq.artemis.tests.util.ActiveMQTestBase] **** start #test shouldStartAndStopGracefullyTest[authentication = false]() ***
[main] 05:27:08,657 WARN  [org.apache.activemq.artemis.jdbc.store.drivers.AbstractJDBCDriver] Unable to set a network timeout on the JDBC connection: networkTimeoutExecutor is null
[main] 05:27:09,830 INFO  [org.apache.activemq.artemis.tests.util.ActiveMQTestBase] **** end #test shouldStartAndStopGracefullyTest[authentication = false]() ***
[main] 05:27:09,831 INFO  [org.apache.activemq.artemis.tests.util.ActiveMQTestBase] **** start #test shouldStartAndStopGracefullyTest[authentication = true]() ***
[main] 05:27:16,600 WARN  [org.apache.activemq.artemis.jdbc.store.drivers.AbstractJDBCDriver] Unable to set a network timeout on the JDBC connection: networkTimeoutExecutor is null
[main] 05:27:17,997 INFO  [org.apache.activemq.artemis.tests.util.ActiveMQTestBase] **** end #test shouldStartAndStopGracefullyTest[authentication = true]() ***
[INFO] Tests run: 2, Failures: 0, Errors: 0, Skipped: 0, Time elapsed: 15.869 s - in org.apache.activemq.artemis.core.server.impl.jdbc.JdbcNodeManagerTest
[INFO] Running org.apache.activemq.artemis.core.server.impl.jdbc.JdbcSharedStateManagerTest
[main] 05:27:18,004 INFO  [org.apache.activemq.artemis.tests.util.ActiveMQTestBase] **** start #test shouldStartTwoIfTableNotExist() ***
[main] 05:27:25,761 INFO  [org.apache.activemq.artemis.tests.util.ActiveMQTestBase] **** end #test shouldStartTwoIfTableNotExist() ***
[main] 05:27:25,761 INFO  [org.apache.activemq.artemis.tests.util.ActiveMQTestBase] **** start #test shouldStartIfTableNotExist() ***
[main] 05:27:34,059 INFO  [org.apache.activemq.artemis.tests.util.ActiveMQTestBase] **** end #test shouldStartIfTableNotExist() ***
[main] 05:27:34,060 INFO  [org.apache.activemq.artemis.tests.util.ActiveMQTestBase] **** start #test shouldStartIfTableExistInitialized() ***
[main] 05:27:42,742 INFO  [org.apache.activemq.artemis.tests.util.ActiveMQTestBase] **** end #test shouldStartIfTableExistInitialized() ***
[main] 05:27:42,742 INFO  [org.apache.activemq.artemis.tests.util.ActiveMQTestBase] **** start #test shouldStartIfTableExistEmpty() ***
[main] 05:27:54,503 INFO  [org.apache.activemq.artemis.tests.util.ActiveMQTestBase] **** end #test shouldStartIfTableExistEmpty() ***
[ERROR] Tests run: 4, Failures: 0, Errors: 1, Skipped: 0, Time elapsed: 36.507 s <<< FAILURE! - in org.apache.activemq.artemis.core.server.impl.jdbc.JdbcSharedStateManagerTest
[ERROR] shouldStartIfTableExistEmpty(org.apache.activemq.artemis.core.server.impl.jdbc.JdbcSharedStateManagerTest)  Time elapsed: 11.769 s  <<< ERROR!
java.lang.Exception: test timed out after 10000 milliseconds
        at org.apache.activemq.artemis.core.server.impl.jdbc.JdbcSharedStateManagerTest.shouldStartIfTableExistEmpty(JdbcSharedStateManagerTest.java:77)

[INFO] Running org.apache.activemq.artemis.core.server.journal.JournalStorageManagerConstantTest
[INFO] Tests run: 1, Failures: 0, Errors: 0, Skipped: 0, Time elapsed: 0 s - in org.apache.activemq.artemis.core.server.journal.JournalStorageManagerConstantTest
[INFO] Running org.apache.activemq.artemis.core.server.management.JMXAccessControlListTest
[INFO] Tests run: 15, Failures: 0, Errors: 0, Skipped: 0, Time elapsed: 0.007 s - in org.apache.activemq.artemis.core.server.management.JMXAccessControlListTest
[INFO] Running org.apache.activemq.artemis.core.server.protocol.websocket.WebSocketFrameEncoderTest
[INFO] Tests run: 4, Failures: 0, Errors: 0, Skipped: 0, Time elapsed: 1.331 s - in org.apache.activemq.artemis.core.server.protocol.websocket.WebSocketFrameEncoderTest
[INFO] Running org.apache.activemq.artemis.core.server.protocol.websocket.WebSocketServerHandlerTest
[INFO] Tests run: 3, Failures: 0, Errors: 0, Skipped: 0, Time elapsed: 0.373 s - in org.apache.activemq.artemis.core.server.protocol.websocket.WebSocketServerHandlerTest
[INFO] Running org.apache.activemq.artemis.core.settings.AddressSettingsTest
[main] 05:27:56,251 INFO  [org.apache.activemq.artemis.tests.util.ActiveMQTestBase] **** start #test testMultipleMergeAll() ***
[main] 05:27:56,254 INFO  [org.apache.activemq.artemis.tests.util.ActiveMQTestBase] **** end #test testMultipleMergeAll() ***
[main] 05:27:56,255 INFO  [org.apache.activemq.artemis.tests.util.ActiveMQTestBase] **** start #test testMultipleMerge() ***
[main] 05:27:56,256 INFO  [org.apache.activemq.artemis.tests.util.ActiveMQTestBase] **** end #test testMultipleMerge() ***
[main] 05:27:56,256 INFO  [org.apache.activemq.artemis.tests.util.ActiveMQTestBase] **** start #test testDefaults() ***
[main] 05:27:56,258 INFO  [org.apache.activemq.artemis.tests.util.ActiveMQTestBase] **** end #test testDefaults() ***
[main] 05:27:56,258 INFO  [org.apache.activemq.artemis.tests.util.ActiveMQTestBase] **** start #test testSingleMerge() ***
[main] 05:27:56,260 INFO  [org.apache.activemq.artemis.tests.util.ActiveMQTestBase] **** end #test testSingleMerge() ***
[INFO] Tests run: 4, Failures: 0, Errors: 0, Skipped: 0, Time elapsed: 0.013 s - in org.apache.activemq.artemis.core.settings.AddressSettingsTest
[INFO] Running org.apache.activemq.artemis.core.settings.RepositoryTest
[main] 05:27:56,263 INFO  [org.apache.activemq.artemis.tests.util.ActiveMQTestBase] **** start #test testMultipleWildcards() ***
[main] 05:27:56,268 INFO  [org.apache.activemq.artemis.tests.util.ActiveMQTestBase] **** end #test testMultipleWildcards() ***
[main] 05:27:56,268 INFO  [org.apache.activemq.artemis.tests.util.ActiveMQTestBase] **** start #test testMatchingDocs() ***
[main] 05:27:56,270 INFO  [org.apache.activemq.artemis.tests.util.ActiveMQTestBase] **** end #test testMatchingDocs() ***
[main] 05:27:56,270 INFO  [org.apache.activemq.artemis.tests.util.ActiveMQTestBase] **** start #test testWithoutWildcard() ***
[main] 05:27:56,272 INFO  [org.apache.activemq.artemis.tests.util.ActiveMQTestBase] **** end #test testWithoutWildcard() ***
[main] 05:27:56,272 INFO  [org.apache.activemq.artemis.tests.util.ActiveMQTestBase] **** start #test testSingletwo() ***
[main] 05:27:56,274 INFO  [org.apache.activemq.artemis.tests.util.ActiveMQTestBase] **** end #test testSingletwo() ***
[main] 05:27:56,274 INFO  [org.apache.activemq.artemis.tests.util.ActiveMQTestBase] **** start #test testIllegalMatches() ***
[main] 05:27:56,277 INFO  [org.apache.activemq.artemis.tests.util.ActiveMQTestBase] **** end #test testIllegalMatches() ***
[main] 05:27:56,277 INFO  [org.apache.activemq.artemis.tests.util.ActiveMQTestBase] **** start #test testAddListener() ***
[main] 05:27:56,279 INFO  [org.apache.activemq.artemis.tests.util.ActiveMQTestBase] **** end #test testAddListener() ***
[main] 05:27:56,280 INFO  [org.apache.activemq.artemis.tests.util.ActiveMQTestBase] **** start #test testCacheWithWildcards() ***
[main] 05:27:56,281 INFO  [org.apache.activemq.artemis.tests.util.ActiveMQTestBase] **** end #test testCacheWithWildcards() ***
[main] 05:27:56,282 INFO  [org.apache.activemq.artemis.tests.util.ActiveMQTestBase] **** start #test testDefault() ***
[main] 05:27:56,283 INFO  [org.apache.activemq.artemis.tests.util.ActiveMQTestBase] **** end #test testDefault() ***
[main] 05:27:56,283 INFO  [org.apache.activemq.artemis.tests.util.ActiveMQTestBase] **** start #test testMatchingDocsCustomUnderscorDelimiter() ***
[main] 05:27:56,285 INFO  [org.apache.activemq.artemis.tests.util.ActiveMQTestBase] **** end #test testMatchingDocsCustomUnderscorDelimiter() ***
[main] 05:27:56,286 INFO  [org.apache.activemq.artemis.tests.util.ActiveMQTestBase] **** start #test testSingleMatch() ***
[main] 05:27:56,287 INFO  [org.apache.activemq.artemis.tests.util.ActiveMQTestBase] **** end #test testSingleMatch() ***
[main] 05:27:56,287 INFO  [org.apache.activemq.artemis.tests.util.ActiveMQTestBase] **** start #test testRepositoryMerge() ***
[main] 05:27:56,290 INFO  [org.apache.activemq.artemis.tests.util.ActiveMQTestBase] **** end #test testRepositoryMerge() ***
[main] 05:27:56,291 INFO  [org.apache.activemq.artemis.tests.util.ActiveMQTestBase] **** start #test testMatchingDocsCustomForwardSlashDelimiter() ***
[main] 05:27:56,292 INFO  [org.apache.activemq.artemis.tests.util.ActiveMQTestBase] **** end #test testMatchingDocsCustomForwardSlashDelimiter() ***
[INFO] Tests run: 12, Failures: 0, Errors: 0, Skipped: 0, Time elapsed: 0.029 s - in org.apache.activemq.artemis.core.settings.RepositoryTest
[INFO] Running org.apache.activemq.artemis.core.transaction.impl.TransactionImplTest
[main] 05:27:56,296 INFO  [org.apache.activemq.artemis.tests.util.ActiveMQTestBase] **** start #test testTimeoutThenRollbackWithRollback() ***
[main] 05:27:56,304 INFO  [org.apache.activemq.artemis.tests.util.ActiveMQTestBase] **** end #test testTimeoutThenRollbackWithRollback() ***
[main] 05:27:56,305 INFO  [org.apache.activemq.artemis.tests.util.ActiveMQTestBase] **** start #test testTimeoutAndThenCommitWithARollback() ***
[main] 05:27:56,307 INFO  [org.apache.activemq.artemis.tests.util.ActiveMQTestBase] **** end #test testTimeoutAndThenCommitWithARollback() ***
[INFO] Tests run: 2, Failures: 0, Errors: 0, Skipped: 0, Time elapsed: 0.011 s - in org.apache.activemq.artemis.core.transaction.impl.TransactionImplTest
[INFO] Running org.apache.activemq.artemis.core.version.impl.VersionImplTest
[INFO] Tests run: 3, Failures: 0, Errors: 0, Skipped: 0, Time elapsed: 0.003 s - in org.apache.activemq.artemis.core.version.impl.VersionImplTest
[INFO] Running org.apache.activemq.artemis.spi.core.security.jaas.Krb5LoginModuleTest
[INFO] Tests run: 2, Failures: 0, Errors: 0, Skipped: 0, Time elapsed: 0 s - in org.apache.activemq.artemis.spi.core.security.jaas.Krb5LoginModuleTest
[INFO] Running org.apache.activemq.artemis.tests.util.SimpleStringTest
[INFO] Tests run: 20, Failures: 0, Errors: 0, Skipped: 0, Time elapsed: 0.651 s - in org.apache.activemq.artemis.tests.util.SimpleStringTest
[INFO] Running org.apache.activemq.artemis.uri.AcceptorParserTest
[INFO] Tests run: 3, Failures: 0, Errors: 0, Skipped: 0, Time elapsed: 0.001 s - in org.apache.activemq.artemis.uri.AcceptorParserTest
[INFO] Running org.apache.activemq.artemis.uri.ClusterConnectionConfigurationTest
[INFO] Tests run: 5, Failures: 0, Errors: 0, Skipped: 0, Time elapsed: 0.003 s - in org.apache.activemq.artemis.uri.ClusterConnectionConfigurationTest
[INFO]
[INFO] Results:
[INFO]
[ERROR] Errors:
[ERROR]   JdbcSharedStateManagerTest.shouldStartIfTableExistEmpty:77 »  test timed out a...
[INFO]
[ERROR] Tests run: 365, Failures: 0, Errors: 1, Skipped: 0
[INFO]
[JENKINS] Recording test results
[INFO] ------------------------------------------------------------------------
[INFO] Reactor Summary for ActiveMQ Artemis Parent 2.16.0-SNAPSHOT:
[INFO]
[INFO] ActiveMQ Artemis Parent ............................ SUCCESS [ 18.066 s]
[INFO] ActiveMQ Artemis Commons ........................... SUCCESS [01:02 min]
[INFO] ActiveMQ Artemis Core Client ....................... SUCCESS [ 30.777 s]
[INFO] ActiveMQ Artemis Selector Implementation ........... SUCCESS [ 11.093 s]
[INFO] ActiveMQ Artemis JMS Client ........................ SUCCESS [ 11.704 s]
[INFO] ActiveMQ Artemis Journal ........................... SUCCESS [ 10.631 s]
[INFO] ActiveMQ Artemis JDBC Store ........................ SUCCESS [ 47.831 s]
[INFO] ActiveMQ Artemis Server ............................ FAILURE [07:11 min]
[INFO] ActiveMQ Artemis Protocols ......................... SKIPPED
[INFO] ActiveMQ Artemis AMQP Protocol ..................... SKIPPED
[INFO] ActiveMQ Artemis STOMP Protocol .................... SKIPPED
[INFO] ActiveMQ Artemis OpenWire Protocol ................. SKIPPED
[INFO] ActiveMQ Artemis HQClient Protocol ................. SKIPPED
[INFO] ActiveMQ Artemis HornetQ Protocol .................. SKIPPED
[INFO] ActiveMQ Artemis Service Extensions ................ SKIPPED
[INFO] ActiveMQ Artemis JMS Server ........................ SKIPPED
[INFO] ActiveMQ Artemis JUnit Rules ....................... SKIPPED
[INFO] ActiveMQ Artemis MQTT Protocol ..................... SKIPPED
[INFO] ActiveMQ Artemis DTO ............................... SKIPPED
[INFO] ActiveMQ Artemis CDI Integration ................... SKIPPED
[INFO] ActiveMQ Artemis Boot .............................. SKIPPED
[INFO] ActiveMQ Artemis Tools ............................. SKIPPED
[INFO] ActiveMQ Artemis CLI ............................... SKIPPED
[INFO] ActiveMQ Artemis Web ............................... SKIPPED
[INFO] ActiveMQ Artemis Web ............................... SKIPPED
[INFO] ActiveMQ Artemis Core Client All ................... SKIPPED
[INFO] ActiveMQ Artemis Client OSGi ....................... SKIPPED
[INFO] ActiveMQ Artemis JMS Client All .................... SKIPPED
[INFO] ActiveMQ Artemis JMS Client OSGi ................... SKIPPED
[INFO] ActiveMQ Artemis RAR POM ........................... SKIPPED
[INFO] ActiveMQ Artemis REST Interface Implementation ..... SKIPPED
[INFO] ActiveMQ Artemis Maven Plugin ...................... SKIPPED
[INFO] ActiveMQ Artemis Server OSGi ....................... SKIPPED
[INFO] ActiveMQ Artemis Cons .............................. SKIPPED
[INFO] ActiveMQ Artemis HawtIO Branding ................... SKIPPED
[INFO] ActiveMQ Artemis HawtIO Plugin ..................... SKIPPED
[INFO] ActiveMQ Artemis Console ........................... SKIPPED
[INFO] ActiveMQ Artemis Spring Integration ................ SKIPPED
[INFO] Apache ActiveMQ Artemis Distribution ............... SKIPPED
[INFO] ActiveMQ Artemis Tests POM ......................... SKIPPED
[INFO] ActiveMQ Artemis Test Support ...................... SKIPPED
[INFO] ActiveMQ Artemis Unit Tests ........................ SKIPPED
[INFO] ActiveMQ Artemis Joram Tests ....................... SKIPPED
[INFO] ActiveMQ Artemis timing Tests ...................... SKIPPED
[INFO] ActiveMQ Artemis JMS Tests ......................... SKIPPED
[INFO] ActiveMQ Artemis Features .......................... SKIPPED
[INFO] ActiveMQ Artemis Integration Tests ................. SKIPPED
[INFO] ActiveMQ Artemis Client Integration Tests .......... SKIPPED
[INFO] ActiveMQ Artemis Compatibility Tests ............... SKIPPED
[INFO] ActiveMQ Artemis soak Tests ........................ SKIPPED
[INFO] ActiveMQ Artemis stress Tests ...................... SKIPPED
[INFO] ActiveMQ Artemis performance Tests ................. SKIPPED
[INFO] Smoke Tests ........................................ SKIPPED
[INFO] ActiveMQ Artemis Extra Tests ....................... SKIPPED
[INFO] ------------------------------------------------------------------------
[INFO] BUILD FAILURE
[INFO] ------------------------------------------------------------------------
[INFO] Total time:  12:04 min
[INFO] Finished at: 2020-10-06T05:29:07Z
[INFO] ------------------------------------------------------------------------
Waiting for Jenkins to finish collecting data[ERROR] Failed to execute goal org.apache.maven.plugins:maven-surefire-plugin:2.22.2:test (default-test) on project artemis-server: There are test failures.
[ERROR]
[ERROR] Please refer to <https://ci-builds.apache.org/job/ActiveMQ/job/ActiveMQ-Artemis-Master-JDK8/ws/artemis-server/target/surefire-reports> for the individual test results.
[ERROR] Please refer to dump files (if any exist) [date].dump, [date]-jvmRun[N].dump and [date].dumpstream.
[ERROR] -> [Help 1]
[ERROR]
[ERROR] To see the full stack trace of the errors, re-run Maven with the -e switch.
[ERROR] Re-run Maven using the -X switch to enable full debug logging.
[ERROR]
[ERROR] For more information about the errors and possible solutions, please read the following articles:
[ERROR] [Help 1] http://cwiki.apache.org/confluence/display/MAVEN/MojoFailureException
[ERROR]
[ERROR] After correcting the problems, you can resume the build with the command
[ERROR]   mvn <goals> -rf :artemis-server

[JENKINS] Archiving <https://ci-builds.apache.org/job/ActiveMQ/job/ActiveMQ-Artemis-Master-JDK8/ws/artemis-server/pom.xml> to org.apache.activemq/artemis-server/2.16.0-SNAPSHOT/artemis-server-2.16.0-SNAPSHOT.pom
[JENKINS] Archiving <https://ci-builds.apache.org/job/ActiveMQ/job/ActiveMQ-Artemis-Master-JDK8/ws/tests/compatibility-tests/pom.xml> to org.apache.activemq.tests/compatibility-tests/2.16.0-SNAPSHOT/compatibility-tests-2.16.0-SNAPSHOT.pom
[JENKINS] Archiving <https://ci-builds.apache.org/job/ActiveMQ/job/ActiveMQ-Artemis-Master-JDK8/ws/artemis-jms-client/pom.xml> to org.apache.activemq/artemis-jms-client/2.16.0-SNAPSHOT/artemis-jms-client-2.16.0-SNAPSHOT.pom
[JENKINS] Archiving <https://ci-builds.apache.org/job/ActiveMQ/job/ActiveMQ-Artemis-Master-JDK8/ws/artemis-jms-client/target/artemis-jms-client-2.16.0-SNAPSHOT.jar> to org.apache.activemq/artemis-jms-client/2.16.0-SNAPSHOT/artemis-jms-client-2.16.0-SNAPSHOT.jar
[JENKINS] Archiving <https://ci-builds.apache.org/job/ActiveMQ/job/ActiveMQ-Artemis-Master-JDK8/ws/artemis-jms-client/target/artemis-jms-client-2.16.0-SNAPSHOT-sources.jar> to org.apache.activemq/artemis-jms-client/2.16.0-SNAPSHOT/artemis-jms-client-2.16.0-SNAPSHOT-sources.jar
[JENKINS] Archiving <https://ci-builds.apache.org/job/ActiveMQ/job/ActiveMQ-Artemis-Master-JDK8/ws/artemis-hawtio/activemq-branding/pom.xml> to org.apache.activemq/activemq-branding/2.16.0-SNAPSHOT/activemq-branding-2.16.0-SNAPSHOT.pom
[JENKINS] Archiving <https://ci-builds.apache.org/job/ActiveMQ/job/ActiveMQ-Artemis-Master-JDK8/ws/tests/smoke-tests/pom.xml> to org.apache.activemq.tests/smoke-tests/2.16.0-SNAPSHOT/smoke-tests-2.16.0-SNAPSHOT.pom
[JENKINS] Archiving <https://ci-builds.apache.org/job/ActiveMQ/job/ActiveMQ-Artemis-Master-JDK8/ws/tests/joram-tests/pom.xml> to org.apache.activemq.tests/joram-tests/2.16.0-SNAPSHOT/joram-tests-2.16.0-SNAPSHOT.pom
[JENKINS] Archiving <https://ci-builds.apache.org/job/ActiveMQ/job/ActiveMQ-Artemis-Master-JDK8/ws/artemis-jms-server/pom.xml> to org.apache.activemq/artemis-jms-server/2.16.0-SNAPSHOT/artemis-jms-server-2.16.0-SNAPSHOT.pom
[JENKINS] Archiving <https://ci-builds.apache.org/job/ActiveMQ/job/ActiveMQ-Artemis-Master-JDK8/ws/artemis-cli/pom.xml> to org.apache.activemq/artemis-cli/2.16.0-SNAPSHOT/artemis-cli-2.16.0-SNAPSHOT.pom
[JENKINS] Archiving <https://ci-builds.apache.org/job/ActiveMQ/job/ActiveMQ-Artemis-Master-JDK8/ws/artemis-core-client-all/pom.xml> to org.apache.activemq/artemis-core-client-all/2.16.0-SNAPSHOT/artemis-core-client-all-2.16.0-SNAPSHOT.pom
[JENKINS] Archiving <https://ci-builds.apache.org/job/ActiveMQ/job/ActiveMQ-Artemis-Master-JDK8/ws/tests/pom.xml> to org.apache.activemq.tests/artemis-tests-pom/2.16.0-SNAPSHOT/artemis-tests-pom-2.16.0-SNAPSHOT.pom
[JENKINS] Archiving <https://ci-builds.apache.org/job/ActiveMQ/job/ActiveMQ-Artemis-Master-JDK8/ws/artemis-protocols/artemis-openwire-protocol/pom.xml> to org.apache.activemq/artemis-openwire-protocol/2.16.0-SNAPSHOT/artemis-openwire-protocol-2.16.0-SNAPSHOT.pom
[JENKINS] Archiving <https://ci-builds.apache.org/job/ActiveMQ/job/ActiveMQ-Artemis-Master-JDK8/ws/artemis-distribution/pom.xml> to org.apache.activemq/apache-artemis/2.16.0-SNAPSHOT/apache-artemis-2.16.0-SNAPSHOT.pom
[JENKINS] Archiving <https://ci-builds.apache.org/job/ActiveMQ/job/ActiveMQ-Artemis-Master-JDK8/ws/artemis-hawtio/artemis-console/pom.xml> to org.apache.activemq/artemis-console/2.16.0-SNAPSHOT/artemis-console-2.16.0-SNAPSHOT.pom
[JENKINS] Archiving <https://ci-builds.apache.org/job/ActiveMQ/job/ActiveMQ-Artemis-Master-JDK8/ws/tests/artemis-test-support/pom.xml> to org.apache.activemq.tests/artemis-test-support/2.16.0-SNAPSHOT/artemis-test-support-2.16.0-SNAPSHOT.pom
[JENKINS] Archiving <https://ci-builds.apache.org/job/ActiveMQ/job/ActiveMQ-Artemis-Master-JDK8/ws/artemis-selector/pom.xml> to org.apache.activemq/artemis-selector/2.16.0-SNAPSHOT/artemis-selector-2.16.0-SNAPSHOT.pom
[JENKINS] Archiving <https://ci-builds.apache.org/job/ActiveMQ/job/ActiveMQ-Artemis-Master-JDK8/ws/artemis-selector/target/artemis-selector-2.16.0-SNAPSHOT.jar> to org.apache.activemq/artemis-selector/2.16.0-SNAPSHOT/artemis-selector-2.16.0-SNAPSHOT.jar
[JENKINS] Archiving <https://ci-builds.apache.org/job/ActiveMQ/job/ActiveMQ-Artemis-Master-JDK8/ws/artemis-selector/target/artemis-selector-2.16.0-SNAPSHOT-sources.jar> to org.apache.activemq/artemis-selector/2.16.0-SNAPSHOT/artemis-selector-2.16.0-SNAPSHOT-sources.jar
[JENKINS] Archiving <https://ci-builds.apache.org/job/ActiveMQ/job/ActiveMQ-Artemis-Master-JDK8/ws/artemis-jdbc-store/pom.xml> to org.apache.activemq/artemis-jdbc-store/2.16.0-SNAPSHOT/artemis-jdbc-store-2.16.0-SNAPSHOT.pom
[JENKINS] Archiving <https://ci-builds.apache.org/job/ActiveMQ/job/ActiveMQ-Artemis-Master-JDK8/ws/artemis-jdbc-store/target/artemis-jdbc-store-2.16.0-SNAPSHOT.jar> to org.apache.activemq/artemis-jdbc-store/2.16.0-SNAPSHOT/artemis-jdbc-store-2.16.0-SNAPSHOT.jar
[JENKINS] Archiving <https://ci-builds.apache.org/job/ActiveMQ/job/ActiveMQ-Artemis-Master-JDK8/ws/artemis-jdbc-store/target/artemis-jdbc-store-2.16.0-SNAPSHOT-sources.jar> to org.apache.activemq/artemis-jdbc-store/2.16.0-SNAPSHOT/artemis-jdbc-store-2.16.0-SNAPSHOT-sources.jar
[JENKINS] Archiving <https://ci-builds.apache.org/job/ActiveMQ/job/ActiveMQ-Artemis-Master-JDK8/ws/integration/activemq-spring-integration/pom.xml> to org.apache.activemq/artemis-spring-integration/2.16.0-SNAPSHOT/artemis-spring-integration-2.16.0-SNAPSHOT.pom
[JENKINS] Archiving <https://ci-builds.apache.org/job/ActiveMQ/job/ActiveMQ-Artemis-Master-JDK8/ws/artemis-web/pom.xml> to org.apache.activemq/artemis-web/2.16.0-SNAPSHOT/artemis-web-2.16.0-SNAPSHOT.pom
[JENKINS] Archiving <https://ci-builds.apache.org/job/ActiveMQ/job/ActiveMQ-Artemis-Master-JDK8/ws/artemis-cdi-client/pom.xml> to org.apache.activemq/artemis-cdi-client/2.16.0-SNAPSHOT/artemis-cdi-client-2.16.0-SNAPSHOT.pom
[JENKINS] Archiving <https://ci-builds.apache.org/job/ActiveMQ/job/ActiveMQ-Artemis-Master-JDK8/ws/tests/jms-tests/pom.xml> to org.apache.activemq.tests/jms-tests/2.16.0-SNAPSHOT/jms-tests-2.16.0-SNAPSHOT.pom
[JENKINS] Archiving <https://ci-builds.apache.org/job/ActiveMQ/job/ActiveMQ-Artemis-Master-JDK8/ws/artemis-ra/pom.xml> to org.apache.activemq/artemis-ra/2.16.0-SNAPSHOT/artemis-ra-2.16.0-SNAPSHOT.pom
[JENKINS] Archiving <https://ci-builds.apache.org/job/ActiveMQ/job/ActiveMQ-Artemis-Master-JDK8/ws/pom.xml> to org.apache.activemq/artemis-pom/2.16.0-SNAPSHOT/artemis-pom-2.16.0-SNAPSHOT.pom
[Fast Archiver] Compressed 79.58 KB of artifacts by 80.4% relative to #60
[JENKINS] Archiving <https://ci-builds.apache.org/job/ActiveMQ/job/ActiveMQ-Artemis-Master-JDK8/ws/artemis-tools/pom.xml> to org.apache.activemq/artemis-tools/2.16.0-SNAPSHOT/artemis-tools-2.16.0-SNAPSHOT.pom
[JENKINS] Archiving <https://ci-builds.apache.org/job/ActiveMQ/job/ActiveMQ-Artemis-Master-JDK8/ws/tests/karaf-client-integration-tests/pom.xml> to org.apache.activemq.tests/karaf-client-integration-tests/2.16.0-SNAPSHOT/karaf-client-integration-tests-2.16.0-SNAPSHOT.pom
[JENKINS] Archiving <https://ci-builds.apache.org/job/ActiveMQ/job/ActiveMQ-Artemis-Master-JDK8/ws/artemis-maven-plugin/pom.xml> to org.apache.activemq/artemis-maven-plugin/2.16.0-SNAPSHOT/artemis-maven-plugin-2.16.0-SNAPSHOT.pom
[JENKINS] Archiving <https://ci-builds.apache.org/job/ActiveMQ/job/ActiveMQ-Artemis-Master-JDK8/ws/artemis-junit/pom.xml> to org.apache.activemq/artemis-junit/2.16.0-SNAPSHOT/artemis-junit-2.16.0-SNAPSHOT.pom
[JENKINS] Archiving <https://ci-builds.apache.org/job/ActiveMQ/job/ActiveMQ-Artemis-Master-JDK8/ws/artemis-service-extensions/pom.xml> to org.apache.activemq/artemis-service-extensions/2.16.0-SNAPSHOT/artemis-service-extensions-2.16.0-SNAPSHOT.pom
[JENKINS] Archiving <https://ci-builds.apache.org/job/ActiveMQ/job/ActiveMQ-Artemis-Master-JDK8/ws/artemis-server-osgi/pom.xml> to org.apache.activemq/artemis-server-osgi/2.16.0-SNAPSHOT/artemis-server-osgi-2.16.0-SNAPSHOT.pom
[JENKINS] Archiving <https://ci-builds.apache.org/job/ActiveMQ/job/ActiveMQ-Artemis-Master-JDK8/ws/tests/unit-tests/pom.xml> to org.apache.activemq.tests/unit-tests/2.16.0-SNAPSHOT/unit-tests-2.16.0-SNAPSHOT.pom
[JENKINS] Archiving <https://ci-builds.apache.org/job/ActiveMQ/job/ActiveMQ-Artemis-Master-JDK8/ws/artemis-protocols/artemis-stomp-protocol/pom.xml> to org.apache.activemq/artemis-stomp-protocol/2.16.0-SNAPSHOT/artemis-stomp-protocol-2.16.0-SNAPSHOT.pom
[JENKINS] Archiving <https://ci-builds.apache.org/job/ActiveMQ/job/ActiveMQ-Artemis-Master-JDK8/ws/artemis-rest/pom.xml> to org.apache.activemq.rest/artemis-rest/2.16.0-SNAPSHOT/artemis-rest-2.16.0-SNAPSHOT.pom
[JENKINS] Archiving <https://ci-builds.apache.org/job/ActiveMQ/job/ActiveMQ-Artemis-Master-JDK8/ws/artemis-protocols/artemis-hornetq-protocol/pom.xml> to org.apache.activemq/artemis-hornetq-protocol/2.16.0-SNAPSHOT/artemis-hornetq-protocol-2.16.0-SNAPSHOT.pom
[JENKINS] Archiving <https://ci-builds.apache.org/job/ActiveMQ/job/ActiveMQ-Artemis-Master-JDK8/ws/artemis-core-client-osgi/pom.xml> to org.apache.activemq/artemis-core-client-osgi/2.16.0-SNAPSHOT/artemis-core-client-osgi-2.16.0-SNAPSHOT.pom
[JENKINS] Archiving <https://ci-builds.apache.org/job/ActiveMQ/job/ActiveMQ-Artemis-Master-JDK8/ws/tests/performance-tests/pom.xml> to org.apache.activemq.tests/performance-tests/2.16.0-SNAPSHOT/performance-tests-2.16.0-SNAPSHOT.pom
[JENKINS] Archiving <https://ci-builds.apache.org/job/ActiveMQ/job/ActiveMQ-Artemis-Master-JDK8/ws/artemis-features/pom.xml> to org.apache.activemq/artemis-features/2.16.0-SNAPSHOT/artemis-features-2.16.0-SNAPSHOT.pom
[JENKINS] Archiving <https://ci-builds.apache.org/job/ActiveMQ/job/ActiveMQ-Artemis-Master-JDK8/ws/artemis-commons/pom.xml> to org.apache.activemq/artemis-commons/2.16.0-SNAPSHOT/artemis-commons-2.16.0-SNAPSHOT.pom
[JENKINS] Archiving <https://ci-builds.apache.org/job/ActiveMQ/job/ActiveMQ-Artemis-Master-JDK8/ws/artemis-commons/target/artemis-commons-2.16.0-SNAPSHOT.jar> to org.apache.activemq/artemis-commons/2.16.0-SNAPSHOT/artemis-commons-2.16.0-SNAPSHOT.jar
[JENKINS] Archiving <https://ci-builds.apache.org/job/ActiveMQ/job/ActiveMQ-Artemis-Master-JDK8/ws/artemis-commons/target/artemis-commons-2.16.0-SNAPSHOT-tests.jar> to org.apache.activemq/artemis-commons/2.16.0-SNAPSHOT/artemis-commons-2.16.0-SNAPSHOT-tests.jar
[JENKINS] Archiving <https://ci-builds.apache.org/job/ActiveMQ/job/ActiveMQ-Artemis-Master-JDK8/ws/artemis-commons/target/artemis-commons-2.16.0-SNAPSHOT-sources.jar> to org.apache.activemq/artemis-commons/2.16.0-SNAPSHOT/artemis-commons-2.16.0-SNAPSHOT-sources.jar
[JENKINS] Archiving <https://ci-builds.apache.org/job/ActiveMQ/job/ActiveMQ-Artemis-Master-JDK8/ws/artemis-journal/pom.xml> to org.apache.activemq/artemis-journal/2.16.0-SNAPSHOT/artemis-journal-2.16.0-SNAPSHOT.pom
[JENKINS] Archiving <https://ci-builds.apache.org/job/ActiveMQ/job/ActiveMQ-Artemis-Master-JDK8/ws/artemis-journal/target/artemis-journal-2.16.0-SNAPSHOT.jar> to org.apache.activemq/artemis-journal/2.16.0-SNAPSHOT/artemis-journal-2.16.0-SNAPSHOT.jar
[JENKINS] Archiving <https://ci-builds.apache.org/job/ActiveMQ/job/ActiveMQ-Artemis-Master-JDK8/ws/artemis-journal/target/artemis-journal-2.16.0-SNAPSHOT-sources.jar> to org.apache.activemq/artemis-journal/2.16.0-SNAPSHOT/artemis-journal-2.16.0-SNAPSHOT-sources.jar
[JENKINS] Archiving <https://ci-builds.apache.org/job/ActiveMQ/job/ActiveMQ-Artemis-Master-JDK8/ws/tests/soak-tests/pom.xml> to org.apache.activemq.tests/soak-tests/2.16.0-SNAPSHOT/soak-tests-2.16.0-SNAPSHOT.pom
[JENKINS] Archiving <https://ci-builds.apache.org/job/ActiveMQ/job/ActiveMQ-Artemis-Master-JDK8/ws/artemis-core-client/pom.xml> to org.apache.activemq/artemis-core-client/2.16.0-SNAPSHOT/artemis-core-client-2.16.0-SNAPSHOT.pom
[JENKINS] Archiving <https://ci-builds.apache.org/job/ActiveMQ/job/ActiveMQ-Artemis-Master-JDK8/ws/artemis-core-client/target/artemis-core-client-2.16.0-SNAPSHOT.jar> to org.apache.activemq/artemis-core-client/2.16.0-SNAPSHOT/artemis-core-client-2.16.0-SNAPSHOT.jar
[JENKINS] Archiving <https://ci-builds.apache.org/job/ActiveMQ/job/ActiveMQ-Artemis-Master-JDK8/ws/artemis-core-client/target/artemis-core-client-2.16.0-SNAPSHOT-tests.jar> to org.apache.activemq/artemis-core-client/2.16.0-SNAPSHOT/artemis-core-client-2.16.0-SNAPSHOT-tests.jar
[JENKINS] Archiving <https://ci-builds.apache.org/job/ActiveMQ/job/ActiveMQ-Artemis-Master-JDK8/ws/artemis-core-client/target/artemis-core-client-2.16.0-SNAPSHOT-sources.jar> to org.apache.activemq/artemis-core-client/2.16.0-SNAPSHOT/artemis-core-client-2.16.0-SNAPSHOT-sources.jar
[JENKINS] Archiving <https://ci-builds.apache.org/job/ActiveMQ/job/ActiveMQ-Artemis-Master-JDK8/ws/tests/timing-tests/pom.xml> to org.apache.activemq.tests/timing-tests/2.16.0-SNAPSHOT/timing-tests-2.16.0-SNAPSHOT.pom
[JENKINS] Archiving <https://ci-builds.apache.org/job/ActiveMQ/job/ActiveMQ-Artemis-Master-JDK8/ws/tests/extra-tests/pom.xml> to org.apache.activemq.tests/extra-tests/2.16.0-SNAPSHOT/extra-tests-2.16.0-SNAPSHOT.pom
[JENKINS] Archiving <https://ci-builds.apache.org/job/ActiveMQ/job/ActiveMQ-Artemis-Master-JDK8/ws/artemis-jms-client-all/pom.xml> to org.apache.activemq/artemis-jms-client-all/2.16.0-SNAPSHOT/artemis-jms-client-all-2.16.0-SNAPSHOT.pom
[JENKINS] Archiving <https://ci-builds.apache.org/job/ActiveMQ/job/ActiveMQ-Artemis-Master-JDK8/ws/artemis-protocols/pom.xml> to org.apache.activemq/artemis-protocols/2.16.0-SNAPSHOT/artemis-protocols-2.16.0-SNAPSHOT.pom
[JENKINS] Archiving <https://ci-builds.apache.org/job/ActiveMQ/job/ActiveMQ-Artemis-Master-JDK8/ws/artemis-hawtio/artemis-plugin/pom.xml> to org.apache.activemq/artemis-plugin/2.16.0-SNAPSHOT/artemis-plugin-2.16.0-SNAPSHOT.pom
[JENKINS] Archiving <https://ci-builds.apache.org/job/ActiveMQ/job/ActiveMQ-Artemis-Master-JDK8/ws/artemis-dto/pom.xml> to org.apache.activemq/artemis-dto/2.16.0-SNAPSHOT/artemis-dto-2.16.0-SNAPSHOT.pom
[JENKINS] Archiving <https://ci-builds.apache.org/job/ActiveMQ/job/ActiveMQ-Artemis-Master-JDK8/ws/artemis-protocols/artemis-hqclient-protocol/pom.xml> to org.apache.activemq/artemis-hqclient-protocol/2.16.0-SNAPSHOT/artemis-hqclient-protocol-2.16.0-SNAPSHOT.pom
[JENKINS] Archiving <https://ci-builds.apache.org/job/ActiveMQ/job/ActiveMQ-Artemis-Master-JDK8/ws/artemis-jms-client-osgi/pom.xml> to org.apache.activemq/artemis-jms-client-osgi/2.16.0-SNAPSHOT/artemis-jms-client-osgi-2.16.0-SNAPSHOT.pom
[JENKINS] Archiving <https://ci-builds.apache.org/job/ActiveMQ/job/ActiveMQ-Artemis-Master-JDK8/ws/tests/integration-tests/pom.xml> to org.apache.activemq.tests/integration-tests/2.16.0-SNAPSHOT/integration-tests-2.16.0-SNAPSHOT.pom
[JENKINS] Archiving <https://ci-builds.apache.org/job/ActiveMQ/job/ActiveMQ-Artemis-Master-JDK8/ws/artemis-boot/pom.xml> to org.apache.activemq/artemis-boot/2.16.0-SNAPSHOT/artemis-boot-2.16.0-SNAPSHOT.pom
[JENKINS] Archiving <https://ci-builds.apache.org/job/ActiveMQ/job/ActiveMQ-Artemis-Master-JDK8/ws/artemis-website/pom.xml> to org.apache.activemq/artemis-website/2.16.0-SNAPSHOT/artemis-website-2.16.0-SNAPSHOT.pom
[JENKINS] Archiving <https://ci-builds.apache.org/job/ActiveMQ/job/ActiveMQ-Artemis-Master-JDK8/ws/artemis-protocols/artemis-amqp-protocol/pom.xml> to org.apache.activemq/artemis-amqp-protocol/2.16.0-SNAPSHOT/artemis-amqp-protocol-2.16.0-SNAPSHOT.pom
[JENKINS] Archiving <https://ci-builds.apache.org/job/ActiveMQ/job/ActiveMQ-Artemis-Master-JDK8/ws/artemis-protocols/artemis-mqtt-protocol/pom.xml> to org.apache.activemq/artemis-mqtt-protocol/2.16.0-SNAPSHOT/artemis-mqtt-protocol-2.16.0-SNAPSHOT.pom
[JENKINS] Archiving <https://ci-builds.apache.org/job/ActiveMQ/job/ActiveMQ-Artemis-Master-JDK8/ws/artemis-hawtio/pom.xml> to org.apache.activemq/artemis-hawtio-pom/2.16.0-SNAPSHOT/artemis-hawtio-pom-2.16.0-SNAPSHOT.pom
[JENKINS] Archiving <https://ci-builds.apache.org/job/ActiveMQ/job/ActiveMQ-Artemis-Master-JDK8/ws/tests/stress-tests/pom.xml> to org.apache.activemq.tests/stress-tests/2.16.0-SNAPSHOT/stress-tests-2.16.0-SNAPSHOT.pom
channel stopped
Reply | Threaded
Open this post in threaded view
|

Jenkins build is back to normal : ActiveMQ » ActiveMQ-Artemis-Master-JDK8 #62

Apache Jenkins Server-2