Build failed in Jenkins: ActiveMQ » ActiveMQ-Artemis-Master-JDK8 #57

Previous Topic Next Topic
 
classic Classic list List threaded Threaded
2 messages Options
Reply | Threaded
Open this post in threaded view
|

Build failed in Jenkins: ActiveMQ » ActiveMQ-Artemis-Master-JDK8 #57

Apache Jenkins Server-2
See <https://ci-builds.apache.org/job/ActiveMQ/job/ActiveMQ-Artemis-Master-JDK8/57/display/redirect?page=changes>

Changes:

[Justin Bertram] NO-JIRA higher quality logos


------------------------------------------
[...truncated 698.08 KB...]
Caused by: org.apache.derby.iapi.error.StandardException: Derby system shutdown.
        at org.apache.activemq.artemis.core.server.impl.jdbc.JdbcSharedStateManagerTest.createSharedStateManager(JdbcSharedStateManagerTest.java:52)
        at org.apache.activemq.artemis.core.server.impl.jdbc.JdbcSharedStateManagerTest.shouldStartIfTableNotExist(JdbcSharedStateManagerTest.java:62)

[ERROR] shouldStartIfTableExistInitialized(org.apache.activemq.artemis.core.server.impl.jdbc.JdbcSharedStateManagerTest)  Time elapsed: 0.006 s  <<< ERROR!
java.sql.SQLException: Failed to create database '<https://ci-builds.apache.org/job/ActiveMQ/job/ActiveMQ-Artemis-Master-JDK8/ws/artemis-server/./target/tmp/JdbcSharedStateManagerTest/junit1119843902090330443/derby',> see the next exception for details.
        at org.apache.activemq.artemis.core.server.impl.jdbc.JdbcSharedStateManagerTest.shouldStartIfTableExistInitialized(JdbcSharedStateManagerTest.java:86)
Caused by: org.apache.derby.iapi.error.StandardException: Failed to create database '<https://ci-builds.apache.org/job/ActiveMQ/job/ActiveMQ-Artemis-Master-JDK8/ws/artemis-server/./target/tmp/JdbcSharedStateManagerTest/junit1119843902090330443/derby',> see the next exception for details.
        at org.apache.activemq.artemis.core.server.impl.jdbc.JdbcSharedStateManagerTest.shouldStartIfTableExistInitialized(JdbcSharedStateManagerTest.java:86)
Caused by: org.apache.derby.iapi.error.StandardException: Startup failed due to an exception. See next exception for details.
        at org.apache.activemq.artemis.core.server.impl.jdbc.JdbcSharedStateManagerTest.shouldStartIfTableExistInitialized(JdbcSharedStateManagerTest.java:86)
Caused by: org.apache.derby.iapi.error.StandardException: Derby system shutdown.
        at org.apache.activemq.artemis.core.server.impl.jdbc.JdbcSharedStateManagerTest.shouldStartIfTableExistInitialized(JdbcSharedStateManagerTest.java:86)

[ERROR] shouldStartIfTableExistEmpty(org.apache.activemq.artemis.core.server.impl.jdbc.JdbcSharedStateManagerTest)  Time elapsed: 0.007 s  <<< ERROR!
java.sql.SQLException: Failed to create database '<https://ci-builds.apache.org/job/ActiveMQ/job/ActiveMQ-Artemis-Master-JDK8/ws/artemis-server/./target/tmp/JdbcSharedStateManagerTest/junit1173069243130049399/derby',> see the next exception for details.
        at org.apache.activemq.artemis.core.server.impl.jdbc.JdbcSharedStateManagerTest.shouldStartIfTableExistEmpty(JdbcSharedStateManagerTest.java:73)
Caused by: org.apache.derby.iapi.error.StandardException: Failed to create database '<https://ci-builds.apache.org/job/ActiveMQ/job/ActiveMQ-Artemis-Master-JDK8/ws/artemis-server/./target/tmp/JdbcSharedStateManagerTest/junit1173069243130049399/derby',> see the next exception for details.
        at org.apache.activemq.artemis.core.server.impl.jdbc.JdbcSharedStateManagerTest.shouldStartIfTableExistEmpty(JdbcSharedStateManagerTest.java:73)
Caused by: org.apache.derby.iapi.error.StandardException: Startup failed due to an exception. See next exception for details.
        at org.apache.activemq.artemis.core.server.impl.jdbc.JdbcSharedStateManagerTest.shouldStartIfTableExistEmpty(JdbcSharedStateManagerTest.java:73)
Caused by: org.apache.derby.iapi.error.StandardException: Derby system shutdown.
        at org.apache.activemq.artemis.core.server.impl.jdbc.JdbcSharedStateManagerTest.shouldStartIfTableExistEmpty(JdbcSharedStateManagerTest.java:73)

[ERROR] org.apache.activemq.artemis.core.server.impl.jdbc.JdbcSharedStateManagerTest  Time elapsed: 60.334 s  <<< FAILURE!
java.lang.AssertionError: Thread leaked

[INFO] Running org.apache.activemq.artemis.core.server.journal.JournalStorageManagerConstantTest
[INFO] Tests run: 1, Failures: 0, Errors: 0, Skipped: 0, Time elapsed: 0.001 s - in org.apache.activemq.artemis.core.server.journal.JournalStorageManagerConstantTest
[INFO] Running org.apache.activemq.artemis.core.server.management.JMXAccessControlListTest
[INFO] Tests run: 15, Failures: 0, Errors: 0, Skipped: 0, Time elapsed: 0.001 s - in org.apache.activemq.artemis.core.server.management.JMXAccessControlListTest
[INFO] Running org.apache.activemq.artemis.core.server.protocol.websocket.WebSocketFrameEncoderTest
[INFO] Tests run: 4, Failures: 0, Errors: 0, Skipped: 0, Time elapsed: 1.255 s - in org.apache.activemq.artemis.core.server.protocol.websocket.WebSocketFrameEncoderTest
[INFO] Running org.apache.activemq.artemis.core.server.protocol.websocket.WebSocketServerHandlerTest
[INFO] Tests run: 3, Failures: 0, Errors: 0, Skipped: 0, Time elapsed: 0.352 s - in org.apache.activemq.artemis.core.server.protocol.websocket.WebSocketServerHandlerTest
[INFO] Running org.apache.activemq.artemis.core.settings.AddressSettingsTest
[main] 18:25:51,820 INFO  [org.apache.activemq.artemis.tests.util.ActiveMQTestBase] **** start #test testMultipleMergeAll() ***
[main] 18:25:51,827 INFO  [org.apache.activemq.artemis.tests.util.ActiveMQTestBase] **** end #test testMultipleMergeAll() ***
[main] 18:25:51,828 INFO  [org.apache.activemq.artemis.tests.util.ActiveMQTestBase] **** start #test testMultipleMerge() ***
[main] 18:25:51,830 INFO  [org.apache.activemq.artemis.tests.util.ActiveMQTestBase] **** end #test testMultipleMerge() ***
[main] 18:25:51,831 INFO  [org.apache.activemq.artemis.tests.util.ActiveMQTestBase] **** start #test testDefaults() ***
[main] 18:25:51,833 INFO  [org.apache.activemq.artemis.tests.util.ActiveMQTestBase] **** end #test testDefaults() ***
[main] 18:25:51,833 INFO  [org.apache.activemq.artemis.tests.util.ActiveMQTestBase] **** start #test testSingleMerge() ***
[main] 18:25:51,836 INFO  [org.apache.activemq.artemis.tests.util.ActiveMQTestBase] **** end #test testSingleMerge() ***
[INFO] Tests run: 4, Failures: 0, Errors: 0, Skipped: 0, Time elapsed: 0.02 s - in org.apache.activemq.artemis.core.settings.AddressSettingsTest
[INFO] Running org.apache.activemq.artemis.core.settings.RepositoryTest
[main] 18:25:51,841 INFO  [org.apache.activemq.artemis.tests.util.ActiveMQTestBase] **** start #test testMultipleWildcards() ***
[main] 18:25:51,846 INFO  [org.apache.activemq.artemis.tests.util.ActiveMQTestBase] **** end #test testMultipleWildcards() ***
[main] 18:25:51,847 INFO  [org.apache.activemq.artemis.tests.util.ActiveMQTestBase] **** start #test testMatchingDocs() ***
[main] 18:25:51,854 INFO  [org.apache.activemq.artemis.tests.util.ActiveMQTestBase] **** end #test testMatchingDocs() ***
[main] 18:25:51,855 INFO  [org.apache.activemq.artemis.tests.util.ActiveMQTestBase] **** start #test testWithoutWildcard() ***
[main] 18:25:51,858 INFO  [org.apache.activemq.artemis.tests.util.ActiveMQTestBase] **** end #test testWithoutWildcard() ***
[main] 18:25:51,859 INFO  [org.apache.activemq.artemis.tests.util.ActiveMQTestBase] **** start #test testSingletwo() ***
[main] 18:25:51,862 INFO  [org.apache.activemq.artemis.tests.util.ActiveMQTestBase] **** end #test testSingletwo() ***
[main] 18:25:51,862 INFO  [org.apache.activemq.artemis.tests.util.ActiveMQTestBase] **** start #test testIllegalMatches() ***
[main] 18:25:51,866 INFO  [org.apache.activemq.artemis.tests.util.ActiveMQTestBase] **** end #test testIllegalMatches() ***
[main] 18:25:51,866 INFO  [org.apache.activemq.artemis.tests.util.ActiveMQTestBase] **** start #test testAddListener() ***
[main] 18:25:51,870 INFO  [org.apache.activemq.artemis.tests.util.ActiveMQTestBase] **** end #test testAddListener() ***
[main] 18:25:51,871 INFO  [org.apache.activemq.artemis.tests.util.ActiveMQTestBase] **** start #test testCacheWithWildcards() ***
[main] 18:25:51,873 INFO  [org.apache.activemq.artemis.tests.util.ActiveMQTestBase] **** end #test testCacheWithWildcards() ***
[main] 18:25:51,874 INFO  [org.apache.activemq.artemis.tests.util.ActiveMQTestBase] **** start #test testDefault() ***
[main] 18:25:51,876 INFO  [org.apache.activemq.artemis.tests.util.ActiveMQTestBase] **** end #test testDefault() ***
[main] 18:25:51,877 INFO  [org.apache.activemq.artemis.tests.util.ActiveMQTestBase] **** start #test testMatchingDocsCustomUnderscorDelimiter() ***
[main] 18:25:51,879 INFO  [org.apache.activemq.artemis.tests.util.ActiveMQTestBase] **** end #test testMatchingDocsCustomUnderscorDelimiter() ***
[main] 18:25:51,880 INFO  [org.apache.activemq.artemis.tests.util.ActiveMQTestBase] **** start #test testSingleMatch() ***
[main] 18:25:51,883 INFO  [org.apache.activemq.artemis.tests.util.ActiveMQTestBase] **** end #test testSingleMatch() ***
[main] 18:25:51,884 INFO  [org.apache.activemq.artemis.tests.util.ActiveMQTestBase] **** start #test testRepositoryMerge() ***
[main] 18:25:51,891 INFO  [org.apache.activemq.artemis.tests.util.ActiveMQTestBase] **** end #test testRepositoryMerge() ***
[main] 18:25:51,892 INFO  [org.apache.activemq.artemis.tests.util.ActiveMQTestBase] **** start #test testMatchingDocsCustomForwardSlashDelimiter() ***
[main] 18:25:51,895 INFO  [org.apache.activemq.artemis.tests.util.ActiveMQTestBase] **** end #test testMatchingDocsCustomForwardSlashDelimiter() ***
[INFO] Tests run: 12, Failures: 0, Errors: 0, Skipped: 0, Time elapsed: 0.054 s - in org.apache.activemq.artemis.core.settings.RepositoryTest
[INFO] Running org.apache.activemq.artemis.core.transaction.impl.TransactionImplTest
[main] 18:25:51,900 INFO  [org.apache.activemq.artemis.tests.util.ActiveMQTestBase] **** start #test testTimeoutThenRollbackWithRollback() ***
[main] 18:25:51,913 INFO  [org.apache.activemq.artemis.tests.util.ActiveMQTestBase] **** end #test testTimeoutThenRollbackWithRollback() ***
[main] 18:25:51,914 INFO  [org.apache.activemq.artemis.tests.util.ActiveMQTestBase] **** start #test testTimeoutAndThenCommitWithARollback() ***
[main] 18:25:51,918 INFO  [org.apache.activemq.artemis.tests.util.ActiveMQTestBase] **** end #test testTimeoutAndThenCommitWithARollback() ***
[INFO] Tests run: 2, Failures: 0, Errors: 0, Skipped: 0, Time elapsed: 0.015 s - in org.apache.activemq.artemis.core.transaction.impl.TransactionImplTest
[INFO] Running org.apache.activemq.artemis.core.version.impl.VersionImplTest
[INFO] Tests run: 3, Failures: 0, Errors: 0, Skipped: 0, Time elapsed: 0 s - in org.apache.activemq.artemis.core.version.impl.VersionImplTest
[INFO] Running org.apache.activemq.artemis.spi.core.security.jaas.Krb5LoginModuleTest
[INFO] Tests run: 2, Failures: 0, Errors: 0, Skipped: 0, Time elapsed: 0 s - in org.apache.activemq.artemis.spi.core.security.jaas.Krb5LoginModuleTest
[INFO] Running org.apache.activemq.artemis.tests.util.SimpleStringTest
[INFO] Tests run: 20, Failures: 0, Errors: 0, Skipped: 0, Time elapsed: 0.412 s - in org.apache.activemq.artemis.tests.util.SimpleStringTest
[INFO] Running org.apache.activemq.artemis.uri.AcceptorParserTest
[INFO] Tests run: 3, Failures: 0, Errors: 0, Skipped: 0, Time elapsed: 0 s - in org.apache.activemq.artemis.uri.AcceptorParserTest
[INFO] Running org.apache.activemq.artemis.uri.ClusterConnectionConfigurationTest
[INFO] Tests run: 5, Failures: 0, Errors: 0, Skipped: 0, Time elapsed: 0 s - in org.apache.activemq.artemis.uri.ClusterConnectionConfigurationTest
[INFO]
[INFO] Results:
[INFO]
[ERROR] Failures:
[ERROR]   JdbcSharedStateManagerTest>Assert.fail:88 Thread leaked
[ERROR] Errors:
[ERROR]   JdbcSharedStateManagerTest.shouldStartIfTableExistEmpty:73 » SQL Failed to cre...
[ERROR]   JdbcSharedStateManagerTest.shouldStartIfTableExistInitialized:86 » SQL Failed ...
[ERROR]   JdbcSharedStateManagerTest.shouldStartIfTableNotExist:62->createSharedStateManager:52 » IllegalState
[ERROR]   JdbcSharedStateManagerTest.shouldStartTwoIfTableNotExist:98->createSharedStateManager:52 »
[INFO]
[ERROR] Tests run: 366, Failures: 1, Errors: 4, Skipped: 0
[INFO]
[JENKINS] Recording test results
[INFO] ------------------------------------------------------------------------
[INFO] Reactor Summary for ActiveMQ Artemis Parent 2.16.0-SNAPSHOT:
[INFO]
[INFO] ActiveMQ Artemis Parent ............................ SUCCESS [ 36.980 s]
[INFO] ActiveMQ Artemis Commons ........................... SUCCESS [01:08 min]
[INFO] ActiveMQ Artemis Core Client ....................... SUCCESS [ 33.051 s]
[INFO] ActiveMQ Artemis Selector Implementation ........... SUCCESS [ 14.886 s]
[INFO] ActiveMQ Artemis JMS Client ........................ SUCCESS [ 12.405 s]
[INFO] ActiveMQ Artemis Journal ........................... SUCCESS [ 11.013 s]
[INFO] ActiveMQ Artemis JDBC Store ........................ SUCCESS [01:08 min]
[INFO] ActiveMQ Artemis Server ............................ FAILURE [09:30 min]
[INFO] ActiveMQ Artemis Protocols ......................... SKIPPED
[INFO] ActiveMQ Artemis AMQP Protocol ..................... SKIPPED
[INFO] ActiveMQ Artemis STOMP Protocol .................... SKIPPED
[INFO] ActiveMQ Artemis OpenWire Protocol ................. SKIPPED
[INFO] ActiveMQ Artemis HQClient Protocol ................. SKIPPED
[INFO] ActiveMQ Artemis HornetQ Protocol .................. SKIPPED
[INFO] ActiveMQ Artemis Service Extensions ................ SKIPPED
[INFO] ActiveMQ Artemis JMS Server ........................ SKIPPED
[INFO] ActiveMQ Artemis JUnit Rules ....................... SKIPPED
[INFO] ActiveMQ Artemis MQTT Protocol ..................... SKIPPED
[INFO] ActiveMQ Artemis DTO ............................... SKIPPED
[INFO] ActiveMQ Artemis CDI Integration ................... SKIPPED
[INFO] ActiveMQ Artemis Boot .............................. SKIPPED
[INFO] ActiveMQ Artemis Tools ............................. SKIPPED
[INFO] ActiveMQ Artemis CLI ............................... SKIPPED
[INFO] ActiveMQ Artemis Web ............................... SKIPPED
[INFO] ActiveMQ Artemis Web ............................... SKIPPED
[INFO] ActiveMQ Artemis Core Client All ................... SKIPPED
[INFO] ActiveMQ Artemis Client OSGi ....................... SKIPPED
[INFO] ActiveMQ Artemis JMS Client All .................... SKIPPED
[INFO] ActiveMQ Artemis JMS Client OSGi ................... SKIPPED
[INFO] ActiveMQ Artemis RAR POM ........................... SKIPPED
[INFO] ActiveMQ Artemis REST Interface Implementation ..... SKIPPED
[INFO] ActiveMQ Artemis Maven Plugin ...................... SKIPPED
[INFO] ActiveMQ Artemis Server OSGi ....................... SKIPPED
[INFO] ActiveMQ Artemis Cons .............................. SKIPPED
[INFO] ActiveMQ Artemis HawtIO Branding ................... SKIPPED
[INFO] ActiveMQ Artemis HawtIO Plugin ..................... SKIPPED
[INFO] ActiveMQ Artemis Console ........................... SKIPPED
[INFO] ActiveMQ Artemis Spring Integration ................ SKIPPED
[INFO] Apache ActiveMQ Artemis Distribution ............... SKIPPED
[INFO] ActiveMQ Artemis Tests POM ......................... SKIPPED
[INFO] ActiveMQ Artemis Test Support ...................... SKIPPED
[INFO] ActiveMQ Artemis Unit Tests ........................ SKIPPED
[INFO] ActiveMQ Artemis Joram Tests ....................... SKIPPED
[INFO] ActiveMQ Artemis timing Tests ...................... SKIPPED
[INFO] ActiveMQ Artemis JMS Tests ......................... SKIPPED
[INFO] ActiveMQ Artemis Features .......................... SKIPPED
[INFO] ActiveMQ Artemis Integration Tests ................. SKIPPED
[INFO] ActiveMQ Artemis Client Integration Tests .......... SKIPPED
[INFO] ActiveMQ Artemis Compatibility Tests ............... SKIPPED
[INFO] ActiveMQ Artemis soak Tests ........................ SKIPPED
[INFO] ActiveMQ Artemis stress Tests ...................... SKIPPED
[INFO] ActiveMQ Artemis performance Tests ................. SKIPPED
[INFO] Smoke Tests ........................................ SKIPPED
[INFO] ActiveMQ Artemis Extra Tests ....................... SKIPPED
[INFO] ------------------------------------------------------------------------
[INFO] BUILD FAILURE
[INFO] ------------------------------------------------------------------------
[INFO] Total time:  15:37 min
[INFO] Finished at: 2020-09-29T18:27:17Z
[INFO] ------------------------------------------------------------------------
Waiting for Jenkins to finish collecting data
[ERROR] Failed to execute goal org.apache.maven.plugins:maven-surefire-plugin:2.22.2:test (default-test) on project artemis-server: There are test failures.
[ERROR]
[ERROR] Please refer to <https://ci-builds.apache.org/job/ActiveMQ/job/ActiveMQ-Artemis-Master-JDK8/ws/artemis-server/target/surefire-reports> for the individual test results.
[ERROR] Please refer to dump files (if any exist) [date].dump, [date]-jvmRun[N].dump and [date].dumpstream.
[ERROR] -> [Help 1]
[ERROR]
[ERROR] To see the full stack trace of the errors, re-run Maven with the -e switch.
[ERROR] Re-run Maven using the -X switch to enable full debug logging.
[ERROR]
[ERROR] For more information about the errors and possible solutions, please read the following articles:
[ERROR] [Help 1] http://cwiki.apache.org/confluence/display/MAVEN/MojoFailureException
[ERROR]
[ERROR] After correcting the problems, you can resume the build with the command
[ERROR]   mvn <goals> -rf :artemis-server
[JENKINS] Archiving <https://ci-builds.apache.org/job/ActiveMQ/job/ActiveMQ-Artemis-Master-JDK8/ws/artemis-server/pom.xml> to org.apache.activemq/artemis-server/2.16.0-SNAPSHOT/artemis-server-2.16.0-SNAPSHOT.pom
[JENKINS] Archiving <https://ci-builds.apache.org/job/ActiveMQ/job/ActiveMQ-Artemis-Master-JDK8/ws/tests/compatibility-tests/pom.xml> to org.apache.activemq.tests/compatibility-tests/2.16.0-SNAPSHOT/compatibility-tests-2.16.0-SNAPSHOT.pom
[JENKINS] Archiving <https://ci-builds.apache.org/job/ActiveMQ/job/ActiveMQ-Artemis-Master-JDK8/ws/artemis-jms-client/pom.xml> to org.apache.activemq/artemis-jms-client/2.16.0-SNAPSHOT/artemis-jms-client-2.16.0-SNAPSHOT.pom
[JENKINS] Archiving <https://ci-builds.apache.org/job/ActiveMQ/job/ActiveMQ-Artemis-Master-JDK8/ws/artemis-jms-client/target/artemis-jms-client-2.16.0-SNAPSHOT.jar> to org.apache.activemq/artemis-jms-client/2.16.0-SNAPSHOT/artemis-jms-client-2.16.0-SNAPSHOT.jar
[JENKINS] Archiving <https://ci-builds.apache.org/job/ActiveMQ/job/ActiveMQ-Artemis-Master-JDK8/ws/artemis-jms-client/target/artemis-jms-client-2.16.0-SNAPSHOT-sources.jar> to org.apache.activemq/artemis-jms-client/2.16.0-SNAPSHOT/artemis-jms-client-2.16.0-SNAPSHOT-sources.jar
[JENKINS] Archiving <https://ci-builds.apache.org/job/ActiveMQ/job/ActiveMQ-Artemis-Master-JDK8/ws/artemis-hawtio/activemq-branding/pom.xml> to org.apache.activemq/activemq-branding/2.16.0-SNAPSHOT/activemq-branding-2.16.0-SNAPSHOT.pom
[JENKINS] Archiving <https://ci-builds.apache.org/job/ActiveMQ/job/ActiveMQ-Artemis-Master-JDK8/ws/tests/smoke-tests/pom.xml> to org.apache.activemq.tests/smoke-tests/2.16.0-SNAPSHOT/smoke-tests-2.16.0-SNAPSHOT.pom
[JENKINS] Archiving <https://ci-builds.apache.org/job/ActiveMQ/job/ActiveMQ-Artemis-Master-JDK8/ws/tests/joram-tests/pom.xml> to org.apache.activemq.tests/joram-tests/2.16.0-SNAPSHOT/joram-tests-2.16.0-SNAPSHOT.pom
[JENKINS] Archiving <https://ci-builds.apache.org/job/ActiveMQ/job/ActiveMQ-Artemis-Master-JDK8/ws/artemis-jms-server/pom.xml> to org.apache.activemq/artemis-jms-server/2.16.0-SNAPSHOT/artemis-jms-server-2.16.0-SNAPSHOT.pom
[JENKINS] Archiving <https://ci-builds.apache.org/job/ActiveMQ/job/ActiveMQ-Artemis-Master-JDK8/ws/artemis-cli/pom.xml> to org.apache.activemq/artemis-cli/2.16.0-SNAPSHOT/artemis-cli-2.16.0-SNAPSHOT.pom
[JENKINS] Archiving <https://ci-builds.apache.org/job/ActiveMQ/job/ActiveMQ-Artemis-Master-JDK8/ws/artemis-core-client-all/pom.xml> to org.apache.activemq/artemis-core-client-all/2.16.0-SNAPSHOT/artemis-core-client-all-2.16.0-SNAPSHOT.pom
[JENKINS] Archiving <https://ci-builds.apache.org/job/ActiveMQ/job/ActiveMQ-Artemis-Master-JDK8/ws/tests/pom.xml> to org.apache.activemq.tests/artemis-tests-pom/2.16.0-SNAPSHOT/artemis-tests-pom-2.16.0-SNAPSHOT.pom
[JENKINS] Archiving <https://ci-builds.apache.org/job/ActiveMQ/job/ActiveMQ-Artemis-Master-JDK8/ws/artemis-protocols/artemis-openwire-protocol/pom.xml> to org.apache.activemq/artemis-openwire-protocol/2.16.0-SNAPSHOT/artemis-openwire-protocol-2.16.0-SNAPSHOT.pom
[JENKINS] Archiving <https://ci-builds.apache.org/job/ActiveMQ/job/ActiveMQ-Artemis-Master-JDK8/ws/artemis-distribution/pom.xml> to org.apache.activemq/apache-artemis/2.16.0-SNAPSHOT/apache-artemis-2.16.0-SNAPSHOT.pom
[JENKINS] Archiving <https://ci-builds.apache.org/job/ActiveMQ/job/ActiveMQ-Artemis-Master-JDK8/ws/artemis-hawtio/artemis-console/pom.xml> to org.apache.activemq/artemis-console/2.16.0-SNAPSHOT/artemis-console-2.16.0-SNAPSHOT.pom
[JENKINS] Archiving <https://ci-builds.apache.org/job/ActiveMQ/job/ActiveMQ-Artemis-Master-JDK8/ws/tests/artemis-test-support/pom.xml> to org.apache.activemq.tests/artemis-test-support/2.16.0-SNAPSHOT/artemis-test-support-2.16.0-SNAPSHOT.pom
[JENKINS] Archiving <https://ci-builds.apache.org/job/ActiveMQ/job/ActiveMQ-Artemis-Master-JDK8/ws/artemis-selector/pom.xml> to org.apache.activemq/artemis-selector/2.16.0-SNAPSHOT/artemis-selector-2.16.0-SNAPSHOT.pom
[JENKINS] Archiving <https://ci-builds.apache.org/job/ActiveMQ/job/ActiveMQ-Artemis-Master-JDK8/ws/artemis-selector/target/artemis-selector-2.16.0-SNAPSHOT.jar> to org.apache.activemq/artemis-selector/2.16.0-SNAPSHOT/artemis-selector-2.16.0-SNAPSHOT.jar
[JENKINS] Archiving <https://ci-builds.apache.org/job/ActiveMQ/job/ActiveMQ-Artemis-Master-JDK8/ws/artemis-selector/target/artemis-selector-2.16.0-SNAPSHOT-sources.jar> to org.apache.activemq/artemis-selector/2.16.0-SNAPSHOT/artemis-selector-2.16.0-SNAPSHOT-sources.jar
[JENKINS] Archiving <https://ci-builds.apache.org/job/ActiveMQ/job/ActiveMQ-Artemis-Master-JDK8/ws/artemis-jdbc-store/pom.xml> to org.apache.activemq/artemis-jdbc-store/2.16.0-SNAPSHOT/artemis-jdbc-store-2.16.0-SNAPSHOT.pom
[JENKINS] Archiving <https://ci-builds.apache.org/job/ActiveMQ/job/ActiveMQ-Artemis-Master-JDK8/ws/artemis-jdbc-store/target/artemis-jdbc-store-2.16.0-SNAPSHOT.jar> to org.apache.activemq/artemis-jdbc-store/2.16.0-SNAPSHOT/artemis-jdbc-store-2.16.0-SNAPSHOT.jar
[JENKINS] Archiving <https://ci-builds.apache.org/job/ActiveMQ/job/ActiveMQ-Artemis-Master-JDK8/ws/artemis-jdbc-store/target/artemis-jdbc-store-2.16.0-SNAPSHOT-sources.jar> to org.apache.activemq/artemis-jdbc-store/2.16.0-SNAPSHOT/artemis-jdbc-store-2.16.0-SNAPSHOT-sources.jar
[JENKINS] Archiving <https://ci-builds.apache.org/job/ActiveMQ/job/ActiveMQ-Artemis-Master-JDK8/ws/integration/activemq-spring-integration/pom.xml> to org.apache.activemq/artemis-spring-integration/2.16.0-SNAPSHOT/artemis-spring-integration-2.16.0-SNAPSHOT.pom
[JENKINS] Archiving <https://ci-builds.apache.org/job/ActiveMQ/job/ActiveMQ-Artemis-Master-JDK8/ws/artemis-web/pom.xml> to org.apache.activemq/artemis-web/2.16.0-SNAPSHOT/artemis-web-2.16.0-SNAPSHOT.pom
[JENKINS] Archiving <https://ci-builds.apache.org/job/ActiveMQ/job/ActiveMQ-Artemis-Master-JDK8/ws/artemis-cdi-client/pom.xml> to org.apache.activemq/artemis-cdi-client/2.16.0-SNAPSHOT/artemis-cdi-client-2.16.0-SNAPSHOT.pom
[JENKINS] Archiving <https://ci-builds.apache.org/job/ActiveMQ/job/ActiveMQ-Artemis-Master-JDK8/ws/tests/jms-tests/pom.xml> to org.apache.activemq.tests/jms-tests/2.16.0-SNAPSHOT/jms-tests-2.16.0-SNAPSHOT.pom
[JENKINS] Archiving <https://ci-builds.apache.org/job/ActiveMQ/job/ActiveMQ-Artemis-Master-JDK8/ws/artemis-ra/pom.xml> to org.apache.activemq/artemis-ra/2.16.0-SNAPSHOT/artemis-ra-2.16.0-SNAPSHOT.pom
[JENKINS] Archiving <https://ci-builds.apache.org/job/ActiveMQ/job/ActiveMQ-Artemis-Master-JDK8/ws/pom.xml> to org.apache.activemq/artemis-pom/2.16.0-SNAPSHOT/artemis-pom-2.16.0-SNAPSHOT.pom
[Fast Archiver] Compressed 79.58 KB of artifacts by 80.4% relative to #56
[JENKINS] Archiving <https://ci-builds.apache.org/job/ActiveMQ/job/ActiveMQ-Artemis-Master-JDK8/ws/artemis-tools/pom.xml> to org.apache.activemq/artemis-tools/2.16.0-SNAPSHOT/artemis-tools-2.16.0-SNAPSHOT.pom
[JENKINS] Archiving <https://ci-builds.apache.org/job/ActiveMQ/job/ActiveMQ-Artemis-Master-JDK8/ws/tests/karaf-client-integration-tests/pom.xml> to org.apache.activemq.tests/karaf-client-integration-tests/2.16.0-SNAPSHOT/karaf-client-integration-tests-2.16.0-SNAPSHOT.pom
[JENKINS] Archiving <https://ci-builds.apache.org/job/ActiveMQ/job/ActiveMQ-Artemis-Master-JDK8/ws/artemis-maven-plugin/pom.xml> to org.apache.activemq/artemis-maven-plugin/2.16.0-SNAPSHOT/artemis-maven-plugin-2.16.0-SNAPSHOT.pom
[JENKINS] Archiving <https://ci-builds.apache.org/job/ActiveMQ/job/ActiveMQ-Artemis-Master-JDK8/ws/artemis-junit/pom.xml> to org.apache.activemq/artemis-junit/2.16.0-SNAPSHOT/artemis-junit-2.16.0-SNAPSHOT.pom
[JENKINS] Archiving <https://ci-builds.apache.org/job/ActiveMQ/job/ActiveMQ-Artemis-Master-JDK8/ws/artemis-service-extensions/pom.xml> to org.apache.activemq/artemis-service-extensions/2.16.0-SNAPSHOT/artemis-service-extensions-2.16.0-SNAPSHOT.pom
[JENKINS] Archiving <https://ci-builds.apache.org/job/ActiveMQ/job/ActiveMQ-Artemis-Master-JDK8/ws/artemis-server-osgi/pom.xml> to org.apache.activemq/artemis-server-osgi/2.16.0-SNAPSHOT/artemis-server-osgi-2.16.0-SNAPSHOT.pom
[JENKINS] Archiving <https://ci-builds.apache.org/job/ActiveMQ/job/ActiveMQ-Artemis-Master-JDK8/ws/tests/unit-tests/pom.xml> to org.apache.activemq.tests/unit-tests/2.16.0-SNAPSHOT/unit-tests-2.16.0-SNAPSHOT.pom
[JENKINS] Archiving <https://ci-builds.apache.org/job/ActiveMQ/job/ActiveMQ-Artemis-Master-JDK8/ws/artemis-protocols/artemis-stomp-protocol/pom.xml> to org.apache.activemq/artemis-stomp-protocol/2.16.0-SNAPSHOT/artemis-stomp-protocol-2.16.0-SNAPSHOT.pom
[JENKINS] Archiving <https://ci-builds.apache.org/job/ActiveMQ/job/ActiveMQ-Artemis-Master-JDK8/ws/artemis-rest/pom.xml> to org.apache.activemq.rest/artemis-rest/2.16.0-SNAPSHOT/artemis-rest-2.16.0-SNAPSHOT.pom
[JENKINS] Archiving <https://ci-builds.apache.org/job/ActiveMQ/job/ActiveMQ-Artemis-Master-JDK8/ws/artemis-protocols/artemis-hornetq-protocol/pom.xml> to org.apache.activemq/artemis-hornetq-protocol/2.16.0-SNAPSHOT/artemis-hornetq-protocol-2.16.0-SNAPSHOT.pom
[JENKINS] Archiving <https://ci-builds.apache.org/job/ActiveMQ/job/ActiveMQ-Artemis-Master-JDK8/ws/artemis-core-client-osgi/pom.xml> to org.apache.activemq/artemis-core-client-osgi/2.16.0-SNAPSHOT/artemis-core-client-osgi-2.16.0-SNAPSHOT.pom
[JENKINS] Archiving <https://ci-builds.apache.org/job/ActiveMQ/job/ActiveMQ-Artemis-Master-JDK8/ws/tests/performance-tests/pom.xml> to org.apache.activemq.tests/performance-tests/2.16.0-SNAPSHOT/performance-tests-2.16.0-SNAPSHOT.pom
[JENKINS] Archiving <https://ci-builds.apache.org/job/ActiveMQ/job/ActiveMQ-Artemis-Master-JDK8/ws/artemis-features/pom.xml> to org.apache.activemq/artemis-features/2.16.0-SNAPSHOT/artemis-features-2.16.0-SNAPSHOT.pom
[JENKINS] Archiving <https://ci-builds.apache.org/job/ActiveMQ/job/ActiveMQ-Artemis-Master-JDK8/ws/artemis-commons/pom.xml> to org.apache.activemq/artemis-commons/2.16.0-SNAPSHOT/artemis-commons-2.16.0-SNAPSHOT.pom
[JENKINS] Archiving <https://ci-builds.apache.org/job/ActiveMQ/job/ActiveMQ-Artemis-Master-JDK8/ws/artemis-commons/target/artemis-commons-2.16.0-SNAPSHOT.jar> to org.apache.activemq/artemis-commons/2.16.0-SNAPSHOT/artemis-commons-2.16.0-SNAPSHOT.jar
[JENKINS] Archiving <https://ci-builds.apache.org/job/ActiveMQ/job/ActiveMQ-Artemis-Master-JDK8/ws/artemis-commons/target/artemis-commons-2.16.0-SNAPSHOT-tests.jar> to org.apache.activemq/artemis-commons/2.16.0-SNAPSHOT/artemis-commons-2.16.0-SNAPSHOT-tests.jar
[JENKINS] Archiving <https://ci-builds.apache.org/job/ActiveMQ/job/ActiveMQ-Artemis-Master-JDK8/ws/artemis-commons/target/artemis-commons-2.16.0-SNAPSHOT-sources.jar> to org.apache.activemq/artemis-commons/2.16.0-SNAPSHOT/artemis-commons-2.16.0-SNAPSHOT-sources.jar
[JENKINS] Archiving <https://ci-builds.apache.org/job/ActiveMQ/job/ActiveMQ-Artemis-Master-JDK8/ws/artemis-journal/pom.xml> to org.apache.activemq/artemis-journal/2.16.0-SNAPSHOT/artemis-journal-2.16.0-SNAPSHOT.pom
[JENKINS] Archiving <https://ci-builds.apache.org/job/ActiveMQ/job/ActiveMQ-Artemis-Master-JDK8/ws/artemis-journal/target/artemis-journal-2.16.0-SNAPSHOT.jar> to org.apache.activemq/artemis-journal/2.16.0-SNAPSHOT/artemis-journal-2.16.0-SNAPSHOT.jar
[JENKINS] Archiving <https://ci-builds.apache.org/job/ActiveMQ/job/ActiveMQ-Artemis-Master-JDK8/ws/artemis-journal/target/artemis-journal-2.16.0-SNAPSHOT-sources.jar> to org.apache.activemq/artemis-journal/2.16.0-SNAPSHOT/artemis-journal-2.16.0-SNAPSHOT-sources.jar
[JENKINS] Archiving <https://ci-builds.apache.org/job/ActiveMQ/job/ActiveMQ-Artemis-Master-JDK8/ws/tests/soak-tests/pom.xml> to org.apache.activemq.tests/soak-tests/2.16.0-SNAPSHOT/soak-tests-2.16.0-SNAPSHOT.pom
[JENKINS] Archiving <https://ci-builds.apache.org/job/ActiveMQ/job/ActiveMQ-Artemis-Master-JDK8/ws/artemis-core-client/pom.xml> to org.apache.activemq/artemis-core-client/2.16.0-SNAPSHOT/artemis-core-client-2.16.0-SNAPSHOT.pom
[JENKINS] Archiving <https://ci-builds.apache.org/job/ActiveMQ/job/ActiveMQ-Artemis-Master-JDK8/ws/artemis-core-client/target/artemis-core-client-2.16.0-SNAPSHOT.jar> to org.apache.activemq/artemis-core-client/2.16.0-SNAPSHOT/artemis-core-client-2.16.0-SNAPSHOT.jar
[JENKINS] Archiving <https://ci-builds.apache.org/job/ActiveMQ/job/ActiveMQ-Artemis-Master-JDK8/ws/artemis-core-client/target/artemis-core-client-2.16.0-SNAPSHOT-tests.jar> to org.apache.activemq/artemis-core-client/2.16.0-SNAPSHOT/artemis-core-client-2.16.0-SNAPSHOT-tests.jar
[JENKINS] Archiving <https://ci-builds.apache.org/job/ActiveMQ/job/ActiveMQ-Artemis-Master-JDK8/ws/artemis-core-client/target/artemis-core-client-2.16.0-SNAPSHOT-sources.jar> to org.apache.activemq/artemis-core-client/2.16.0-SNAPSHOT/artemis-core-client-2.16.0-SNAPSHOT-sources.jar
[JENKINS] Archiving <https://ci-builds.apache.org/job/ActiveMQ/job/ActiveMQ-Artemis-Master-JDK8/ws/tests/timing-tests/pom.xml> to org.apache.activemq.tests/timing-tests/2.16.0-SNAPSHOT/timing-tests-2.16.0-SNAPSHOT.pom
[JENKINS] Archiving <https://ci-builds.apache.org/job/ActiveMQ/job/ActiveMQ-Artemis-Master-JDK8/ws/tests/extra-tests/pom.xml> to org.apache.activemq.tests/extra-tests/2.16.0-SNAPSHOT/extra-tests-2.16.0-SNAPSHOT.pom
[JENKINS] Archiving <https://ci-builds.apache.org/job/ActiveMQ/job/ActiveMQ-Artemis-Master-JDK8/ws/artemis-jms-client-all/pom.xml> to org.apache.activemq/artemis-jms-client-all/2.16.0-SNAPSHOT/artemis-jms-client-all-2.16.0-SNAPSHOT.pom
[JENKINS] Archiving <https://ci-builds.apache.org/job/ActiveMQ/job/ActiveMQ-Artemis-Master-JDK8/ws/artemis-protocols/pom.xml> to org.apache.activemq/artemis-protocols/2.16.0-SNAPSHOT/artemis-protocols-2.16.0-SNAPSHOT.pom
[JENKINS] Archiving <https://ci-builds.apache.org/job/ActiveMQ/job/ActiveMQ-Artemis-Master-JDK8/ws/artemis-hawtio/artemis-plugin/pom.xml> to org.apache.activemq/artemis-plugin/2.16.0-SNAPSHOT/artemis-plugin-2.16.0-SNAPSHOT.pom
[JENKINS] Archiving <https://ci-builds.apache.org/job/ActiveMQ/job/ActiveMQ-Artemis-Master-JDK8/ws/artemis-dto/pom.xml> to org.apache.activemq/artemis-dto/2.16.0-SNAPSHOT/artemis-dto-2.16.0-SNAPSHOT.pom
[JENKINS] Archiving <https://ci-builds.apache.org/job/ActiveMQ/job/ActiveMQ-Artemis-Master-JDK8/ws/artemis-protocols/artemis-hqclient-protocol/pom.xml> to org.apache.activemq/artemis-hqclient-protocol/2.16.0-SNAPSHOT/artemis-hqclient-protocol-2.16.0-SNAPSHOT.pom
[JENKINS] Archiving <https://ci-builds.apache.org/job/ActiveMQ/job/ActiveMQ-Artemis-Master-JDK8/ws/artemis-jms-client-osgi/pom.xml> to org.apache.activemq/artemis-jms-client-osgi/2.16.0-SNAPSHOT/artemis-jms-client-osgi-2.16.0-SNAPSHOT.pom
[JENKINS] Archiving <https://ci-builds.apache.org/job/ActiveMQ/job/ActiveMQ-Artemis-Master-JDK8/ws/tests/integration-tests/pom.xml> to org.apache.activemq.tests/integration-tests/2.16.0-SNAPSHOT/integration-tests-2.16.0-SNAPSHOT.pom
[JENKINS] Archiving <https://ci-builds.apache.org/job/ActiveMQ/job/ActiveMQ-Artemis-Master-JDK8/ws/artemis-boot/pom.xml> to org.apache.activemq/artemis-boot/2.16.0-SNAPSHOT/artemis-boot-2.16.0-SNAPSHOT.pom
[JENKINS] Archiving <https://ci-builds.apache.org/job/ActiveMQ/job/ActiveMQ-Artemis-Master-JDK8/ws/artemis-website/pom.xml> to org.apache.activemq/artemis-website/2.16.0-SNAPSHOT/artemis-website-2.16.0-SNAPSHOT.pom
[JENKINS] Archiving <https://ci-builds.apache.org/job/ActiveMQ/job/ActiveMQ-Artemis-Master-JDK8/ws/artemis-protocols/artemis-amqp-protocol/pom.xml> to org.apache.activemq/artemis-amqp-protocol/2.16.0-SNAPSHOT/artemis-amqp-protocol-2.16.0-SNAPSHOT.pom
[JENKINS] Archiving <https://ci-builds.apache.org/job/ActiveMQ/job/ActiveMQ-Artemis-Master-JDK8/ws/artemis-protocols/artemis-mqtt-protocol/pom.xml> to org.apache.activemq/artemis-mqtt-protocol/2.16.0-SNAPSHOT/artemis-mqtt-protocol-2.16.0-SNAPSHOT.pom
[JENKINS] Archiving <https://ci-builds.apache.org/job/ActiveMQ/job/ActiveMQ-Artemis-Master-JDK8/ws/artemis-hawtio/pom.xml> to org.apache.activemq/artemis-hawtio-pom/2.16.0-SNAPSHOT/artemis-hawtio-pom-2.16.0-SNAPSHOT.pom
[JENKINS] Archiving <https://ci-builds.apache.org/job/ActiveMQ/job/ActiveMQ-Artemis-Master-JDK8/ws/tests/stress-tests/pom.xml> to org.apache.activemq.tests/stress-tests/2.16.0-SNAPSHOT/stress-tests-2.16.0-SNAPSHOT.pom
channel stopped
Reply | Threaded
Open this post in threaded view
|

Jenkins build is back to normal : ActiveMQ » ActiveMQ-Artemis-Master-JDK8 #58

Apache Jenkins Server-2